{"text_format":"1","workbook":"xlsx","n_sheets":7,"sheets":["Tools","Product-tool","Orders","Tools avail","Tool time needed per product","Sum of needed tool time","Tools loading"],"not_rendered":{"charts":0,"images":0,"macros":0,"external_links":0,"defined_names":3,"comments":1,"pivot_tables":0},"unopened":[],"bounds":{"document_bytes":16777216,"sheet_cells":100000,"rows_first":2000,"rows_last":500,"rows_between":2000,"halvings":0,"cell_chars":16384,"cell_head_chars":4096},"cells_cut":0,"cells_raw":0,"read":"whole","date_system":"1900"}

{"sheet":"Tools","index":0,"n_rows":21,"n_cols":3,"rows_kept":21,"cut":false,"hidden":false,"merged":[]}
["Tools","Availability","Units per hour"]
["Tool 1",0.78498842774067645,1200]
["Tool 2",0.50427083290200625,2600]
["Tool 3",0.64608025109526479,2400]
["Tool 4",0.68685571663355671,2223]
["Tool 5",0.78498842774067645,1200]
["Tool 6",0.6678858026257144,5800]
["Tool 7",0.62062114521721934,6400]
["Tool 8",0.60130401432004454,3920]
["Tool 9",0.79249614380264144,480]
["Tool 10",0.81205632919293158,1550]
["Tool 11",0.62307484850778594,2032]
["Tool 12",0.64521605055512699,4000]
["Tool 13",0.51369984622337794,2400]
["Tool 14",0.66890844995698961,2300]
["Tool 15",0.60366512367183045,4400]
["Tool 16",0.67793981480289245,6800]
["Tool 17",0.70780159146430577,6800]
["Tool 18",0.82415037289220261,2800]
["Tool 19",0.80966821144260115,10168]
{"$rows_left_out":2}
{"sheet":"Product-tool","index":1,"n_rows":652,"n_cols":2,"rows_kept":652,"cut":false,"hidden":false,"merged":[]}
["Product","Main tool"]
["AB0329160","Tool 10"]
["AB0513704","Tool 10"]
["AB0635046","Tool 10"]
["AB0975463","Tool 9"]
["AB1018910","Tool 10"]
["AB1305109","Tool 4"]
["AB2092362","Tool 10"]
["AB2569538","Tool 10"]
["AB2665756","Tool 6"]
["AB3534415","Tool 5"]
["AB3839653","Tool 10"]
["AB4133650","Tool 4"]
["AB4302436","Tool 10"]
["AB4952945","Tool 16"]
["AB5677022","Tool 7"]
["AB617476","Tool 18"]
["AB6803301","Tool 4"]
["AB6883086","Tool 9"]
["AF2334989","Tool 17"]
{"$rows_left_out":633}
{"sheet":"Orders","index":2,"n_rows":493,"n_cols":4,"rows_kept":493,"cut":false,"hidden":false,"merged":[]}
["Product","Week1","Week2","Week3"]
["AB0329160",85,96,85]
["AB0513704",83,97,84]
["AB0635046",2525,2196,2217]
["AB0975463",266,443,326]
["AB1018910",2926,2434,2522]
["AB1305109",41,34,35]
["AB2092362",8846,10782,9111]
["AB2569538",2252,3750,2756]
["AB2665756",166,185,163]
["AB3534415",250,392,295]
["AB3839653",2333,2041,2054]
["AB4133650",266,328,276]
["AB4302436",3658,3968,3554]
["AB4952945",673,684,634]
["AB5677022",13758,11363,11820]
["AB617476",16,25,19]
["AB6803301",258,424,313]
["AB6883086",73,121,90]
["AF2334989",12100,17584,13695]
{"$rows_left_out":474}
{"sheet":"Tools avail","index":3,"n_rows":22,"n_cols":4,"rows_kept":22,"cut":false,"hidden":false,"merged":[]}
["Available time (in hours) per time bucket",{"$f":"6*24","v":144},{"$f":"6*24","v":144},{"$f":"6*24","v":144}]
[{"$f":"Tools!A1","v":"Tools"},{"$f":"Orders!B1","v":"Week1"},{"$f":"Orders!C1","v":"Week2"},{"$f":"Orders!D1","v":"Week3"}]
[{"$f":"Tools!A2","v":"Tool 1"},{"$f":"$B$1*Tools!B2","v":113.03833359465742},{"$f":"$C$1*Tools!B2","v":113.03833359465742},{"$f":"$D$1*Tools!B2","v":113.03833359465742}]
[{"$f":"Tools!A3","v":"Tool 2"},{"$f":"$B$1*Tools!B3","v":72.614999937888896},{"$f":"$C$1*Tools!B3","v":72.614999937888896},{"$f":"$D$1*Tools!B3","v":72.614999937888896}]
[{"$f":"Tools!A4","v":"Tool 3"},{"$f":"$B$1*Tools!B4","v":93.035556157718133},{"$f":"$C$1*Tools!B4","v":93.035556157718133},{"$f":"$D$1*Tools!B4","v":93.035556157718133}]
[{"$f":"Tools!A5","v":"Tool 4"},{"$f":"$B$1*Tools!B5","v":98.907223195232163},{"$f":"$C$1*Tools!B5","v":98.907223195232163},{"$f":"$D$1*Tools!B5","v":98.907223195232163}]
[{"$f":"Tools!A6","v":"Tool 5"},{"$f":"$B$1*Tools!B6","v":113.03833359465742},{"$f":"$C$1*Tools!B6","v":113.03833359465742},{"$f":"$D$1*Tools!B6","v":113.03833359465742}]
[{"$f":"Tools!A7","v":"Tool 6"},{"$f":"$B$1*Tools!B7","v":96.175555578102873},{"$f":"$C$1*Tools!B7","v":96.175555578102873},{"$f":"$D$1*Tools!B7","v":96.175555578102873}]
[{"$f":"Tools!A8","v":"Tool 7"},{"$f":"$B$1*Tools!B8","v":89.369444911279587},{"$f":"$C$1*Tools!B8","v":89.369444911279587},{"$f":"$D$1*Tools!B8","v":89.369444911279587}]
[{"$f":"Tools!A9","v":"Tool 8"},{"$f":"$B$1*Tools!B9","v":86.587778062086414},{"$f":"$C$1*Tools!B9","v":86.587778062086414},{"$f":"$D$1*Tools!B9","v":86.587778062086414}]
[{"$f":"Tools!A10","v":"Tool 9"},{"$f":"$B$1*Tools!B10","v":114.11944470758037},{"$f":"$C$1*Tools!B10","v":114.11944470758037},{"$f":"$D$1*Tools!B10","v":114.11944470758037}]
[{"$f":"Tools!A11","v":"Tool 10"},{"$f":"$B$1*Tools!B11","v":116.93611140378215},{"$f":"$C$1*Tools!B11","v":116.93611140378215},{"$f":"$D$1*Tools!B11","v":116.93611140378215}]
[{"$f":"Tools!A12","v":"Tool 11"},{"$f":"$B$1*Tools!B12","v":89.722778185121172},{"$f":"$C$1*Tools!B12","v":89.722778185121172},{"$f":"$D$1*Tools!B12","v":89.722778185121172}]
[{"$f":"Tools!A13","v":"Tool 12"},{"$f":"$B$1*Tools!B13","v":92.911111279938282},{"$f":"$C$1*Tools!B13","v":92.911111279938282},{"$f":"$D$1*Tools!B13","v":92.911111279938282}]
[{"$f":"Tools!A14","v":"Tool 13"},{"$f":"$B$1*Tools!B14","v":73.972777856166431},{"$f":"$C$1*Tools!B14","v":73.972777856166431},{"$f":"$D$1*Tools!B14","v":73.972777856166431}]
[{"$f":"Tools!A15","v":"Tool 14"},{"$f":"$B$1*Tools!B15","v":96.32281679380651},{"$f":"$C$1*Tools!B15","v":96.32281679380651},{"$f":"$D$1*Tools!B15","v":96.32281679380651}]
[{"$f":"Tools!A16","v":"Tool 15"},{"$f":"$B$1*Tools!B16","v":86.927777808743585},{"$f":"$C$1*Tools!B16","v":86.927777808743585},{"$f":"$D$1*Tools!B16","v":86.927777808743585}]
[{"$f":"Tools!A17","v":"Tool 16"},{"$f":"$B$1*Tools!B17","v":97.623333331616507},{"$f":"$C$1*Tools!B17","v":97.623333331616507},{"$f":"$D$1*Tools!B17","v":97.623333331616507}]
[{"$f":"Tools!A18","v":"Tool 17"},{"$f":"$B$1*Tools!B18","v":101.92342917086003},{"$f":"$C$1*Tools!B18","v":101.92342917086003},{"$f":"$D$1*Tools!B18","v":101.92342917086003}]
[{"$f":"Tools!A19","v":"Tool 18"},{"$f":"$B$1*Tools!B19","v":118.67765369647718},{"$f":"$C$1*Tools!B19","v":118.67765369647718},{"$f":"$D$1*Tools!B19","v":118.67765369647718}]
{"$rows_left_out":3}
{"sheet":"Tool time needed per product","index":4,"n_rows":1500,"n_cols":5,"rows_kept":1500,"cut":false,"hidden":false,"merged":[]}
[{"$f":"Orders!A1","v":"Product"},"Tool",{"$f":"Orders!B1","v":"Week1"},{"$f":"Orders!C1","v":"Week2"},{"$f":"Orders!D1","v":"Week3"}]
[{"$f":"Orders!A2","v":"AB0329160"},{"$f":"VLOOKUP(A2,'Product-tool'!A:B,2,0)","v":"Tool 10"},{"$f":"Orders!B2/VLOOKUP(B2,Tools!A:C,3,0)","v":5.4838709677419356E-2},{"$f":"Orders!C2/VLOOKUP(B2,Tools!A:C,3,0)","v":6.1935483870967742E-2},{"$f":"Orders!D2/VLOOKUP(B2,Tools!A:C,3,0)","v":5.4838709677419356E-2}]
[{"$f":"Orders!A3","v":"AB0513704"},{"$f":"VLOOKUP(A3,'Product-tool'!A:B,2,0)","v":"Tool 10"},{"$f":"Orders!B3/VLOOKUP(B3,Tools!A:C,3,0)","v":5.3548387096774196E-2},{"$f":"Orders!C3/VLOOKUP(B3,Tools!A:C,3,0)","v":6.2580645161290319E-2},{"$f":"Orders!D3/VLOOKUP(B3,Tools!A:C,3,0)","v":5.4193548387096772E-2}]
[{"$f":"Orders!A4","v":"AB0635046"},{"$f":"VLOOKUP(A4,'Product-tool'!A:B,2,0)","v":"Tool 10"},{"$f":"Orders!B4/VLOOKUP(B4,Tools!A:C,3,0)","v":1.6290322580645162},{"$f":"Orders!C4/VLOOKUP(B4,Tools!A:C,3,0)","v":1.4167741935483871},{"$f":"Orders!D4/VLOOKUP(B4,Tools!A:C,3,0)","v":1.4303225806451614}]
[{"$f":"Orders!A5","v":"AB0975463"},{"$f":"VLOOKUP(A5,'Product-tool'!A:B,2,0)","v":"Tool 9"},{"$f":"Orders!B5/VLOOKUP(B5,Tools!A:C,3,0)","v":0.5541666666666667},{"$f":"Orders!C5/VLOOKUP(B5,Tools!A:C,3,0)","v":0.92291666666666672},{"$f":"Orders!D5/VLOOKUP(B5,Tools!A:C,3,0)","v":0.6791666666666667}]
[{"$f":"Orders!A6","v":"AB1018910"},{"$f":"VLOOKUP(A6,'Product-tool'!A:B,2,0)","v":"Tool 10"},{"$f":"Orders!B6/VLOOKUP(B6,Tools!A:C,3,0)","v":1.8877419354838709},{"$f":"Orders!C6/VLOOKUP(B6,Tools!A:C,3,0)","v":1.5703225806451613},{"$f":"Orders!D6/VLOOKUP(B6,Tools!A:C,3,0)","v":1.6270967741935485}]
[{"$f":"Orders!A7","v":"AB1305109"},{"$f":"VLOOKUP(A7,'Product-tool'!A:B,2,0)","v":"Tool 4"},{"$f":"Orders!B7/VLOOKUP(B7,Tools!A:C,3,0)","v":1.8443544759334234E-2},{"$f":"Orders!C7/VLOOKUP(B7,Tools!A:C,3,0)","v":1.5294646873594242E-2},{"$f":"Orders!D7/VLOOKUP(B7,Tools!A:C,3,0)","v":1.5744489428699954E-2}]
[{"$f":"Orders!A8","v":"AB2092362"},{"$f":"VLOOKUP(A8,'Product-tool'!A:B,2,0)","v":"Tool 10"},{"$f":"Orders!B8/VLOOKUP(B8,Tools!A:C,3,0)","v":5.7070967741935483},{"$f":"Orders!C8/VLOOKUP(B8,Tools!A:C,3,0)","v":6.9561290322580644},{"$f":"Orders!D8/VLOOKUP(B8,Tools!A:C,3,0)","v":5.8780645161290321}]
[{"$f":"Orders!A9","v":"AB2569538"},{"$f":"VLOOKUP(A9,'Product-tool'!A:B,2,0)","v":"Tool 10"},{"$f":"Orders!B9/VLOOKUP(B9,Tools!A:C,3,0)","v":1.4529032258064516},{"$f":"Orders!C9/VLOOKUP(B9,Tools!A:C,3,0)","v":2.4193548387096775},{"$f":"Orders!D9/VLOOKUP(B9,Tools!A:C,3,0)","v":1.7780645161290323}]
[{"$f":"Orders!A10","v":"AB2665756"},{"$f":"VLOOKUP(A10,'Product-tool'!A:B,2,0)","v":"Tool 6"},{"$f":"Orders!B10/VLOOKUP(B10,Tools!A:C,3,0)","v":2.8620689655172414E-2},{"$f":"Orders!C10/VLOOKUP(B10,Tools!A:C,3,0)","v":3.1896551724137932E-2},{"$f":"Orders!D10/VLOOKUP(B10,Tools!A:C,3,0)","v":2.8103448275862069E-2}]
[{"$f":"Orders!A11","v":"AB3534415"},{"$f":"VLOOKUP(A11,'Product-tool'!A:B,2,0)","v":"Tool 5"},{"$f":"Orders!B11/VLOOKUP(B11,Tools!A:C,3,0)","v":0.20833333333333334},{"$f":"Orders!C11/VLOOKUP(B11,Tools!A:C,3,0)","v":0.32666666666666666},{"$f":"Orders!D11/VLOOKUP(B11,Tools!A:C,3,0)","v":0.24583333333333332}]
[{"$f":"Orders!A12","v":"AB3839653"},{"$f":"VLOOKUP(A12,'Product-tool'!A:B,2,0)","v":"Tool 10"},{"$f":"Orders!B12/VLOOKUP(B12,Tools!A:C,3,0)","v":1.5051612903225806},{"$f":"Orders!C12/VLOOKUP(B12,Tools!A:C,3,0)","v":1.3167741935483872},{"$f":"Orders!D12/VLOOKUP(B12,Tools!A:C,3,0)","v":1.3251612903225807}]
[{"$f":"Orders!A13","v":"AB4133650"},{"$f":"VLOOKUP(A13,'Product-tool'!A:B,2,0)","v":"Tool 4"},{"$f":"Orders!B13/VLOOKUP(B13,Tools!A:C,3,0)","v":0.11965811965811966},{"$f":"Orders!C13/VLOOKUP(B13,Tools!A:C,3,0)","v":0.14754835807467387},{"$f":"Orders!D13/VLOOKUP(B13,Tools!A:C,3,0)","v":0.12415654520917679}]
[{"$f":"Orders!A14","v":"AB4302436"},{"$f":"VLOOKUP(A14,'Product-tool'!A:B,2,0)","v":"Tool 10"},{"$f":"Orders!B14/VLOOKUP(B14,Tools!A:C,3,0)","v":2.36},{"$f":"Orders!C14/VLOOKUP(B14,Tools!A:C,3,0)","v":2.56},{"$f":"Orders!D14/VLOOKUP(B14,Tools!A:C,3,0)","v":2.2929032258064517}]
[{"$f":"Orders!A15","v":"AB4952945"},{"$f":"VLOOKUP(A15,'Product-tool'!A:B,2,0)","v":"Tool 16"},{"$f":"Orders!B15/VLOOKUP(B15,Tools!A:C,3,0)","v":9.8970588235294116E-2},{"$f":"Orders!C15/VLOOKUP(B15,Tools!A:C,3,0)","v":0.10058823529411764},{"$f":"Orders!D15/VLOOKUP(B15,Tools!A:C,3,0)","v":9.3235294117647055E-2}]
[{"$f":"Orders!A16","v":"AB5677022"},{"$f":"VLOOKUP(A16,'Product-tool'!A:B,2,0)","v":"Tool 7"},{"$f":"Orders!B16/VLOOKUP(B16,Tools!A:C,3,0)","v":2.1496875000000002},{"$f":"Orders!C16/VLOOKUP(B16,Tools!A:C,3,0)","v":1.7754687499999999},{"$f":"Orders!D16/VLOOKUP(B16,Tools!A:C,3,0)","v":1.846875}]
[{"$f":"Orders!A17","v":"AB617476"},{"$f":"VLOOKUP(A17,'Product-tool'!A:B,2,0)","v":"Tool 18"},{"$f":"Orders!B17/VLOOKUP(B17,Tools!A:C,3,0)","v":5.7142857142857143E-3},{"$f":"Orders!C17/VLOOKUP(B17,Tools!A:C,3,0)","v":8.9285714285714281E-3},{"$f":"Orders!D17/VLOOKUP(B17,Tools!A:C,3,0)","v":6.7857142857142855E-3}]
[{"$f":"Orders!A18","v":"AB6803301"},{"$f":"VLOOKUP(A18,'Product-tool'!A:B,2,0)","v":"Tool 4"},{"$f":"Orders!B18/VLOOKUP(B18,Tools!A:C,3,0)","v":0.11605937921727395},{"$f":"Orders!C18/VLOOKUP(B18,Tools!A:C,3,0)","v":0.19073324336482231},{"$f":"Orders!D18/VLOOKUP(B18,Tools!A:C,3,0)","v":0.14080071974808817}]
[{"$f":"Orders!A19","v":"AB6883086"},{"$f":"VLOOKUP(A19,'Product-tool'!A:B,2,0)","v":"Tool 9"},{"$f":"Orders!B19/VLOOKUP(B19,Tools!A:C,3,0)","v":0.15208333333333332},{"$f":"Orders!C19/VLOOKUP(B19,Tools!A:C,3,0)","v":0.25208333333333333},{"$f":"Orders!D19/VLOOKUP(B19,Tools!A:C,3,0)","v":0.1875}]
[{"$f":"Orders!A20","v":"AF2334989"},{"$f":"VLOOKUP(A20,'Product-tool'!A:B,2,0)","v":"Tool 17"},{"$f":"Orders!B20/VLOOKUP(B20,Tools!A:C,3,0)","v":1.7794117647058822},{"$f":"Orders!C20/VLOOKUP(B20,Tools!A:C,3,0)","v":2.5858823529411765},{"$f":"Orders!D20/VLOOKUP(B20,Tools!A:C,3,0)","v":2.0139705882352943}]
{"$rows_left_out":1481}
{"sheet":"Sum of needed tool time","index":5,"n_rows":21,"n_cols":4,"rows_kept":21,"cut":false,"hidden":false,"merged":[]}
[{"$f":"'Tool time needed per product'!B1","v":"Tool"},{"$f":"'Tool time needed per product'!C1","v":"Week1"},{"$f":"'Tool time needed per product'!D1","v":"Week2"},{"$f":"'Tool time needed per product'!E1","v":"Week3"}]
["Tool 1",{"$f":"SUMIF('Tool time needed per product'!B:B,A2,'Tool time needed per product'!C:C)","v":68.244166666666658},{"$f":"SUMIF('Tool time needed per product'!B:B,A2,'Tool time needed per product'!D:D)","v":69.318333333333328},{"$f":"SUMIF('Tool time needed per product'!B:B,A2,'Tool time needed per product'!E:E)","v":64.260833333333338}]
["Tool 2",{"$f":"SUMIF('Tool time needed per product'!B:B,A3,'Tool time needed per product'!C:C)","v":75.066153846153824},{"$f":"SUMIF('Tool time needed per product'!B:B,A3,'Tool time needed per product'!D:D)","v":88.54038461538461},{"$f":"SUMIF('Tool time needed per product'!B:B,A3,'Tool time needed per product'!E:E)","v":76.031923076923078}]
["Tool 3",{"$f":"SUMIF('Tool time needed per product'!B:B,A4,'Tool time needed per product'!C:C)","v":3.7175000000000007},{"$f":"SUMIF('Tool time needed per product'!B:B,A4,'Tool time needed per product'!D:D)","v":4.9474999999999998},{"$f":"SUMIF('Tool time needed per product'!B:B,A4,'Tool time needed per product'!E:E)","v":4.0108333333333333}]
["Tool 4",{"$f":"SUMIF('Tool time needed per product'!B:B,A5,'Tool time needed per product'!C:C)","v":96.226270805218164},{"$f":"SUMIF('Tool time needed per product'!B:B,A5,'Tool time needed per product'!D:D)","v":134.10166441745389},{"$f":"SUMIF('Tool time needed per product'!B:B,A5,'Tool time needed per product'!E:E)","v":89.91947818263607}]
["Tool 5",{"$f":"SUMIF('Tool time needed per product'!B:B,A6,'Tool time needed per product'!C:C)","v":89.605000000000004},{"$f":"SUMIF('Tool time needed per product'!B:B,A6,'Tool time needed per product'!D:D)","v":92.70750000000001},{"$f":"SUMIF('Tool time needed per product'!B:B,A6,'Tool time needed per product'!E:E)","v":85.110833333333318}]
["Tool 6",{"$f":"SUMIF('Tool time needed per product'!B:B,A7,'Tool time needed per product'!C:C)","v":7.8370689655172416},{"$f":"SUMIF('Tool time needed per product'!B:B,A7,'Tool time needed per product'!D:D)","v":11.674655172413793},{"$f":"SUMIF('Tool time needed per product'!B:B,A7,'Tool time needed per product'!E:E)","v":8.9948275862068972}]
["Tool 7",{"$f":"SUMIF('Tool time needed per product'!B:B,A8,'Tool time needed per product'!C:C)","v":9.3139062500000005},{"$f":"SUMIF('Tool time needed per product'!B:B,A8,'Tool time needed per product'!D:D)","v":8.6803124999999994},{"$f":"SUMIF('Tool time needed per product'!B:B,A8,'Tool time needed per product'!E:E)","v":8.4314062499999984}]
["Tool 8",{"$f":"SUMIF('Tool time needed per product'!B:B,A9,'Tool time needed per product'!C:C)","v":157.14285714285714},{"$f":"SUMIF('Tool time needed per product'!B:B,A9,'Tool time needed per product'!D:D)","v":205.55255102040823},{"$f":"SUMIF('Tool time needed per product'!B:B,A9,'Tool time needed per product'!E:E)","v":167.9433673469388}]
["Tool 9",{"$f":"SUMIF('Tool time needed per product'!B:B,A10,'Tool time needed per product'!C:C)","v":88.845833333333331},{"$f":"SUMIF('Tool time needed per product'!B:B,A10,'Tool time needed per product'!D:D)","v":115.00416666666666},{"$f":"SUMIF('Tool time needed per product'!B:B,A10,'Tool time needed per product'!E:E)","v":94.43125000000002}]
["Tool 10",{"$f":"SUMIF('Tool time needed per product'!B:B,A11,'Tool time needed per product'!C:C)","v":80.355483870967745},{"$f":"SUMIF('Tool time needed per product'!B:B,A11,'Tool time needed per product'!D:D)","v":104.60580645161291},{"$f":"SUMIF('Tool time needed per product'!B:B,A11,'Tool time needed per product'!E:E)","v":85.660645161290319}]
["Tool 11",{"$f":"SUMIF('Tool time needed per product'!B:B,A12,'Tool time needed per product'!C:C)","v":89.596948818897616},{"$f":"SUMIF('Tool time needed per product'!B:B,A12,'Tool time needed per product'!D:D)","v":116.04183070866138},{"$f":"SUMIF('Tool time needed per product'!B:B,A12,'Tool time needed per product'!E:E)","v":101.42125984251967}]
["Tool 12",{"$f":"SUMIF('Tool time needed per product'!B:B,A13,'Tool time needed per product'!C:C)","v":11.903749999999999},{"$f":"SUMIF('Tool time needed per product'!B:B,A13,'Tool time needed per product'!D:D)","v":15.058500000000002},{"$f":"SUMIF('Tool time needed per product'!B:B,A13,'Tool time needed per product'!E:E)","v":12.499749999999999}]
["Tool 13",{"$f":"SUMIF('Tool time needed per product'!B:B,A14,'Tool time needed per product'!C:C)","v":10.047083333333333},{"$f":"SUMIF('Tool time needed per product'!B:B,A14,'Tool time needed per product'!D:D)","v":9.0999999999999979},{"$f":"SUMIF('Tool time needed per product'!B:B,A14,'Tool time needed per product'!E:E)","v":8.9812500000000011}]
["Tool 14",{"$f":"SUMIF('Tool time needed per product'!B:B,A15,'Tool time needed per product'!C:C)","v":36.166956521739131},{"$f":"SUMIF('Tool time needed per product'!B:B,A15,'Tool time needed per product'!D:D)","v":47.391304347826079},{"$f":"SUMIF('Tool time needed per product'!B:B,A15,'Tool time needed per product'!E:E)","v":38.69130434782609}]
["Tool 15",{"$f":"SUMIF('Tool time needed per product'!B:B,A16,'Tool time needed per product'!C:C)","v":43.055227272727258},{"$f":"SUMIF('Tool time needed per product'!B:B,A16,'Tool time needed per product'!D:D)","v":51.584545454545456},{"$f":"SUMIF('Tool time needed per product'!B:B,A16,'Tool time needed per product'!E:E)","v":43.957727272727276}]
["Tool 16",{"$f":"SUMIF('Tool time needed per product'!B:B,A17,'Tool time needed per product'!C:C)","v":12.013088235294116},{"$f":"SUMIF('Tool time needed per product'!B:B,A17,'Tool time needed per product'!D:D)","v":14.047941176470589},{"$f":"SUMIF('Tool time needed per product'!B:B,A17,'Tool time needed per product'!E:E)","v":12.115}]
["Tool 17",{"$f":"SUMIF('Tool time needed per product'!B:B,A18,'Tool time needed per product'!C:C)","v":6.1295588235294138},{"$f":"SUMIF('Tool time needed per product'!B:B,A18,'Tool time needed per product'!D:D)","v":7.6916176470588242},{"$f":"SUMIF('Tool time needed per product'!B:B,A18,'Tool time needed per product'!E:E)","v":6.4091176470588236}]
["Tool 18",{"$f":"SUMIF('Tool time needed per product'!B:B,A19,'Tool time needed per product'!C:C)","v":150.13178571428571},{"$f":"SUMIF('Tool time needed per product'!B:B,A19,'Tool time needed per product'!D:D)","v":165.2178571428571},{"$f":"SUMIF('Tool time needed per product'!B:B,A19,'Tool time needed per product'!E:E)","v":146.90142857142851}]
["Tool 19",{"$f":"SUMIF('Tool time needed per product'!B:B,A20,'Tool time needed per product'!C:C)","v":49.354838709677423},{"$f":"SUMIF('Tool time needed per product'!B:B,A20,'Tool time needed per product'!D:D)","v":55.120869394177802},{"$f":"SUMIF('Tool time needed per product'!B:B,A20,'Tool time needed per product'!E:E)","v":48.643292682926827}]
{"$rows_left_out":2}
{"sheet":"Tools loading","index":6,"n_rows":21,"n_cols":4,"rows_kept":21,"cut":false,"hidden":false,"merged":[]}
[{"$f":"'Tool time needed per product'!B1","v":"Tool"},{"$f":"'Tool time needed per product'!C1","v":"Week1"},{"$f":"'Tool time needed per product'!D1","v":"Week2"},{"$f":"'Tool time needed per product'!E1","v":"Week3"}]
["Tool 1",{"$f":"'Sum of needed tool time'!B2/'Tools avail'!B3","v":0.60372587330756722},{"$f":"'Sum of needed tool time'!C2/'Tools avail'!C3","v":0.61322854936893334},{"$f":"'Sum of needed tool time'!D2/'Tools avail'!D3","v":0.56848709008543385}]
["Tool2",{"$f":"'Sum of needed tool time'!B3/'Tools avail'!B4","v":1.0337554762839842},{"$f":"'Sum of needed tool time'!C3/'Tools avail'!C4","v":1.2193126033342623},{"$f":"'Sum of needed tool time'!D3/'Tools avail'!D4","v":1.0470553348751199}]
["Tool 3",{"$f":"'Sum of needed tool time'!B4/'Tools avail'!B5","v":3.9957841426754355E-2},{"$f":"'Sum of needed tool time'!C4/'Tools avail'!C5","v":5.3178593263985774E-2},{"$f":"'Sum of needed tool time'!D4/'Tools avail'!D5","v":4.3110757854061571E-2}]
["Tool 4",{"$f":"'Sum of needed tool time'!B5/'Tools avail'!B6","v":0.97289427098037029},{"$f":"'Sum of needed tool time'!C5/'Tools avail'!C6","v":1.3558328713035619},{"$f":"'Sum of needed tool time'!D5/'Tools avail'!D6","v":0.90912953854891609}]
["Tool 5",{"$f":"'Sum of needed tool time'!B6/'Tools avail'!B7","v":0.79269569136885298},{"$f":"'Sum of needed tool time'!C6/'Tools avail'!C7","v":0.8201421327780587},{"$f":"'Sum of needed tool time'!D6/'Tools avail'!D7","v":0.75293779222304413}]
["Tool 6",{"$f":"'Sum of needed tool time'!B7/'Tools avail'!B8","v":8.1487119241571357E-2},{"$f":"'Sum of needed tool time'!C7/'Tools avail'!C8","v":0.12138900682443121},{"$f":"'Sum of needed tool time'!D7/'Tools avail'!D8","v":9.3525090987411227E-2}]
["Tool 7",{"$f":"'Sum of needed tool time'!B8/'Tools avail'!B9","v":0.10421801611553329},{"$f":"'Sum of needed tool time'!C8/'Tools avail'!C9","v":9.7128414623334325E-2},{"$f":"'Sum of needed tool time'!D8/'Tools avail'!D9","v":9.4343276478556767E-2}]
["Tool 8",{"$f":"'Sum of needed tool time'!B9/'Tools avail'!B10","v":1.8148387758625739},{"$f":"'Sum of needed tool time'!C9/'Tools avail'!C10","v":2.3739210731683169},{"$f":"'Sum of needed tool time'!D9/'Tools avail'!D10","v":1.939573587700999}]
["Tool 9",{"$f":"'Sum of needed tool time'!B10/'Tools avail'!B11","v":0.77853369827545049},{"$f":"'Sum of needed tool time'!C10/'Tools avail'!C11","v":1.0077525960746945},{"$f":"'Sum of needed tool time'!D10/'Tools avail'!D11","v":0.82747730013908349}]
["Tool 10",{"$f":"'Sum of needed tool time'!B11/'Tools avail'!B12","v":0.68717424332248445},{"$f":"'Sum of needed tool time'!C11/'Tools avail'!C12","v":0.89455519938068995},{"$f":"'Sum of needed tool time'!D11/'Tools avail'!D12","v":0.73254227571757391}]
["Tool 11",{"$f":"'Sum of needed tool time'!B12/'Tools avail'!B13","v":0.99859757612538547},{"$f":"'Sum of needed tool time'!C12/'Tools avail'!C13","v":1.2933374674292546},{"$f":"'Sum of needed tool time'!D12/'Tools avail'!D13","v":1.1303847461484253}]
["Tool 12",{"$f":"'Sum of needed tool time'!B13/'Tools avail'!B14","v":0.12811976776528236},{"$f":"'Sum of needed tool time'!C13/'Tools avail'!C14","v":0.16207426423551444},{"$f":"'Sum of needed tool time'!D13/'Tools avail'!D14","v":0.13453450107101445}]
["Tool 13",{"$f":"'Sum of needed tool time'!B14/'Tools avail'!B15","v":0.13582136056684263},{"$f":"'Sum of needed tool time'!C14/'Tools avail'!C15","v":0.12301822729564311},{"$f":"'Sum of needed tool time'!D14/'Tools avail'!D15","v":0.12141290702186759}]
["Tool 14",{"$f":"'Sum of needed tool time'!B15/'Tools avail'!B16","v":0.37547652493551914},{"$f":"'Sum of needed tool time'!C15/'Tools avail'!C16","v":0.49200496751745021},{"$f":"'Sum of needed tool time'!D15/'Tools avail'!D16","v":0.40168368861814591}]
["Tool 15",{"$f":"'Sum of needed tool time'!B16/'Tools avail'!B17","v":0.49529883724229484},{"$f":"'Sum of needed tool time'!C16/'Tools avail'!C17","v":0.59341843027484886},{"$f":"'Sum of needed tool time'!D16/'Tools avail'!D17","v":0.50568101912649854}]
["Tool 16",{"$f":"'Sum of needed tool time'!B17/'Tools avail'!B18","v":0.12305550143926024},{"$f":"'Sum of needed tool time'!C17/'Tools avail'!C18","v":0.14389942134787762},{"$f":"'Sum of needed tool time'!D17/'Tools avail'!D18","v":0.12409942978331401}]
["Tool 17",{"$f":"'Sum of needed tool time'!B18/'Tools avail'!B19","v":6.0138859861691728E-2},{"$f":"'Sum of needed tool time'!C18/'Tools avail'!C19","v":7.5464667050839984E-2},{"$f":"'Sum of needed tool time'!D18/'Tools avail'!D19","v":6.2881691669879516E-2}]
["Tool 18",{"$f":"'Sum of needed tool time'!B19/'Tools avail'!B20","v":1.265038371067343},{"$f":"'Sum of needed tool time'!C19/'Tools avail'!C20","v":1.392156416956206},{"$f":"'Sum of needed tool time'!D19/'Tools avail'!D20","v":1.2378187805021386}]
["Tool 19",{"$f":"'Sum of needed tool time'!B20/'Tools avail'!B21","v":0.42331158694399179},{"$f":"'Sum of needed tool time'!C20/'Tools avail'!C21","v":0.47276626379505832},{"$f":"'Sum of needed tool time'!D20/'Tools avail'!D21","v":0.41720872680621918}]
{"$rows_left_out":1}