{"text_format":"1","workbook":"xlsx","n_sheets":7,"sheets":["Tools","Product-tool","Orders","Tools avail","Tool time needed per product","Sum of needed tool time","Tools loading"],"not_rendered":{"charts":0,"images":0,"macros":0,"external_links":0,"defined_names":3,"comments":1,"pivot_tables":0},"unopened":[],"bounds":{"document_bytes":16777216,"sheet_cells":100000,"rows_first":2000,"rows_last":500,"rows_between":2000,"halvings":0,"cell_chars":16384,"cell_head_chars":4096},"cells_cut":0,"cells_raw":0,"read":"whole","date_system":"1900"}

{"sheet":"Tools","index":0,"n_rows":21,"n_cols":3,"rows_kept":21,"cut":false,"hidden":false,"merged":[]}
["Tools","Availability","Units per hour"]
["Tool 1",0.78498842774067645,1200]
["Tool 2",0.50427083290200625,2600]
["Tool 3",0.64608025109526479,2400]
["Tool 4",0.68685571663355671,2223]
["Tool 5",0.78498842774067645,1200]
["Tool 6",0.6678858026257144,5800]
["Tool 7",0.62062114521721934,6400]
["Tool 8",0.60130401432004454,3920]
["Tool 9",0.79249614380264144,480]
["Tool 10",0.81205632919293158,1550]
["Tool 11",0.62307484850778594,2032]
["Tool 12",0.64521605055512699,4000]
["Tool 13",0.51369984622337794,2400]
["Tool 14",0.66890844995698961,2300]
["Tool 15",0.60366512367183045,4400]
["Tool 16",0.67793981480289245,6800]
["Tool 17",0.70780159146430577,6800]
["Tool 18",0.82415037289220261,2800]
["Tool 19",0.80966821144260115,10168]
["Tool 20",0.80966821144260115,7847.6422349005379]

{"sheet":"Product-tool","index":1,"n_rows":652,"n_cols":2,"rows_kept":652,"cut":false,"hidden":false,"merged":[]}
["Product","Main tool"]
["AB0329160","Tool 10"]
["AB0513704","Tool 10"]
["AB0635046","Tool 10"]
["AB0975463","Tool 9"]
["AB1018910","Tool 10"]
["AB1305109","Tool 4"]
["AB2092362","Tool 10"]
["AB2569538","Tool 10"]
["AB2665756","Tool 6"]
["AB3534415","Tool 5"]
["AB3839653","Tool 10"]
["AB4133650","Tool 4"]
["AB4302436","Tool 10"]
["AB4952945","Tool 16"]
["AB5677022","Tool 7"]
["AB617476","Tool 18"]
["AB6803301","Tool 4"]
["AB6883086","Tool 9"]
["AF2334989","Tool 17"]
["AF2797300","Tool 9"]
["AF4224863","Tool 9"]
["AF4955974","Tool 9"]
["AF5847200","Tool 15"]
["AL1492544","Tool 6"]
["AL2661736","Tool 15"]
["AO0324556","Tool 16"]
["AO0414069","Tool 2"]
["AO2105290","Tool 15"]
["AO4874959","Tool 18"]
["AO5342652","Tool 7"]
["AO5834357","Tool 15"]
["AO8517171","Tool 14"]
["AO855133","Tool 7"]
["AP0171319","Tool 7"]
["AP0202155","Tool 15"]
["AP086256","Tool 7"]
["AP242884","Tool 16"]
["AP3078837","Tool 7"]
["AP352983","Tool 17"]
["AP3728500","Tool 2"]
["AP3951566","Tool 2"]
["AP4223947","Tool 2"]
["AP4745289","Tool 2"]
["AP4972828","Tool 7"]
["AP5614262","Tool 7"]
["AP5647883","Tool 15"]
["AP5897782","Tool 7"]
["AP853615","Tool 13"]
["AS0105077","Tool 12"]
["AS0125536","Tool 5"]
["AS0888075","Tool 13"]
["AS1143091","Tool 5"]
["AS5378181","Tool 13"]
["AS6815735","Tool 6"]
["BC1086722","Tool 6"]
["BC1381899","Tool 6"]
["BC1638233","Tool 6"]
["BC2465775","Tool 6"]
["BC2509115","Tool 6"]
["BC2965316","Tool 6"]
["BC3857293","Tool 15"]
["BC5752252","Tool 6"]
["BC6306450","Tool 5"]
["CC0084549","Tool 12"]
["CC0189122","Tool 20"]
["CC0921636","Tool 20"]
["CC092903","Tool 20"]
["CC2454697","Tool 20"]
["CC2566445","Tool 15"]
["CC2575","Tool 19"]
["CC2936183","Tool 20"]
["CC2965217","Tool 20"]
["CC3609599","Tool 4"]
["CC3979402","Tool 13"]
["CC4329116","Tool 19"]
["CC4618183","Tool 18"]
["CC4774419","Tool 12"]
["CC4941594","Tool 13"]
["CC4945569","Tool 4"]
["CC5387633","Tool 4"]
["CC5505924","Tool 19"]
["CC5603244","Tool 12"]
["CC5605066","Tool 8"]
["CC5646794","Tool 20"]
["CC5671451","Tool 19"]
["CC5798817","Tool 20"]
["CC5805891","Tool 4"]
["CC5803851","Tool 20"]
["CC5835642","Tool 12"]
["CC5844379","Tool 13"]
["CC5859307","Tool 15"]
["CC5877145","Tool 12"]
["CC5872620","Tool 19"]
["CC5949597","Tool 15"]
["CC5951749","Tool 19"]
["CC6069687","Tool 4"]
["CC6146771","Tool 19"]
["CC642531","Tool 19"]
["CC6514546","Tool 15"]
["CL1528731","Tool 15"]
["CL4179003","Tool 8"]
["CM2146129","Tool 8"]
["CM2144500","Tool 8"]
["CM2364748","Tool 4"]
["CM2573429","Tool 8"]
["CM267912","Tool 8"]
["CM2981742","Tool 10"]
["CM350886","Tool 8"]
["CM3509051","Tool 8"]
["CM5648071","Tool 19"]
["CM5946003","Tool 19"]
["CM5947011","Tool 4"]
["CP2759269","Tool 9"]
["CP3651771","Tool 2"]
["CP3782517","Tool 16"]
["CP5891290","Tool 12"]
["CP5915175","Tool 17"]
["CT0314214","Tool 20"]
["CT0686710","Tool 4"]
["CT0911438","Tool 13"]
["CT1153413","Tool 20"]
["CT1195860","Tool 19"]
["CT1344126","Tool 16"]
["CT1427436","Tool 16"]
["CT1422602","Tool 13"]
["CT1693771","Tool 19"]
["CT2356543","Tool 18"]
["CT2727204","Tool 11"]
["CT2748008","Tool 20"]
["CT2882108","Tool 19"]
["CT2899279","Tool 11"]
["CT2921184","Tool 15"]
["CT2976643","Tool 18"]
["CT3251740","Tool 18"]
["CT3327591","Tool 20"]
["CT3389630","Tool 3"]
["CT3513686","Tool 15"]
["CT3676279","Tool 18"]
["CT3847465","Tool 8"]
["CT3866790","Tool 20"]
["CT4394015","Tool 4"]
["CT4485707","Tool 19"]
["CT4625235","Tool 11"]
["CT4696984","Tool 12"]
["CT4766693","Tool 19"]
["CT4972454","Tool 20"]
["CT4983245","Tool 19"]
["CT4998062","Tool 19"]
["CT5306052","Tool 20"]
["CT5312249","Tool 19"]
["CT5387974","Tool 10"]
["CT5424793","Tool 12"]
["CT54540","Tool 15"]
["CT5587547","Tool 19"]
["CT5594793","Tool 18"]
["CT5668919","Tool 20"]
["CT5745169","Tool 12"]
["CT5745914","Tool 12"]
["CT5783436","Tool 20"]
["CT5802839","Tool 19"]
["CT5819298","Tool 20"]
["CT5829315","Tool 18"]
["CT5869387","Tool 19"]
["CT588550","Tool 11"]
["CT5885641","Tool 18"]
["CT593521","Tool 18"]
["CT5932817","Tool 20"]
["CT5982395","Tool 4"]
["CT6358073","Tool 20"]
["CT6438604","Tool 20"]
["CT6445143","Tool 20"]
["CT823663","Tool 7"]
["DA2128864","Tool 5"]
["DA5685201","Tool 1"]
["DP0098702","Tool 17"]
["DP087138","Tool 14"]
["DP1792938","Tool 15"]
["DP2403779","Tool 15"]
["DP2404504","Tool 3"]
["DP4769417","Tool 17"]
["DP4764853","Tool 18"]
["DP5007199","Tool 1"]
["DP5383174","Tool 1"]
["DP5698799","Tool 1"]
["DP5908334","Tool 1"]
["DP638679","Tool 18"]
["FR0061274","Tool 11"]
["FR009628","Tool 11"]
["FR0362571","Tool 11"]
["FR0614261","Tool 11"]
["FR0622263","Tool 11"]
["FR066151","Tool 4"]
["FR0667973","Tool 11"]
["FR0679719","Tool 10"]
["FR0696557","Tool 15"]
["FR0905418","Tool 15"]
["FR0919209","Tool 11"]
["FR0935436","Tool 11"]
["FR1379592","Tool 15"]
["FR141742","Tool 15"]
["FR1415438","Tool 11"]
["FR1452826","Tool 18"]
["FR1615194","Tool 15"]
["FR219333","Tool 19"]
["FR2345868","Tool 15"]
["FR2492515","Tool 19"]
["FR2795111","Tool 11"]
["FR2815273","Tool 11"]
["FR2948803","Tool 11"]
["FR317601","Tool 11"]
["FR3359591","Tool 19"]
["FR3467978","Tool 18"]
["FR3576193","Tool 11"]
["FR3597468","Tool 19"]
["FR3659141","Tool 11"]
["FR378786","Tool 11"]
["FR3966167","Tool 3"]
["FR3998413","Tool 15"]
["FR4374057","Tool 19"]
["FR4526775","Tool 11"]
["FR4539511","Tool 11"]
["FR457233","Tool 18"]
["FR4624850","Tool 11"]
["FR4897160","Tool 15"]
["FR4954051","Tool 19"]
["FR4965335","Tool 11"]
["FR5342502","Tool 11"]
["FR5371365","Tool 15"]
["FR5384444","Tool 11"]
["FR5404360","Tool 19"]
["FR5454864","Tool 11"]
["FR5608301","Tool 11"]
["FR5664727","Tool 11"]
["FR5671746","Tool 15"]
["FR5682241","Tool 11"]
["FR5684287","Tool 11"]
["FR5744950","Tool 11"]
["FR5796610","Tool 11"]
["FR5894727","Tool 11"]
["FR5931113","Tool 17"]
["FR5935871","Tool 11"]
["FR5969812","Tool 11"]
["FR5979463","Tool 11"]
["FR5992952","Tool 11"]
["FR6818423","Tool 14"]
["GF0013491","Tool 14"]
["GF0149565","Tool 14"]
["GF1114780","Tool 17"]
["GF1349895","Tool 14"]
["GF1438930","Tool 14"]
["GF368849","Tool 14"]
["GF3811858","Tool 14"]
["GF4305823","Tool 14"]
["GF498873","Tool 14"]
["GF5598636","Tool 14"]
["GF5747120","Tool 14"]
["GF586901","Tool 14"]
["GF5886834","Tool 14"]
["GF5885097","Tool 14"]
["GF5892823","Tool 14"]
["GF5942175","Tool 14"]
["GF67655","Tool 11"]
["IP453302","Tool 5"]
["IR1385574","Tool 19"]
["IR539559","Tool 5"]
["IR5796915","Tool 12"]
["IR6327281","Tool 12"]
["MC3428427","Tool 13"]
["MC3543546","Tool 11"]
["MC3717873","Tool 12"]
["MC4244977","Tool 11"]
["MC4291921","Tool 10"]
["MC4993575","Tool 19"]
["MC4997628","Tool 19"]
["MC5625753","Tool 5"]
["MC5663542","Tool 5"]
["MC5823622","Tool 19"]
["MC594145","Tool 8"]
["ME8004536","Tool 8"]
["ME8004064","Tool 8"]
["ME8009107","Tool 8"]
["ME8007924","Tool 8"]
["ME8082434","Tool 8"]
["ME8115997","Tool 8"]
["ME8144143","Tool 8"]
["ME81564","Tool 8"]
["ME8164351","Tool 11"]
["ME8183059","Tool 8"]
["ME8182883","Tool 8"]
["ME8186457","Tool 8"]
["ME8183894","Tool 8"]
["ME8203838","Tool 8"]
["ME8216708","Tool 8"]
["ME8212034","Tool 8"]
["ME8219605","Tool 8"]
["ME8227923","Tool 8"]
["ME8254069","Tool 8"]
["ME8294469","Tool 8"]
["ME8314847","Tool 8"]
["ME8808939","Tool 8"]
["ME8804901","Tool 8"]
["ME8809588","Tool 8"]
["ME8846873","Tool 8"]
["ME8876987","Tool 4"]
["MP8004078","Tool 4"]
["MP8026858","Tool 4"]
["MP8061520","Tool 4"]
["MP8104858","Tool 4"]
["MP8109471","Tool 4"]
["MP8189416","Tool 7"]
["MR0869382","Tool 10"]
["MT0524796","Tool 9"]
["MT458935","Tool 9"]
["MT4603768","Tool 15"]
["NU0449734","Tool 15"]
["NU0799419","Tool 15"]
["NU0913559","Tool 15"]
["NU1662490","Tool 15"]
["NU1816428","Tool 10"]
["NU2694528","Tool 15"]
["NU2703355","Tool 2"]
["NU2754771","Tool 5"]
["NU290431","Tool 15"]
["NU3608271","Tool 10"]
["NU3708683","Tool 2"]
["NU3827246","Tool 2"]
["NU3927324","Tool 11"]
["NU4893598","Tool 2"]
["NU5305035","Tool 17"]
["NU5785654","Tool 10"]
["OX5859021","Tool 10"]
["OX5851901","Tool 16"]
["RC146190","Tool 18"]
["RC4928508","Tool 18"]
["RM0095773","Tool 18"]
["RM1193363","Tool 18"]
["RM12722","Tool 18"]
["RM2364622","Tool 18"]
["RM4669200","Tool 18"]
["RM4667709","Tool 18"]
["RM4695168","Tool 18"]
["RM4934415","Tool 18"]
["RM5456028","Tool 18"]
["RM56355","Tool 18"]
["RM5696783","Tool 18"]
["RM5699820","Tool 18"]
["RM5986206","Tool 18"]
["RM6463347","Tool 18"]
["RT2524952","Tool 18"]
["RT2601597","Tool 18"]
["RT2887016","Tool 18"]
["RT3164824","Tool 10"]
["SB0191101","Tool 15"]
["SB0898923","Tool 7"]
["SB1429502","Tool 10"]
["SB2162364","Tool 15"]
["SB3338674","Tool 2"]
["SB4985987","Tool 2"]
["SB585933","Tool 16"]
["SB6619702","Tool 2"]
["SB6782689","Tool 15"]
["SB6851891","Tool 15"]
["SB6883672","Tool 10"]
["SB699340","Tool 10"]
["SL035245","Tool 15"]
["SL04371","Tool 17"]
["SL0454342","Tool 9"]
["SL0979997","Tool 9"]
["SL0973907","Tool 16"]
["SL1205692","Tool 2"]
["SL1739082","Tool 2"]
["SL1814144","Tool 2"]
["SL2223216","Tool 2"]
["SL4542202","Tool 2"]
["SL6923987","Tool 16"]
["SL6949404","Tool 9"]
["SS0108","Tool 9"]
["ST0044507","Tool 2"]
["ST0248243","Tool 2"]
["ST0249290","Tool 9"]
["ST086120","Tool 2"]
["ST0904669","Tool 2"]
["ST1025440","Tool 9"]
["ST1444632","Tool 2"]
["ST1661696","Tool 2"]
["ST269903","Tool 15"]
["ST3078513","Tool 2"]
["ST3795473","Tool 2"]
["ST3859207","Tool 2"]
["ST5444150","Tool 2"]
["ST5622830","Tool 2"]
["ST5775560","Tool 2"]
["ST5866857","Tool 2"]
["ST5905549","Tool 15"]
["UV0008455","Tool 2"]
["UV0002089","Tool 15"]
["UV0122500","Tool 17"]
["UV0167578","Tool 16"]
["UV0185671","Tool 9"]
["UV0432519","Tool 16"]
["UV0436753","Tool 17"]
["UV046672","Tool 2"]
["UV0685993","Tool 17"]
["UV0787788","Tool 2"]
["UV0787562","Tool 2"]
["UV0831317","Tool 16"]
["UV091154","Tool 15"]
["UV0924680","Tool 16"]
["UV1106642","Tool 2"]
["UV1121941","Tool 16"]
["UV1187156","Tool 15"]
["UV120727","Tool 19"]
["UV133670","Tool 16"]
["UV1394884","Tool 15"]
["UV1585237","Tool 9"]
["UV1723988","Tool 18"]
["UV2189115","Tool 2"]
["UV2195087","Tool 7"]
["UV2198207","Tool 9"]
["UV2213161","Tool 2"]
["UV2285856","Tool 9"]
["UV2374219","Tool 18"]
["UV2452537","Tool 2"]
["UV250174","Tool 15"]
["UV251396","Tool 9"]
["UV252791","Tool 15"]
["UV2535805","Tool 2"]
["UV2636450","Tool 15"]
["UV2781330","Tool 17"]
["UV2805946","Tool 3"]
["UV2985514","Tool 2"]
["UV3281153","Tool 11"]
["UV3287428","Tool 9"]
["UV3439245","Tool 18"]
["UV3533088","Tool 16"]
["UV3595016","Tool 2"]
["UV3633599","Tool 2"]
["UV3728968","Tool 15"]
["UV385351","Tool 18"]
["UV3942188","Tool 2"]
["UV4094667","Tool 2"]
["UV4105152","Tool 2"]
["UV4173990","Tool 18"]
["UV4289343","Tool 16"]
["UV4665563","Tool 7"]
["UV4787798","Tool 2"]
["UV4917026","Tool 17"]
["UV4926151","Tool 2"]
["UV495822","Tool 17"]
["UV5313868","Tool 15"]
["UV5311573","Tool 9"]
["UV5362907","Tool 3"]
["UV5366748","Tool 17"]
["UV5379200","Tool 2"]
["UV5416692","Tool 2"]
["UV5473062","Tool 2"]
["UV5494145","Tool 4"]
["UV5555407","Tool 7"]
["UV562824","Tool 3"]
["UV5677822","Tool 2"]
["UV5685234","Tool 9"]
["UV5689814","Tool 3"]
["UV5762734","Tool 9"]
["UV579433","Tool 2"]
["UV5815295","Tool 2"]
["UV5813627","Tool 3"]
["UV588115","Tool 19"]
["UV5924094","Tool 15"]
["UV5928329","Tool 15"]
["UV5947578","Tool 3"]
["UV5956413","Tool 3"]
["UV5951712","Tool 16"]
["UV6238373","Tool 16"]
["UV6241191","Tool 2"]
["UV6252256","Tool 7"]
["UV631601","Tool 17"]
["UV6411805","Tool 2"]
["UV6937295","Tool 2"]
["UV8505006","Tool 2"]
["UV8538779","Tool 2"]
["VE8008533","Tool 2"]
["VE8096041","Tool 2"]
["VE8166035","Tool 2"]
["VE8168353","Tool 2"]
["VE8207633","Tool 17"]
["Z00307730","Tool 19"]
["ZD1446821","Tool 5"]
["ZD1471989","Tool 5"]
["ZD173254","Tool 5"]
["ZD2443045","Tool 2"]
["VE8109961","Tool 10"]
["VE5219409","Tool 3"]
["UV5881465","Tool 10"]
["SB0197426","Tool 11"]
["FR0668280","Tool 13"]
["AS5782773","Tool 13"]
["CC5635362","Tool 2"]
["SL4629457","Tool 2"]
["UV2191719","Tool 19"]
["BC4388435","Tool 15"]
["UV016954","Tool 9"]
["SS0506520","Tool 1"]
["DP4598193","Tool 1"]
["DP5451976","Tool 2"]
["SB4986166","Tool 18"]
["028609203","Tool 17"]
["SL0063652","Tool 18"]
["CT1166012","Tool 8"]
["CM2143928","Tool 18"]
["DP565222","Tool 8"]
["CM2101327","Tool 4"]
["ME8214194","Tool 18"]
["DP5629976","Tool 15"]
["DP4691702","Tool 18"]
["DP4595759","Tool 11"]
["CT5637769","Tool 19"]
["KP9037564","Tool 14"]
["GF5946419","Tool 17"]
["GF533467","Tool 9"]
["UV3432768","Tool 19"]
["BC650618","Tool 11"]
["FR5822641","Tool 8"]
["CM5482424","Tool 11"]
["FR3787807","Tool 15"]
["CT3206813","Tool 1"]
["DP5634203","Tool 1"]
["DP2364788","Tool 9"]
["CP3656765","Tool 2"]
["DA6423154","Tool 17"]
["UV2802570","Tool 19"]
["CM2559364","Tool 19"]
["CC4998399","Tool 2"]
["UV3826095","Tool 11"]
["CM3501010","Tool 19"]
["CC3492021","Tool 8"]
["CM2102732","Tool 11"]
["CC61261","Tool 19"]
["CT5694363","Tool 15"]
["CL1803510","Tool 12"]
["AS578715","Tool 15"]
["UV8601951","Tool 8"]
["CM2319937","Tool 19"]
["ZD3373309","Tool 10"]
["UV5598089","Tool 18"]
["AE0002565","Tool 10"]
["MC5674057","Tool 17"]
["UV5622418","Tool 2"]
["AO5631737","Tool 6"]
["CT344633","Tool 16"]
["UV6764444","Tool 9"]
["UV5774226","Tool 17"]
["FR0035345","Tool 10"]
["UV5361715","Tool 15"]
["UV5549528","Tool 9"]
["UV4237997","Tool 18"]
["028606503","Tool 6"]
["UV2895409","Tool 6"]
["BC5399951","Tool 15"]
["UV2441071","Tool 10"]
["UV0945735","Tool 2"]
["UV038849","Tool 15"]
["UV0002243","Tool 2"]
["ST3179872","Tool 9"]
["SS5379352","Tool 5"]
["CC5547526","Tool 10"]
["SB5405076","Tool 18"]
["RC5428639","Tool 18"]
["RC4279363","Tool 18"]
["RC1122489","Tool 11"]
["FR5551744","Tool 4"]
["CC2858516","Tool 9"]
["UV291762","Tool 11"]
["MC4592186","Tool 11"]
["MC3521226","Tool 18"]
["IP2696227","Tool 14"]
["GF5534806","Tool 14"]
["GF5383871","Tool 14"]
["GF3586031","Tool 14"]
["GF2638799","Tool 14"]
["GF1185949","Tool 11"]
["FR5747037","Tool 11"]
["FR5604839","Tool 11"]
["CM5649049","Tool 10"]
["UV5642948","Tool 11"]
["FR5345389","Tool 15"]
["FR3332551","Tool 11"]
["FR2743900","Tool 15"]
["FR2453609","Tool 11"]
["FR0665960","Tool 17"]
["FR0315090","Tool 18"]
["FR0168451","Tool 18"]
["DP5576599","Tool 1"]
["DP5461743","Tool 1"]
["DP546919","Tool 11"]
["CM5619610","Tool 9"]
["DA5488689","Tool 18"]
["CT5688441","Tool 10"]
["UV5766707","Tool 18"]
["CT5605818","Tool 10"]
["CT5482084","Tool 11"]
["CT4789575","Tool 4"]
["CT4296104","Tool 6"]
["CT5742043","Tool 6"]
["CT3951375","Tool 17"]
["FR5596199","Tool 4"]
["CT3088481","Tool 4"]
["CT2911051","Tool 11"]
["CM5616356","Tool 10"]
["CT1033238","Tool 18"]
["CT0913275","Tool 6"]
["CT0601817","Tool 18"]
["CP5602324","Tool 2"]
["AF5687782","Tool 10"]
["CC5481743","Tool 11"]
["CM5616207","Tool 18"]
["CM3161117","Tool 18"]
["CM258634","Tool 18"]
["CM2581094","Tool 10"]
["CC5474686","Tool 6"]
["CC56681","Tool 6"]
["CT2625676","Tool 11"]
["FR5793488","Tool 10"]
["ST5622066","Tool 6"]
["CT4107816","Tool 12"]
["CC5595349","Tool 6"]
["CC5761362","Tool 11"]
["MC5877286","Tool 10"]
["UV5425654","Tool 11"]
["MC587993","Tool 6"]
["CC4971312","Tool 6"]
["CC095457","Tool 9"]
["AF5365903","Tool 9"]
["UV1316541","Tool 9"]
["UV3573806","Tool 11"]
["FR3663323","Tool 5"]
["CC6465256","Tool 4"]
["CM2361297","Tool 11"]
["FR6531081","Tool 5"]
["CC2128829","Tool 15"]
["FR6582162","Tool 4"]
["CC6588592","Tool 11"]
["FR5835585","Tool 6"]
["UV4382866","Tool 4"]
["MP8006346","Tool 11"]
["FR5931178","Tool 6"]
["FR2544649","Tool 4"]
["MP8066875","Tool 9"]
["LD5898769","Tool 14"]
["UV4653923","Tool 17"]
["AP6595381","Tool 11"]
["FR2494755","Tool 14"]

{"sheet":"Orders","index":2,"n_rows":493,"n_cols":4,"rows_kept":493,"cut":false,"hidden":false,"merged":[]}
["Product","Week1","Week2","Week3"]
["AB0329160",85,96,85]
["AB0513704",83,97,84]
["AB0635046",2525,2196,2217]
["AB0975463",266,443,326]
["AB1018910",2926,2434,2522]
["AB1305109",41,34,35]
["AB2092362",8846,10782,9111]
["AB2569538",2252,3750,2756]
["AB2665756",166,185,163]
["AB3534415",250,392,295]
["AB3839653",2333,2041,2054]
["AB4133650",266,328,276]
["AB4302436",3658,3968,3554]
["AB4952945",673,684,634]
["AB5677022",13758,11363,11820]
["AB617476",16,25,19]
["AB6803301",258,424,313]
["AB6883086",73,121,90]
["AF2334989",12100,17584,13695]
["AF2797300",174,162,158]
["AF4224863",2818,3939,3122]
["AF4955974",5584,7409,6013]
["AF5847200",308,372,316]
["AL1492544",22381,38180,27791]
["AL2661736",289,322,285]
["AO0324556",44,25,33]
["AO0414069",233,196,202]
["AO2105290",2868,1831,2230]
["AO4874959",2171,2998,2389]
["AO5342652",886,557,685]
["AO5834357",2823,2336,2428]
["AO8517171",16,20,17]
["AO855133",1029,999,949]
["AP0171319",1023,1164,1018]
["AP0202155",5520,5859,5308]
["AP086256",8,12,9]
["AP242884",5312,6856,5637]
["AP3078837",657,492,543]
["AP352983",6108,5249,5336]
["AP3728500",1847,1115,1409]
["AP3951566",1000,683,797]
["AP4223947",1448,941,1133]
["AP4745289",66,109,80]
["AP4972828",8,10,8]
["AP5614262",49,37,41]
["AP5647883",5186,5969,5189]
["AP5897782",167,123,137]
["AP853615",501,668,541]
["AS0105077",2073,2321,2046]
["AS0125536",59793,55508,54031]
["AS0888075",4040,2559,3133]
["AS1143091",7650,8932,7708]
["AS5378181",445,719,536]
["AS6815735",11587,14760,12211]
["BC1086722",833,1090,891]
["BC1381899",833,1319,990]
["BC1638233",351,549,415]
["BC2465775",2275,2994,2439]
["BC2509115",6656,8039,6824]
["BC2965316",333,549,405]
["BC3857293",282,300,271]
["BC5752252",40,48,41]
["BC6306450",3683,2516,2936]
["CC0084549",7327,4910,5798]
["CC0189122",3600,4264,3654]
["CC0921636",22854,16919,18784]
["CC092903",8,13,10]
["CC2454697",4468,3385,3706]
["CC2566445",12992,13138,12208]
["CC2575",48191,62385,51220]
["CC2936183",3000,2474,2576]
["CC2965217",22535,26858,22945]
["CC3609599",14520,29495,16520]
["CC3979402",3004,3280,2928]
["CC4329116",90016,68213,74666]
["CC4618183",97882,155147,116396]
["CC4774419",1042,1098,999]
["CC4941594",1333,1058,1127]
["CC4945569",38325,50338,41049]
["CC5387633",11841,9231,9934]
["CC5505924",58,82,65]
["CC5603244",1800,2557,2012]
["CC5605066",342052,508206,391985]
["CC5646794",1666,1262,1382]
["CC5671451",2125,2266,2048]
["CC5798817",6633,4442,5248]
["CC5805891",2333,1462,1802]
["CC5803851",11284,19115,13953]
["CC5835642",8,5,7]
["CC5844379",8521,6188,6951]
["CC5859307",466,447,428]
["CC5877145",1289,1822,1437]
["CC5872620",73202,111170,84936]
["CC5949597",9112,10148,8968]
["CC5951749",99,109,97]
["CC6069687",133,220,163]
["CC6146771",2212,2331,2119]
["CC642531",1066,727,849]
["CC6514546",83,124,95]
["CL1528731",4131,4911,4201]
["CL4179003",1666,2142,1765]
["CM2146129",1278,2044,1528]
["CM2144500",5333,8506,6365]
["CM2364748",1097,969,970]
["CM2573429",24009,17547,19634]
["CM267912",89,118,96]
["CM2981742",12,16,13]
["CM350886",10,5,7]
["CM3509051",7378,9157,7670]
["CM5648071",812,1289,966]
["CM5946003",10073,8478,8723]
["CM5947011",12069,7429,9265]
["CP2759269",6820,7604,6717]
["CP3651771",9753,12883,10478]
["CP3782517",5371,4711,4734]
["CP5891290",133,109,114]
["CP5915175",437,474,425]
["CT0314214",43750,73559,53857]
["CT0686710",1916,2909,2223]
["CT0911438",1416,1503,1362]
["CT1153413",3056,4681,3563]
["CT1195860",1333,2155,1603]
["CT1344126",8333,6528,7005]
["CT1427436",218,255,220]
["CT1422602",4687,5760,4848]
["CT1693771",10749,14208,11552]
["CT2356543",3166,3682,3184]
["CT2727204",5266,3837,4302]
["CT2748008",533,394,438]
["CT2882108",113625,97149,99051]
["CT2899279",1666,1880,1651]
["CT2921184",13416,16587,13920]
["CT2976643",1093,1726,1297]
["CT3251740",5625,6198,5507]
["CT3327591",17116,28330,20875]
["CT3389630",811,1331,985]
["CT3513686",77,87,76]
["CT3676279",39925,41163,37860]
["CT3847465",103379,79661,86325]
["CT3866790",68308,71912,65420]
["CT4394015",24321,36445,22365]
["CT4485707",58,63,56]
["CT4625235",1233,1919,1451]
["CT4696984",6410,7828,6609]
["CT4766693",11965,18145,13872]
["CT4972454",49329,44318,43933]
["CT4983245",12800,12234,11719]
["CT4998062",416,365,367]
["CT5306052",240,232,221]
["CT5312249",8,11,9]
["CT5387974",8,5,6]
["CT5424793",2564,2225,2249]
["CT54540",18214,19254,17478]
["CT5587547",95,79,82]
["CT5594793",1050,1639,1238]
["CT5668919",496,471,453]
["CT5745169",203,265,217]
["CT5745914",1583,1676,1521]
["CT5783436",27,33,28]
["CT5802839",1166,1504,1237]
["CT5819298",201,248,209]
["CT5829315",333,259,279]
["CT5869387",7192,10605,8207]
["CT588550",722,442,553]
["CT5885641",3466,2793,2948]
["CT593521",58177,72333,60538]
["CT5932817",133,142,128]
["CT5982395",275,297,267]
["CT6358073",25,27,24]
["CT6438604",8,12,9]
["CT6445143",4491,6643,5134]
["CT823663",1083,800,889]
["DA2128864",4000,4348,3890]
["DA5685201",133,86,104]
["DP0098702",7779,10028,8249]
["DP087138",30014,43142,33764]
["DP1792938",26060,37150,29182]
["DP2403779",8874,7921,7881]
["DP2404504",583,987,721]
["DP4769417",1641,1362,1413]
["DP4764853",18911,20587,18407]
["DP5007199",40462,39285,37311]
["DP5383174",4916,5230,4732]
["DP5698799",995,646,779]
["DP5908334",35387,37935,34187]
["DP638679",95,62,75]
["FR0061274",72,69,66]
["FR009628",25110,39750,29838]
["FR0362571",13915,17089,14387]
["FR0614261",2283,1534,1809]
["FR0622263",533,783,607]
["FR066151",1372,2349,1707]
["FR0667973",1666,1828,1628]
["FR0679719",108,63,81]
["FR0696557",1852,3161,2301]
["FR0905418",2700,3566,2900]
["FR0919209",3368,2233,2655]
["FR0935436",117,188,141]
["FR1379592",822,700,716]
["FR141742",83,119,93]
["FR1415438",2000,2417,2051]
["FR1452826",8,11,9]
["FR1615194",83,57,66]
["FR219333",143,97,114]
["FR2345868",2166,1305,1651]
["FR2492515",2000,1707,1742]
["FR2795111",166,187,165]
["FR2815273",25229,38692,29437]
["FR2948803",656,703,634]
["FR317601",510,627,528]
["FR3359591",8,11,9]
["FR3467978",2483,2458,2310]
["FR3576193",3572,5600,4221]
["FR3597468",375,637,464]
["FR3659141",151,207,165]
["FR378786",10950,9312,9524]
["FR3966167",8,5,6]
["FR3998413",500,793,595]
["FR4374057",83,100,85]
["FR4526775",83,65,70]
["FR4539511",83,86,79]
["FR457233",341,497,387]
["FR4624850",2916,1898,2283]
["FR4897160",28,33,29]
["FR4954051",16,14,14]
["FR4965335",1300,1849,1454]
["FR5342502",2247,2671,2285]
["FR5371365",225,180,191]
["FR5384444",1458,2152,1665]
["FR5404360",8,13,10]
["FR5454864",458,527,458]
["FR5608301",16,20,17]
["FR5664727",166,172,158]
["FR5671746",990,1531,1161]
["FR5682241",20,25,21]
["FR5684287",431,414,395]
["FR5744950",798,937,806]
["FR5796610",2763,3155,2754]
["FR5894727",350,578,426]
["FR5931113",1445,2010,1596]
["FR5935871",1833,2600,2047]
["FR5969812",15876,28019,32651]
["FR5979463",1866,1627,1641]
["FR5992952",3336,3815,3327]
["FR6818423",2943,3972,3199]
["GF0013491",416,501,426]
["GF0149565",1937,3137,2333]
["GF1114780",17,25,20]
["GF1349895",166,205,173]
["GF1438930",3166,2633,2728]
["GF368849",47,29,37]
["GF3811858",33,29,30]
["GF4305823",854,856,800]
["GF498873",25,36,29]
["GF5598636",135,134,126]
["GF5747120",1066,1159,1037]
["GF586901",500,586,505]
["GF5886834",5083,3397,4018]
["GF5885097",35589,47335,38375]
["GF5892823",1118,1706,1301]
["GF5942175",76,123,92]
["GF67655",7149,10052,7945]
["IP453302",200,303,232]
["IR1385574",133,150,132]
["IR539559",333,519,392]
["IR5796915",2000,2133,1927]
["IR6327281",133,88,105]
["MC3428427",166,105,129]
["MC3543546",2088,1411,1658]
["MC3717873",21050,33197,24958]
["MC4244977",11307,16546,12847]
["MC4291921",416,471,413]
["MC4993575",16,20,17]
["MC4997628",106316,136643,112568]
["MC5625753",18570,18926,17514]
["MC5663542",166,142,145]
["MC5823622",4233,6021,4735]
["MC594145",1012,1223,1038]
["ME8004536",2985,4314,3368]
["ME8004064",5000,4479,4447]
["ME8009107",3433,4130,3513]
["ME8007924",114,135,116]
["ME8082434",693,995,780]
["ME8115997",112,135,115]
["ME8144143",1658,1788,1606]
["ME81564",416,522,435]
["ME8164351",4264,3550,3675]
["ME8183059",12474,16596,13453]
["ME8182883",2681,2288,2335]
["ME8186457",1354,928,1080]
["ME8183894",18754,24301,19943]
["ME8203838",10589,8973,9196]
["ME8216708",3600,5582,4227]
["ME8212034",1133,1201,1089]
["ME8219605",4131,6505,4894]
["ME8227923",112,171,130]
["ME8254069",500,610,515]
["ME8294469",5687,9137,6816]
["ME8314847",384,572,441]
["ME8808939",1987,2632,2138]
["ME8804901",42777,72599,52954]
["ME8809588",635,646,598]
["ME8846873",8585,7918,7736]
["ME8876987",360,264,295]
["MP8004078",15255,10182,12055]
["MP8026858",32331,31887,30030]
["MP8061520",22723,34020,26153]
["MP8104858",32150,76820,22000]
["MP8109471",1900,2705,2126]
["MP8189416",29350,21148,23870]
["MR0869382",208,142,166]
["MT0524796",1762,2717,2063]
["MT458935",2770,3754,3018]
["MT4603768",66,42,51]
["NU0449734",22983,30166,24607]
["NU0799419",66,75,66]
["NU0913559",3060,4418,3451]
["NU1662490",83,88,80]
["NU1816428",11204,12451,11015]
["NU2694528",166,246,190]
["NU2703355",3691,6288,4579]
["NU2754771",3750,5741,4371]
["NU290431",3204,5432,3964]
["NU3608271",975,806,838]
["NU3708683",2089,3427,2535]
["NU3827246",946,1222,1005]
["NU3927324",2637,4235,3160]
["NU4893598",83,96,84]
["NU5305035",97,124,103]
["NU5785654",158,116,130]
["OX5859021",14,24,18]
["OX5851901",33,56,41]
["RC146190",1416,2367,1738]
["RC4928508",67,111,82]
["RM0095773",2185,2674,2255]
["RM1193363",8,11,9]
["RM12722",36,56,42]
["RM2364622",2579,2497,2375]
["RM4669200",16,26,19]
["RM4667709",3375,4320,3566]
["RM4695168",1687,2597,1973]
["RM4934415",225,194,197]
["RM5456028",166,106,129]
["RM56355",121521,75298,93499]
["RM5696783",37,54,42]
["RM5699820",5901,4545,4927]
["RM5986206",1211,1077,1074]
["RM6463347",1323,1850,1466]
["RT2524952",7668,5756,6337]
["RT2601597",616,911,704]
["RT2887016",25130,36856,28589]
["RT3164824",77052,110659,86639]
["SB0191101",76,46,58]
["SB0898923",780,604,653]
["SB1429502",1653,2441,1888]
["SB2162364",54,87,65]
["SB3338674",13,14,13]
["SB4985987",128,129,120]
["SB585933",62,102,76]
["SB6619702",8489,8443,7916]
["SB6782689",2204,2600,2232]
["SB6851891",2562,3968,3007]
["SB6883672",3695,2130,2774]
["SB699340",1857,2510,2020]
["SL035245",750,483,585]
["SL04371",1425,1953,1562]
["SL0454342",16,24,19]
["SL0979997",8994,12130,9771]
["SL0973907",716,1107,840]
["SL1205692",885,1183,957]
["SL1739082",300,403,325]
["SL1814144",1208,1611,1304]
["SL2223216",8,6,7]
["SL4542202",5333,8523,6372]
["SL6923987",8883,9150,8420]
["SL6949404",400,376,363]
["SS0108",1008,1128,994]
["ST0044507",7477,7935,7188]
["ST0248243",308,315,291]
["ST0249290",83,121,94]
["ST086120",2468,3654,2823]
["ST0904669",2000,1738,1756]
["ST1025440",4504,6319,4999]
["ST1444632",5125,8198,6127]
["ST1661696",533,627,539]
["ST269903",3028,4547,3491]
["ST3078513",648,852,694]
["ST3795473",1320,1357,1250]
["ST3859207",733,932,772]
["ST5444150",1690,1200,1367]
["ST5622830",229,243,220]
["ST5775560",111,108,102]
["ST5866857",188,277,214]
["ST5905549",7782,8286,7494]
["UV0008455",1166,1959,1435]
["UV0002089",142,163,142]
["UV0122500",29,42,33]
["UV0167578",1875,2677,2101]
["UV0185671",1750,1528,1539]
["UV0432519",133,219,162]
["UV0436753",585,522,519]
["UV046672",4533,6345,5025]
["UV0685993",300,249,258]
["UV0787788",2899,3409,2932]
["UV0787562",1405,1867,1514]
["UV0831317",1708,1329,1432]
["UV091154",1863,1330,1510]
["UV0924680",7333,10833,8377]
["UV1106642",213,336,253]
["UV1121941",22757,34827,26521]
["UV1187156",511,502,474]
["UV120727",790,993,827]
["UV133670",17066,14703,14926]
["UV1394884",866,899,824]
["UV1585237",558,362,436]
["UV1723988",28,16,21]
["UV2189115",18466,24115,19718]
["UV2195087",6400,10824,7906]
["UV2198207",1416,2005,1580]
["UV2213161",3200,2411,2648]
["UV2285856",333,236,269]
["UV2374219",6483,5165,5487]
["UV2452537",3257,2832,2860]
["UV250174",1691,1831,1642]
["UV251396",1525,2165,1704]
["UV252791",4850,6548,5272]
["UV2535805",7333,9517,7805]
["UV2636450",82,141,103]
["UV2781330",701,870,729]
["UV2805946",266,420,316]
["UV2985514",533,420,450]
["UV3281153",19431,20096,18453]
["UV3287428",1066,1693,1269]
["UV3439245",1400,1986,1563]
["UV3533088",210,154,172]
["UV3595016",1933,3078,2305]
["UV3633599",6665,6712,6251]
["UV3728968",635,841,683]
["UV385351",861,1231,966]
["UV3942188",3279,2370,2670]
["UV4094667",15671,10199,12270]
["UV4105152",66,75,66]
["UV4173990",1688,1328,1421]
["UV4289343",242,264,236]
["UV4665563",3012,5141,3742]
["UV4787798",250,363,283]
["UV4917026",5944,8427,6636]
["UV4926151",800,470,604]
["UV495822",466,595,492]
["UV5313868",9806,13160,10625]
["UV5311573",133,210,158]
["UV5362907",1225,724,927]
["UV5366748",708,581,607]
["UV5379200",3325,2475,2739]
["UV5416692",325,504,382]
["UV5473062",583,672,584]
["UV5494145",425,300,343]
["UV5555407",1366,2251,1662]
["UV562824",2131,3047,2391]
["UV5677822",400,288,325]
["UV5685234",72,64,64]
["UV5689814",8,6,7]
["UV5762734",521,692,561]
["UV579433",412,424,390]
["UV5815295",255,180,206]
["UV5813627",397,664,487]
["UV588115",8,4,6]
["UV5924094",2455,2395,2269]
["UV5928329",308,477,362]
["UV5947578",1538,1991,1635]
["UV5956413",1586,2280,1784]
["UV5951712",666,972,756]
["UV6238373",54,74,59]
["UV6241191",5600,9032,6727]
["UV6252256",33,29,29]
["UV631601",1066,1477,1175]
["UV6411805",16708,17147,15809]
["UV6937295",56,86,66]
["UV8505006",5020,6933,5524]
["UV8538779",1621,1960,1663]
["VE8008533",16,19,17]
["VE8096041",833,538,650]
["VE8166035",4666,5576,4758]
["VE8168353",6333,8002,6646]
["VE8207633",833,731,734]
["Z00307730",450,491,438]
["ZD1446821",781,671,683]
["ZD1471989",1350,2133,1602]
["ZD173254",7000,11118,8334]
["ZD2443045",17000,25183,19449]
["VE8109961",4483,4941,4390]
["VE5219409",369,419,367]

{"sheet":"Tools avail","index":3,"n_rows":22,"n_cols":4,"rows_kept":22,"cut":false,"hidden":false,"merged":[]}
["Available time (in hours) per time bucket",{"$f":"6*24","v":144},{"$f":"6*24","v":144},{"$f":"6*24","v":144}]
[{"$f":"Tools!A1","v":"Tools"},{"$f":"Orders!B1","v":"Week1"},{"$f":"Orders!C1","v":"Week2"},{"$f":"Orders!D1","v":"Week3"}]
[{"$f":"Tools!A2","v":"Tool 1"},{"$f":"$B$1*Tools!B2","v":113.03833359465742},{"$f":"$C$1*Tools!B2","v":113.03833359465742},{"$f":"$D$1*Tools!B2","v":113.03833359465742}]
[{"$f":"Tools!A3","v":"Tool 2"},{"$f":"$B$1*Tools!B3","v":72.614999937888896},{"$f":"$C$1*Tools!B3","v":72.614999937888896},{"$f":"$D$1*Tools!B3","v":72.614999937888896}]
[{"$f":"Tools!A4","v":"Tool 3"},{"$f":"$B$1*Tools!B4","v":93.035556157718133},{"$f":"$C$1*Tools!B4","v":93.035556157718133},{"$f":"$D$1*Tools!B4","v":93.035556157718133}]
[{"$f":"Tools!A5","v":"Tool 4"},{"$f":"$B$1*Tools!B5","v":98.907223195232163},{"$f":"$C$1*Tools!B5","v":98.907223195232163},{"$f":"$D$1*Tools!B5","v":98.907223195232163}]
[{"$f":"Tools!A6","v":"Tool 5"},{"$f":"$B$1*Tools!B6","v":113.03833359465742},{"$f":"$C$1*Tools!B6","v":113.03833359465742},{"$f":"$D$1*Tools!B6","v":113.03833359465742}]
[{"$f":"Tools!A7","v":"Tool 6"},{"$f":"$B$1*Tools!B7","v":96.175555578102873},{"$f":"$C$1*Tools!B7","v":96.175555578102873},{"$f":"$D$1*Tools!B7","v":96.175555578102873}]
[{"$f":"Tools!A8","v":"Tool 7"},{"$f":"$B$1*Tools!B8","v":89.369444911279587},{"$f":"$C$1*Tools!B8","v":89.369444911279587},{"$f":"$D$1*Tools!B8","v":89.369444911279587}]
[{"$f":"Tools!A9","v":"Tool 8"},{"$f":"$B$1*Tools!B9","v":86.587778062086414},{"$f":"$C$1*Tools!B9","v":86.587778062086414},{"$f":"$D$1*Tools!B9","v":86.587778062086414}]
[{"$f":"Tools!A10","v":"Tool 9"},{"$f":"$B$1*Tools!B10","v":114.11944470758037},{"$f":"$C$1*Tools!B10","v":114.11944470758037},{"$f":"$D$1*Tools!B10","v":114.11944470758037}]
[{"$f":"Tools!A11","v":"Tool 10"},{"$f":"$B$1*Tools!B11","v":116.93611140378215},{"$f":"$C$1*Tools!B11","v":116.93611140378215},{"$f":"$D$1*Tools!B11","v":116.93611140378215}]
[{"$f":"Tools!A12","v":"Tool 11"},{"$f":"$B$1*Tools!B12","v":89.722778185121172},{"$f":"$C$1*Tools!B12","v":89.722778185121172},{"$f":"$D$1*Tools!B12","v":89.722778185121172}]
[{"$f":"Tools!A13","v":"Tool 12"},{"$f":"$B$1*Tools!B13","v":92.911111279938282},{"$f":"$C$1*Tools!B13","v":92.911111279938282},{"$f":"$D$1*Tools!B13","v":92.911111279938282}]
[{"$f":"Tools!A14","v":"Tool 13"},{"$f":"$B$1*Tools!B14","v":73.972777856166431},{"$f":"$C$1*Tools!B14","v":73.972777856166431},{"$f":"$D$1*Tools!B14","v":73.972777856166431}]
[{"$f":"Tools!A15","v":"Tool 14"},{"$f":"$B$1*Tools!B15","v":96.32281679380651},{"$f":"$C$1*Tools!B15","v":96.32281679380651},{"$f":"$D$1*Tools!B15","v":96.32281679380651}]
[{"$f":"Tools!A16","v":"Tool 15"},{"$f":"$B$1*Tools!B16","v":86.927777808743585},{"$f":"$C$1*Tools!B16","v":86.927777808743585},{"$f":"$D$1*Tools!B16","v":86.927777808743585}]
[{"$f":"Tools!A17","v":"Tool 16"},{"$f":"$B$1*Tools!B17","v":97.623333331616507},{"$f":"$C$1*Tools!B17","v":97.623333331616507},{"$f":"$D$1*Tools!B17","v":97.623333331616507}]
[{"$f":"Tools!A18","v":"Tool 17"},{"$f":"$B$1*Tools!B18","v":101.92342917086003},{"$f":"$C$1*Tools!B18","v":101.92342917086003},{"$f":"$D$1*Tools!B18","v":101.92342917086003}]
[{"$f":"Tools!A19","v":"Tool 18"},{"$f":"$B$1*Tools!B19","v":118.67765369647718},{"$f":"$C$1*Tools!B19","v":118.67765369647718},{"$f":"$D$1*Tools!B19","v":118.67765369647718}]
[{"$f":"Tools!A20","v":"Tool 19"},{"$f":"$B$1*Tools!B20","v":116.59222244773457},{"$f":"$C$1*Tools!B20","v":116.59222244773457},{"$f":"$D$1*Tools!B20","v":116.59222244773457}]
[{"$f":"Tools!A21","v":"Tool 20"},{"$f":"$B$1*Tools!B21","v":116.59222244773457},{"$f":"$C$1*Tools!B21","v":116.59222244773457},{"$f":"$D$1*Tools!B21","v":116.59222244773457}]

{"sheet":"Tool time needed per product","index":4,"n_rows":1500,"n_cols":5,"rows_kept":1500,"cut":false,"hidden":false,"merged":[]}
[{"$f":"Orders!A1","v":"Product"},"Tool",{"$f":"Orders!B1","v":"Week1"},{"$f":"Orders!C1","v":"Week2"},{"$f":"Orders!D1","v":"Week3"}]
[{"$f":"Orders!A2","v":"AB0329160"},{"$f":"VLOOKUP(A2,'Product-tool'!A:B,2,0)","v":"Tool 10"},{"$f":"Orders!B2/VLOOKUP(B2,Tools!A:C,3,0)","v":5.4838709677419356E-2},{"$f":"Orders!C2/VLOOKUP(B2,Tools!A:C,3,0)","v":6.1935483870967742E-2},{"$f":"Orders!D2/VLOOKUP(B2,Tools!A:C,3,0)","v":5.4838709677419356E-2}]
[{"$f":"Orders!A3","v":"AB0513704"},{"$f":"VLOOKUP(A3,'Product-tool'!A:B,2,0)","v":"Tool 10"},{"$f":"Orders!B3/VLOOKUP(B3,Tools!A:C,3,0)","v":5.3548387096774196E-2},{"$f":"Orders!C3/VLOOKUP(B3,Tools!A:C,3,0)","v":6.2580645161290319E-2},{"$f":"Orders!D3/VLOOKUP(B3,Tools!A:C,3,0)","v":5.4193548387096772E-2}]
[{"$f":"Orders!A4","v":"AB0635046"},{"$f":"VLOOKUP(A4,'Product-tool'!A:B,2,0)","v":"Tool 10"},{"$f":"Orders!B4/VLOOKUP(B4,Tools!A:C,3,0)","v":1.6290322580645162},{"$f":"Orders!C4/VLOOKUP(B4,Tools!A:C,3,0)","v":1.4167741935483871},{"$f":"Orders!D4/VLOOKUP(B4,Tools!A:C,3,0)","v":1.4303225806451614}]
[{"$f":"Orders!A5","v":"AB0975463"},{"$f":"VLOOKUP(A5,'Product-tool'!A:B,2,0)","v":"Tool 9"},{"$f":"Orders!B5/VLOOKUP(B5,Tools!A:C,3,0)","v":0.5541666666666667},{"$f":"Orders!C5/VLOOKUP(B5,Tools!A:C,3,0)","v":0.92291666666666672},{"$f":"Orders!D5/VLOOKUP(B5,Tools!A:C,3,0)","v":0.6791666666666667}]
[{"$f":"Orders!A6","v":"AB1018910"},{"$f":"VLOOKUP(A6,'Product-tool'!A:B,2,0)","v":"Tool 10"},{"$f":"Orders!B6/VLOOKUP(B6,Tools!A:C,3,0)","v":1.8877419354838709},{"$f":"Orders!C6/VLOOKUP(B6,Tools!A:C,3,0)","v":1.5703225806451613},{"$f":"Orders!D6/VLOOKUP(B6,Tools!A:C,3,0)","v":1.6270967741935485}]
[{"$f":"Orders!A7","v":"AB1305109"},{"$f":"VLOOKUP(A7,'Product-tool'!A:B,2,0)","v":"Tool 4"},{"$f":"Orders!B7/VLOOKUP(B7,Tools!A:C,3,0)","v":1.8443544759334234E-2},{"$f":"Orders!C7/VLOOKUP(B7,Tools!A:C,3,0)","v":1.5294646873594242E-2},{"$f":"Orders!D7/VLOOKUP(B7,Tools!A:C,3,0)","v":1.5744489428699954E-2}]
[{"$f":"Orders!A8","v":"AB2092362"},{"$f":"VLOOKUP(A8,'Product-tool'!A:B,2,0)","v":"Tool 10"},{"$f":"Orders!B8/VLOOKUP(B8,Tools!A:C,3,0)","v":5.7070967741935483},{"$f":"Orders!C8/VLOOKUP(B8,Tools!A:C,3,0)","v":6.9561290322580644},{"$f":"Orders!D8/VLOOKUP(B8,Tools!A:C,3,0)","v":5.8780645161290321}]
[{"$f":"Orders!A9","v":"AB2569538"},{"$f":"VLOOKUP(A9,'Product-tool'!A:B,2,0)","v":"Tool 10"},{"$f":"Orders!B9/VLOOKUP(B9,Tools!A:C,3,0)","v":1.4529032258064516},{"$f":"Orders!C9/VLOOKUP(B9,Tools!A:C,3,0)","v":2.4193548387096775},{"$f":"Orders!D9/VLOOKUP(B9,Tools!A:C,3,0)","v":1.7780645161290323}]
[{"$f":"Orders!A10","v":"AB2665756"},{"$f":"VLOOKUP(A10,'Product-tool'!A:B,2,0)","v":"Tool 6"},{"$f":"Orders!B10/VLOOKUP(B10,Tools!A:C,3,0)","v":2.8620689655172414E-2},{"$f":"Orders!C10/VLOOKUP(B10,Tools!A:C,3,0)","v":3.1896551724137932E-2},{"$f":"Orders!D10/VLOOKUP(B10,Tools!A:C,3,0)","v":2.8103448275862069E-2}]
[{"$f":"Orders!A11","v":"AB3534415"},{"$f":"VLOOKUP(A11,'Product-tool'!A:B,2,0)","v":"Tool 5"},{"$f":"Orders!B11/VLOOKUP(B11,Tools!A:C,3,0)","v":0.20833333333333334},{"$f":"Orders!C11/VLOOKUP(B11,Tools!A:C,3,0)","v":0.32666666666666666},{"$f":"Orders!D11/VLOOKUP(B11,Tools!A:C,3,0)","v":0.24583333333333332}]
[{"$f":"Orders!A12","v":"AB3839653"},{"$f":"VLOOKUP(A12,'Product-tool'!A:B,2,0)","v":"Tool 10"},{"$f":"Orders!B12/VLOOKUP(B12,Tools!A:C,3,0)","v":1.5051612903225806},{"$f":"Orders!C12/VLOOKUP(B12,Tools!A:C,3,0)","v":1.3167741935483872},{"$f":"Orders!D12/VLOOKUP(B12,Tools!A:C,3,0)","v":1.3251612903225807}]
[{"$f":"Orders!A13","v":"AB4133650"},{"$f":"VLOOKUP(A13,'Product-tool'!A:B,2,0)","v":"Tool 4"},{"$f":"Orders!B13/VLOOKUP(B13,Tools!A:C,3,0)","v":0.11965811965811966},{"$f":"Orders!C13/VLOOKUP(B13,Tools!A:C,3,0)","v":0.14754835807467387},{"$f":"Orders!D13/VLOOKUP(B13,Tools!A:C,3,0)","v":0.12415654520917679}]
[{"$f":"Orders!A14","v":"AB4302436"},{"$f":"VLOOKUP(A14,'Product-tool'!A:B,2,0)","v":"Tool 10"},{"$f":"Orders!B14/VLOOKUP(B14,Tools!A:C,3,0)","v":2.36},{"$f":"Orders!C14/VLOOKUP(B14,Tools!A:C,3,0)","v":2.56},{"$f":"Orders!D14/VLOOKUP(B14,Tools!A:C,3,0)","v":2.2929032258064517}]
[{"$f":"Orders!A15","v":"AB4952945"},{"$f":"VLOOKUP(A15,'Product-tool'!A:B,2,0)","v":"Tool 16"},{"$f":"Orders!B15/VLOOKUP(B15,Tools!A:C,3,0)","v":9.8970588235294116E-2},{"$f":"Orders!C15/VLOOKUP(B15,Tools!A:C,3,0)","v":0.10058823529411764},{"$f":"Orders!D15/VLOOKUP(B15,Tools!A:C,3,0)","v":9.3235294117647055E-2}]
[{"$f":"Orders!A16","v":"AB5677022"},{"$f":"VLOOKUP(A16,'Product-tool'!A:B,2,0)","v":"Tool 7"},{"$f":"Orders!B16/VLOOKUP(B16,Tools!A:C,3,0)","v":2.1496875000000002},{"$f":"Orders!C16/VLOOKUP(B16,Tools!A:C,3,0)","v":1.7754687499999999},{"$f":"Orders!D16/VLOOKUP(B16,Tools!A:C,3,0)","v":1.846875}]
[{"$f":"Orders!A17","v":"AB617476"},{"$f":"VLOOKUP(A17,'Product-tool'!A:B,2,0)","v":"Tool 18"},{"$f":"Orders!B17/VLOOKUP(B17,Tools!A:C,3,0)","v":5.7142857142857143E-3},{"$f":"Orders!C17/VLOOKUP(B17,Tools!A:C,3,0)","v":8.9285714285714281E-3},{"$f":"Orders!D17/VLOOKUP(B17,Tools!A:C,3,0)","v":6.7857142857142855E-3}]
[{"$f":"Orders!A18","v":"AB6803301"},{"$f":"VLOOKUP(A18,'Product-tool'!A:B,2,0)","v":"Tool 4"},{"$f":"Orders!B18/VLOOKUP(B18,Tools!A:C,3,0)","v":0.11605937921727395},{"$f":"Orders!C18/VLOOKUP(B18,Tools!A:C,3,0)","v":0.19073324336482231},{"$f":"Orders!D18/VLOOKUP(B18,Tools!A:C,3,0)","v":0.14080071974808817}]
[{"$f":"Orders!A19","v":"AB6883086"},{"$f":"VLOOKUP(A19,'Product-tool'!A:B,2,0)","v":"Tool 9"},{"$f":"Orders!B19/VLOOKUP(B19,Tools!A:C,3,0)","v":0.15208333333333332},{"$f":"Orders!C19/VLOOKUP(B19,Tools!A:C,3,0)","v":0.25208333333333333},{"$f":"Orders!D19/VLOOKUP(B19,Tools!A:C,3,0)","v":0.1875}]
[{"$f":"Orders!A20","v":"AF2334989"},{"$f":"VLOOKUP(A20,'Product-tool'!A:B,2,0)","v":"Tool 17"},{"$f":"Orders!B20/VLOOKUP(B20,Tools!A:C,3,0)","v":1.7794117647058822},{"$f":"Orders!C20/VLOOKUP(B20,Tools!A:C,3,0)","v":2.5858823529411765},{"$f":"Orders!D20/VLOOKUP(B20,Tools!A:C,3,0)","v":2.0139705882352943}]
[{"$f":"Orders!A21","v":"AF2797300"},{"$f":"VLOOKUP(A21,'Product-tool'!A:B,2,0)","v":"Tool 9"},{"$f":"Orders!B21/VLOOKUP(B21,Tools!A:C,3,0)","v":0.36249999999999999},{"$f":"Orders!C21/VLOOKUP(B21,Tools!A:C,3,0)","v":0.33750000000000002},{"$f":"Orders!D21/VLOOKUP(B21,Tools!A:C,3,0)","v":0.32916666666666666}]
[{"$f":"Orders!A22","v":"AF4224863"},{"$f":"VLOOKUP(A22,'Product-tool'!A:B,2,0)","v":"Tool 9"},{"$f":"Orders!B22/VLOOKUP(B22,Tools!A:C,3,0)","v":5.8708333333333336},{"$f":"Orders!C22/VLOOKUP(B22,Tools!A:C,3,0)","v":8.2062500000000007},{"$f":"Orders!D22/VLOOKUP(B22,Tools!A:C,3,0)","v":6.5041666666666664}]
[{"$f":"Orders!A23","v":"AF4955974"},{"$f":"VLOOKUP(A23,'Product-tool'!A:B,2,0)","v":"Tool 9"},{"$f":"Orders!B23/VLOOKUP(B23,Tools!A:C,3,0)","v":11.633333333333333},{"$f":"Orders!C23/VLOOKUP(B23,Tools!A:C,3,0)","v":15.435416666666667},{"$f":"Orders!D23/VLOOKUP(B23,Tools!A:C,3,0)","v":12.527083333333334}]
[{"$f":"Orders!A24","v":"AF5847200"},{"$f":"VLOOKUP(A24,'Product-tool'!A:B,2,0)","v":"Tool 15"},{"$f":"Orders!B24/VLOOKUP(B24,Tools!A:C,3,0)","v":7.0000000000000007E-2},{"$f":"Orders!C24/VLOOKUP(B24,Tools!A:C,3,0)","v":8.4545454545454549E-2},{"$f":"Orders!D24/VLOOKUP(B24,Tools!A:C,3,0)","v":7.1818181818181823E-2}]
[{"$f":"Orders!A25","v":"AL1492544"},{"$f":"VLOOKUP(A25,'Product-tool'!A:B,2,0)","v":"Tool 6"},{"$f":"Orders!B25/VLOOKUP(B25,Tools!A:C,3,0)","v":3.8587931034482756},{"$f":"Orders!C25/VLOOKUP(B25,Tools!A:C,3,0)","v":6.5827586206896553},{"$f":"Orders!D25/VLOOKUP(B25,Tools!A:C,3,0)","v":4.7915517241379311}]
[{"$f":"Orders!A26","v":"AL2661736"},{"$f":"VLOOKUP(A26,'Product-tool'!A:B,2,0)","v":"Tool 15"},{"$f":"Orders!B26/VLOOKUP(B26,Tools!A:C,3,0)","v":6.5681818181818188E-2},{"$f":"Orders!C26/VLOOKUP(B26,Tools!A:C,3,0)","v":7.3181818181818181E-2},{"$f":"Orders!D26/VLOOKUP(B26,Tools!A:C,3,0)","v":6.4772727272727273E-2}]
[{"$f":"Orders!A27","v":"AO0324556"},{"$f":"VLOOKUP(A27,'Product-tool'!A:B,2,0)","v":"Tool 16"},{"$f":"Orders!B27/VLOOKUP(B27,Tools!A:C,3,0)","v":6.4705882352941177E-3},{"$f":"Orders!C27/VLOOKUP(B27,Tools!A:C,3,0)","v":3.6764705882352941E-3},{"$f":"Orders!D27/VLOOKUP(B27,Tools!A:C,3,0)","v":4.8529411764705885E-3}]
[{"$f":"Orders!A28","v":"AO0414069"},{"$f":"VLOOKUP(A28,'Product-tool'!A:B,2,0)","v":"Tool 2"},{"$f":"Orders!B28/VLOOKUP(B28,Tools!A:C,3,0)","v":8.9615384615384611E-2},{"$f":"Orders!C28/VLOOKUP(B28,Tools!A:C,3,0)","v":7.5384615384615383E-2},{"$f":"Orders!D28/VLOOKUP(B28,Tools!A:C,3,0)","v":7.7692307692307686E-2}]
[{"$f":"Orders!A29","v":"AO2105290"},{"$f":"VLOOKUP(A29,'Product-tool'!A:B,2,0)","v":"Tool 15"},{"$f":"Orders!B29/VLOOKUP(B29,Tools!A:C,3,0)","v":0.65181818181818185},{"$f":"Orders!C29/VLOOKUP(B29,Tools!A:C,3,0)","v":0.41613636363636364},{"$f":"Orders!D29/VLOOKUP(B29,Tools!A:C,3,0)","v":0.50681818181818183}]
[{"$f":"Orders!A30","v":"AO4874959"},{"$f":"VLOOKUP(A30,'Product-tool'!A:B,2,0)","v":"Tool 18"},{"$f":"Orders!B30/VLOOKUP(B30,Tools!A:C,3,0)","v":0.77535714285714286},{"$f":"Orders!C30/VLOOKUP(B30,Tools!A:C,3,0)","v":1.0707142857142857},{"$f":"Orders!D30/VLOOKUP(B30,Tools!A:C,3,0)","v":0.8532142857142857}]
[{"$f":"Orders!A31","v":"AO5342652"},{"$f":"VLOOKUP(A31,'Product-tool'!A:B,2,0)","v":"Tool 7"},{"$f":"Orders!B31/VLOOKUP(B31,Tools!A:C,3,0)","v":0.13843749999999999},{"$f":"Orders!C31/VLOOKUP(B31,Tools!A:C,3,0)","v":8.7031250000000004E-2},{"$f":"Orders!D31/VLOOKUP(B31,Tools!A:C,3,0)","v":0.10703124999999999}]
[{"$f":"Orders!A32","v":"AO5834357"},{"$f":"VLOOKUP(A32,'Product-tool'!A:B,2,0)","v":"Tool 15"},{"$f":"Orders!B32/VLOOKUP(B32,Tools!A:C,3,0)","v":0.6415909090909091},{"$f":"Orders!C32/VLOOKUP(B32,Tools!A:C,3,0)","v":0.53090909090909089},{"$f":"Orders!D32/VLOOKUP(B32,Tools!A:C,3,0)","v":0.55181818181818176}]
[{"$f":"Orders!A33","v":"AO8517171"},{"$f":"VLOOKUP(A33,'Product-tool'!A:B,2,0)","v":"Tool 14"},{"$f":"Orders!B33/VLOOKUP(B33,Tools!A:C,3,0)","v":6.956521739130435E-3},{"$f":"Orders!C33/VLOOKUP(B33,Tools!A:C,3,0)","v":8.6956521739130436E-3},{"$f":"Orders!D33/VLOOKUP(B33,Tools!A:C,3,0)","v":7.391304347826087E-3}]
[{"$f":"Orders!A34","v":"AO855133"},{"$f":"VLOOKUP(A34,'Product-tool'!A:B,2,0)","v":"Tool 7"},{"$f":"Orders!B34/VLOOKUP(B34,Tools!A:C,3,0)","v":0.16078124999999999},{"$f":"Orders!C34/VLOOKUP(B34,Tools!A:C,3,0)","v":0.15609375},{"$f":"Orders!D34/VLOOKUP(B34,Tools!A:C,3,0)","v":0.14828125}]
[{"$f":"Orders!A35","v":"AP0171319"},{"$f":"VLOOKUP(A35,'Product-tool'!A:B,2,0)","v":"Tool 7"},{"$f":"Orders!B35/VLOOKUP(B35,Tools!A:C,3,0)","v":0.15984375000000001},{"$f":"Orders!C35/VLOOKUP(B35,Tools!A:C,3,0)","v":0.18187500000000001},{"$f":"Orders!D35/VLOOKUP(B35,Tools!A:C,3,0)","v":0.1590625}]
[{"$f":"Orders!A36","v":"AP0202155"},{"$f":"VLOOKUP(A36,'Product-tool'!A:B,2,0)","v":"Tool 15"},{"$f":"Orders!B36/VLOOKUP(B36,Tools!A:C,3,0)","v":1.2545454545454546},{"$f":"Orders!C36/VLOOKUP(B36,Tools!A:C,3,0)","v":1.331590909090909},{"$f":"Orders!D36/VLOOKUP(B36,Tools!A:C,3,0)","v":1.2063636363636363}]
[{"$f":"Orders!A37","v":"AP086256"},{"$f":"VLOOKUP(A37,'Product-tool'!A:B,2,0)","v":"Tool 7"},{"$f":"Orders!B37/VLOOKUP(B37,Tools!A:C,3,0)","v":1.25E-3},{"$f":"Orders!C37/VLOOKUP(B37,Tools!A:C,3,0)","v":1.8749999999999999E-3},{"$f":"Orders!D37/VLOOKUP(B37,Tools!A:C,3,0)","v":1.4062499999999999E-3}]
[{"$f":"Orders!A38","v":"AP242884"},{"$f":"VLOOKUP(A38,'Product-tool'!A:B,2,0)","v":"Tool 16"},{"$f":"Orders!B38/VLOOKUP(B38,Tools!A:C,3,0)","v":0.78117647058823525},{"$f":"Orders!C38/VLOOKUP(B38,Tools!A:C,3,0)","v":1.0082352941176471},{"$f":"Orders!D38/VLOOKUP(B38,Tools!A:C,3,0)","v":0.82897058823529413}]
[{"$f":"Orders!A39","v":"AP3078837"},{"$f":"VLOOKUP(A39,'Product-tool'!A:B,2,0)","v":"Tool 7"},{"$f":"Orders!B39/VLOOKUP(B39,Tools!A:C,3,0)","v":0.10265625},{"$f":"Orders!C39/VLOOKUP(B39,Tools!A:C,3,0)","v":7.6874999999999999E-2},{"$f":"Orders!D39/VLOOKUP(B39,Tools!A:C,3,0)","v":8.4843749999999996E-2}]
[{"$f":"Orders!A40","v":"AP352983"},{"$f":"VLOOKUP(A40,'Product-tool'!A:B,2,0)","v":"Tool 17"},{"$f":"Orders!B40/VLOOKUP(B40,Tools!A:C,3,0)","v":0.89823529411764702},{"$f":"Orders!C40/VLOOKUP(B40,Tools!A:C,3,0)","v":0.77191176470588241},{"$f":"Orders!D40/VLOOKUP(B40,Tools!A:C,3,0)","v":0.78470588235294114}]
[{"$f":"Orders!A41","v":"AP3728500"},{"$f":"VLOOKUP(A41,'Product-tool'!A:B,2,0)","v":"Tool 2"},{"$f":"Orders!B41/VLOOKUP(B41,Tools!A:C,3,0)","v":0.71038461538461539},{"$f":"Orders!C41/VLOOKUP(B41,Tools!A:C,3,0)","v":0.42884615384615382},{"$f":"Orders!D41/VLOOKUP(B41,Tools!A:C,3,0)","v":0.54192307692307695}]
[{"$f":"Orders!A42","v":"AP3951566"},{"$f":"VLOOKUP(A42,'Product-tool'!A:B,2,0)","v":"Tool 2"},{"$f":"Orders!B42/VLOOKUP(B42,Tools!A:C,3,0)","v":0.38461538461538464},{"$f":"Orders!C42/VLOOKUP(B42,Tools!A:C,3,0)","v":0.26269230769230767},{"$f":"Orders!D42/VLOOKUP(B42,Tools!A:C,3,0)","v":0.30653846153846154}]
[{"$f":"Orders!A43","v":"AP4223947"},{"$f":"VLOOKUP(A43,'Product-tool'!A:B,2,0)","v":"Tool 2"},{"$f":"Orders!B43/VLOOKUP(B43,Tools!A:C,3,0)","v":0.55692307692307697},{"$f":"Orders!C43/VLOOKUP(B43,Tools!A:C,3,0)","v":0.3619230769230769},{"$f":"Orders!D43/VLOOKUP(B43,Tools!A:C,3,0)","v":0.43576923076923074}]
[{"$f":"Orders!A44","v":"AP4745289"},{"$f":"VLOOKUP(A44,'Product-tool'!A:B,2,0)","v":"Tool 2"},{"$f":"Orders!B44/VLOOKUP(B44,Tools!A:C,3,0)","v":2.5384615384615384E-2},{"$f":"Orders!C44/VLOOKUP(B44,Tools!A:C,3,0)","v":4.1923076923076924E-2},{"$f":"Orders!D44/VLOOKUP(B44,Tools!A:C,3,0)","v":3.0769230769230771E-2}]
[{"$f":"Orders!A45","v":"AP4972828"},{"$f":"VLOOKUP(A45,'Product-tool'!A:B,2,0)","v":"Tool 7"},{"$f":"Orders!B45/VLOOKUP(B45,Tools!A:C,3,0)","v":1.25E-3},{"$f":"Orders!C45/VLOOKUP(B45,Tools!A:C,3,0)","v":1.5625000000000001E-3},{"$f":"Orders!D45/VLOOKUP(B45,Tools!A:C,3,0)","v":1.25E-3}]
[{"$f":"Orders!A46","v":"AP5614262"},{"$f":"VLOOKUP(A46,'Product-tool'!A:B,2,0)","v":"Tool 7"},{"$f":"Orders!B46/VLOOKUP(B46,Tools!A:C,3,0)","v":7.6562499999999999E-3},{"$f":"Orders!C46/VLOOKUP(B46,Tools!A:C,3,0)","v":5.7812499999999999E-3},{"$f":"Orders!D46/VLOOKUP(B46,Tools!A:C,3,0)","v":6.4062499999999996E-3}]
[{"$f":"Orders!A47","v":"AP5647883"},{"$f":"VLOOKUP(A47,'Product-tool'!A:B,2,0)","v":"Tool 15"},{"$f":"Orders!B47/VLOOKUP(B47,Tools!A:C,3,0)","v":1.1786363636363637},{"$f":"Orders!C47/VLOOKUP(B47,Tools!A:C,3,0)","v":1.3565909090909092},{"$f":"Orders!D47/VLOOKUP(B47,Tools!A:C,3,0)","v":1.1793181818181817}]
[{"$f":"Orders!A48","v":"AP5897782"},{"$f":"VLOOKUP(A48,'Product-tool'!A:B,2,0)","v":"Tool 7"},{"$f":"Orders!B48/VLOOKUP(B48,Tools!A:C,3,0)","v":2.6093749999999999E-2},{"$f":"Orders!C48/VLOOKUP(B48,Tools!A:C,3,0)","v":1.921875E-2},{"$f":"Orders!D48/VLOOKUP(B48,Tools!A:C,3,0)","v":2.1406250000000002E-2}]
[{"$f":"Orders!A49","v":"AP853615"},{"$f":"VLOOKUP(A49,'Product-tool'!A:B,2,0)","v":"Tool 13"},{"$f":"Orders!B49/VLOOKUP(B49,Tools!A:C,3,0)","v":0.20874999999999999},{"$f":"Orders!C49/VLOOKUP(B49,Tools!A:C,3,0)","v":0.27833333333333332},{"$f":"Orders!D49/VLOOKUP(B49,Tools!A:C,3,0)","v":0.22541666666666665}]
[{"$f":"Orders!A50","v":"AS0105077"},{"$f":"VLOOKUP(A50,'Product-tool'!A:B,2,0)","v":"Tool 12"},{"$f":"Orders!B50/VLOOKUP(B50,Tools!A:C,3,0)","v":0.51824999999999999},{"$f":"Orders!C50/VLOOKUP(B50,Tools!A:C,3,0)","v":0.58025000000000004},{"$f":"Orders!D50/VLOOKUP(B50,Tools!A:C,3,0)","v":0.51149999999999995}]
[{"$f":"Orders!A51","v":"AS0125536"},{"$f":"VLOOKUP(A51,'Product-tool'!A:B,2,0)","v":"Tool 5"},{"$f":"Orders!B51/VLOOKUP(B51,Tools!A:C,3,0)","v":49.827500000000001},{"$f":"Orders!C51/VLOOKUP(B51,Tools!A:C,3,0)","v":46.256666666666668},{"$f":"Orders!D51/VLOOKUP(B51,Tools!A:C,3,0)","v":45.025833333333331}]
[{"$f":"Orders!A52","v":"AS0888075"},{"$f":"VLOOKUP(A52,'Product-tool'!A:B,2,0)","v":"Tool 13"},{"$f":"Orders!B52/VLOOKUP(B52,Tools!A:C,3,0)","v":1.6833333333333333},{"$f":"Orders!C52/VLOOKUP(B52,Tools!A:C,3,0)","v":1.0662499999999999},{"$f":"Orders!D52/VLOOKUP(B52,Tools!A:C,3,0)","v":1.3054166666666667}]
[{"$f":"Orders!A53","v":"AS1143091"},{"$f":"VLOOKUP(A53,'Product-tool'!A:B,2,0)","v":"Tool 5"},{"$f":"Orders!B53/VLOOKUP(B53,Tools!A:C,3,0)","v":6.375},{"$f":"Orders!C53/VLOOKUP(B53,Tools!A:C,3,0)","v":7.4433333333333334},{"$f":"Orders!D53/VLOOKUP(B53,Tools!A:C,3,0)","v":6.4233333333333329}]
[{"$f":"Orders!A54","v":"AS5378181"},{"$f":"VLOOKUP(A54,'Product-tool'!A:B,2,0)","v":"Tool 13"},{"$f":"Orders!B54/VLOOKUP(B54,Tools!A:C,3,0)","v":0.18541666666666667},{"$f":"Orders!C54/VLOOKUP(B54,Tools!A:C,3,0)","v":0.29958333333333331},{"$f":"Orders!D54/VLOOKUP(B54,Tools!A:C,3,0)","v":0.22333333333333333}]
[{"$f":"Orders!A55","v":"AS6815735"},{"$f":"VLOOKUP(A55,'Product-tool'!A:B,2,0)","v":"Tool 6"},{"$f":"Orders!B55/VLOOKUP(B55,Tools!A:C,3,0)","v":1.9977586206896552},{"$f":"Orders!C55/VLOOKUP(B55,Tools!A:C,3,0)","v":2.5448275862068965},{"$f":"Orders!D55/VLOOKUP(B55,Tools!A:C,3,0)","v":2.1053448275862068}]
[{"$f":"Orders!A56","v":"BC1086722"},{"$f":"VLOOKUP(A56,'Product-tool'!A:B,2,0)","v":"Tool 6"},{"$f":"Orders!B56/VLOOKUP(B56,Tools!A:C,3,0)","v":0.14362068965517241},{"$f":"Orders!C56/VLOOKUP(B56,Tools!A:C,3,0)","v":0.18793103448275861},{"$f":"Orders!D56/VLOOKUP(B56,Tools!A:C,3,0)","v":0.15362068965517242}]
[{"$f":"Orders!A57","v":"BC1381899"},{"$f":"VLOOKUP(A57,'Product-tool'!A:B,2,0)","v":"Tool 6"},{"$f":"Orders!B57/VLOOKUP(B57,Tools!A:C,3,0)","v":0.14362068965517241},{"$f":"Orders!C57/VLOOKUP(B57,Tools!A:C,3,0)","v":0.22741379310344828},{"$f":"Orders!D57/VLOOKUP(B57,Tools!A:C,3,0)","v":0.1706896551724138}]
[{"$f":"Orders!A58","v":"BC1638233"},{"$f":"VLOOKUP(A58,'Product-tool'!A:B,2,0)","v":"Tool 6"},{"$f":"Orders!B58/VLOOKUP(B58,Tools!A:C,3,0)","v":6.0517241379310346E-2},{"$f":"Orders!C58/VLOOKUP(B58,Tools!A:C,3,0)","v":9.4655172413793107E-2},{"$f":"Orders!D58/VLOOKUP(B58,Tools!A:C,3,0)","v":7.1551724137931039E-2}]
[{"$f":"Orders!A59","v":"BC2465775"},{"$f":"VLOOKUP(A59,'Product-tool'!A:B,2,0)","v":"Tool 6"},{"$f":"Orders!B59/VLOOKUP(B59,Tools!A:C,3,0)","v":0.39224137931034481},{"$f":"Orders!C59/VLOOKUP(B59,Tools!A:C,3,0)","v":0.51620689655172414},{"$f":"Orders!D59/VLOOKUP(B59,Tools!A:C,3,0)","v":0.42051724137931035}]
[{"$f":"Orders!A60","v":"BC2509115"},{"$f":"VLOOKUP(A60,'Product-tool'!A:B,2,0)","v":"Tool 6"},{"$f":"Orders!B60/VLOOKUP(B60,Tools!A:C,3,0)","v":1.1475862068965517},{"$f":"Orders!C60/VLOOKUP(B60,Tools!A:C,3,0)","v":1.3860344827586206},{"$f":"Orders!D60/VLOOKUP(B60,Tools!A:C,3,0)","v":1.1765517241379311}]
[{"$f":"Orders!A61","v":"BC2965316"},{"$f":"VLOOKUP(A61,'Product-tool'!A:B,2,0)","v":"Tool 6"},{"$f":"Orders!B61/VLOOKUP(B61,Tools!A:C,3,0)","v":5.7413793103448275E-2},{"$f":"Orders!C61/VLOOKUP(B61,Tools!A:C,3,0)","v":9.4655172413793107E-2},{"$f":"Orders!D61/VLOOKUP(B61,Tools!A:C,3,0)","v":6.9827586206896552E-2}]
[{"$f":"Orders!A62","v":"BC3857293"},{"$f":"VLOOKUP(A62,'Product-tool'!A:B,2,0)","v":"Tool 15"},{"$f":"Orders!B62/VLOOKUP(B62,Tools!A:C,3,0)","v":6.4090909090909087E-2},{"$f":"Orders!C62/VLOOKUP(B62,Tools!A:C,3,0)","v":6.8181818181818177E-2},{"$f":"Orders!D62/VLOOKUP(B62,Tools!A:C,3,0)","v":6.1590909090909092E-2}]
[{"$f":"Orders!A63","v":"BC5752252"},{"$f":"VLOOKUP(A63,'Product-tool'!A:B,2,0)","v":"Tool 6"},{"$f":"Orders!B63/VLOOKUP(B63,Tools!A:C,3,0)","v":6.8965517241379309E-3},{"$f":"Orders!C63/VLOOKUP(B63,Tools!A:C,3,0)","v":8.2758620689655175E-3},{"$f":"Orders!D63/VLOOKUP(B63,Tools!A:C,3,0)","v":7.068965517241379E-3}]
[{"$f":"Orders!A64","v":"BC6306450"},{"$f":"VLOOKUP(A64,'Product-tool'!A:B,2,0)","v":"Tool 5"},{"$f":"Orders!B64/VLOOKUP(B64,Tools!A:C,3,0)","v":3.0691666666666668},{"$f":"Orders!C64/VLOOKUP(B64,Tools!A:C,3,0)","v":2.0966666666666667},{"$f":"Orders!D64/VLOOKUP(B64,Tools!A:C,3,0)","v":2.4466666666666668}]
[{"$f":"Orders!A65","v":"CC0084549"},{"$f":"VLOOKUP(A65,'Product-tool'!A:B,2,0)","v":"Tool 12"},{"$f":"Orders!B65/VLOOKUP(B65,Tools!A:C,3,0)","v":1.83175},{"$f":"Orders!C65/VLOOKUP(B65,Tools!A:C,3,0)","v":1.2275},{"$f":"Orders!D65/VLOOKUP(B65,Tools!A:C,3,0)","v":1.4495}]
[{"$f":"Orders!A66","v":"CC0189122"},{"$f":"VLOOKUP(A66,'Product-tool'!A:B,2,0)","v":"Tool 20"},{"$f":"Orders!B66/VLOOKUP(B66,Tools!A:C,3,0)","v":0.45873650865349713},{"$f":"Orders!C66/VLOOKUP(B66,Tools!A:C,3,0)","v":0.54334790913847542},{"$f":"Orders!D66/VLOOKUP(B66,Tools!A:C,3,0)","v":0.46561755628329954}]
[{"$f":"Orders!A67","v":"CC0921636"},{"$f":"VLOOKUP(A67,'Product-tool'!A:B,2,0)","v":"Tool 20"},{"$f":"Orders!B67/VLOOKUP(B67,Tools!A:C,3,0)","v":2.9122122691019507},{"$f":"Orders!C67/VLOOKUP(B67,Tools!A:C,3,0)","v":2.1559341638634772},{"$f":"Orders!D67/VLOOKUP(B67,Tools!A:C,3,0)","v":2.3935851607075804}]
[{"$f":"Orders!A68","v":"CC092903"},{"$f":"VLOOKUP(A68,'Product-tool'!A:B,2,0)","v":"Tool 20"},{"$f":"Orders!B68/VLOOKUP(B68,Tools!A:C,3,0)","v":1.019414463674438E-3},{"$f":"Orders!C68/VLOOKUP(B68,Tools!A:C,3,0)","v":1.6565485034709618E-3},{"$f":"Orders!D68/VLOOKUP(B68,Tools!A:C,3,0)","v":1.2742680795930475E-3}]
[{"$f":"Orders!A69","v":"CC2454697"},{"$f":"VLOOKUP(A69,'Product-tool'!A:B,2,0)","v":"Tool 20"},{"$f":"Orders!B69/VLOOKUP(B69,Tools!A:C,3,0)","v":0.56934297796217359},{"$f":"Orders!C69/VLOOKUP(B69,Tools!A:C,3,0)","v":0.43133974494224658},{"$f":"Orders!D69/VLOOKUP(B69,Tools!A:C,3,0)","v":0.47224375029718341}]
[{"$f":"Orders!A70","v":"CC2566445"},{"$f":"VLOOKUP(A70,'Product-tool'!A:B,2,0)","v":"Tool 15"},{"$f":"Orders!B70/VLOOKUP(B70,Tools!A:C,3,0)","v":2.9527272727272726},{"$f":"Orders!C70/VLOOKUP(B70,Tools!A:C,3,0)","v":2.9859090909090908},{"$f":"Orders!D70/VLOOKUP(B70,Tools!A:C,3,0)","v":2.7745454545454544}]
[{"$f":"Orders!A71","v":"CC2575"},{"$f":"VLOOKUP(A71,'Product-tool'!A:B,2,0)","v":"Tool 19"},{"$f":"Orders!B71/VLOOKUP(B71,Tools!A:C,3,0)","v":4.7394767899291894},{"$f":"Orders!C71/VLOOKUP(B71,Tools!A:C,3,0)","v":6.1354248623131395},{"$f":"Orders!D71/VLOOKUP(B71,Tools!A:C,3,0)","v":5.0373721479150273}]
[{"$f":"Orders!A72","v":"CC2936183"},{"$f":"VLOOKUP(A72,'Product-tool'!A:B,2,0)","v":"Tool 20"},{"$f":"Orders!B72/VLOOKUP(B72,Tools!A:C,3,0)","v":0.38228042387791428},{"$f":"Orders!C72/VLOOKUP(B72,Tools!A:C,3,0)","v":0.31525392289131998},{"$f":"Orders!D72/VLOOKUP(B72,Tools!A:C,3,0)","v":0.32825145730316907}]
[{"$f":"Orders!A73","v":"CC2965217"},{"$f":"VLOOKUP(A73,'Product-tool'!A:B,2,0)","v":"Tool 20"},{"$f":"Orders!B73/VLOOKUP(B73,Tools!A:C,3,0)","v":2.8715631173629328},{"$f":"Orders!C73/VLOOKUP(B73,Tools!A:C,3,0)","v":3.4224292081710068},{"$f":"Orders!D73/VLOOKUP(B73,Tools!A:C,3,0)","v":2.9238081086262477}]
[{"$f":"Orders!A74","v":"CC3609599"},{"$f":"VLOOKUP(A74,'Product-tool'!A:B,2,0)","v":"Tool 4"},{"$f":"Orders!B74/VLOOKUP(B74,Tools!A:C,3,0)","v":6.5317139001349531},{"$f":"Orders!C74/VLOOKUP(B74,Tools!A:C,3,0)","v":13.268106162843004},{"$f":"Orders!D74/VLOOKUP(B74,Tools!A:C,3,0)","v":7.4313990103463787}]
[{"$f":"Orders!A75","v":"CC3979402"},{"$f":"VLOOKUP(A75,'Product-tool'!A:B,2,0)","v":"Tool 13"},{"$f":"Orders!B75/VLOOKUP(B75,Tools!A:C,3,0)","v":1.2516666666666667},{"$f":"Orders!C75/VLOOKUP(B75,Tools!A:C,3,0)","v":1.3666666666666667},{"$f":"Orders!D75/VLOOKUP(B75,Tools!A:C,3,0)","v":1.22}]
[{"$f":"Orders!A76","v":"CC4329116"},{"$f":"VLOOKUP(A76,'Product-tool'!A:B,2,0)","v":"Tool 19"},{"$f":"Orders!B76/VLOOKUP(B76,Tools!A:C,3,0)","v":8.8528717545239974},{"$f":"Orders!C76/VLOOKUP(B76,Tools!A:C,3,0)","v":6.7085955940204567},{"$f":"Orders!D76/VLOOKUP(B76,Tools!A:C,3,0)","v":7.3432336742722262}]
[{"$f":"Orders!A77","v":"CC4618183"},{"$f":"VLOOKUP(A77,'Product-tool'!A:B,2,0)","v":"Tool 18"},{"$f":"Orders!B77/VLOOKUP(B77,Tools!A:C,3,0)","v":34.957857142857144},{"$f":"Orders!C77/VLOOKUP(B77,Tools!A:C,3,0)","v":55.409642857142856},{"$f":"Orders!D77/VLOOKUP(B77,Tools!A:C,3,0)","v":41.57}]
[{"$f":"Orders!A78","v":"CC4774419"},{"$f":"VLOOKUP(A78,'Product-tool'!A:B,2,0)","v":"Tool 12"},{"$f":"Orders!B78/VLOOKUP(B78,Tools!A:C,3,0)","v":0.26050000000000001},{"$f":"Orders!C78/VLOOKUP(B78,Tools!A:C,3,0)","v":0.27450000000000002},{"$f":"Orders!D78/VLOOKUP(B78,Tools!A:C,3,0)","v":0.24975}]
[{"$f":"Orders!A79","v":"CC4941594"},{"$f":"VLOOKUP(A79,'Product-tool'!A:B,2,0)","v":"Tool 13"},{"$f":"Orders!B79/VLOOKUP(B79,Tools!A:C,3,0)","v":0.55541666666666667},{"$f":"Orders!C79/VLOOKUP(B79,Tools!A:C,3,0)","v":0.44083333333333335},{"$f":"Orders!D79/VLOOKUP(B79,Tools!A:C,3,0)","v":0.46958333333333335}]
[{"$f":"Orders!A80","v":"CC4945569"},{"$f":"VLOOKUP(A80,'Product-tool'!A:B,2,0)","v":"Tool 4"},{"$f":"Orders!B80/VLOOKUP(B80,Tools!A:C,3,0)","v":17.240215924426451},{"$f":"Orders!C80/VLOOKUP(B80,Tools!A:C,3,0)","v":22.644174538911383},{"$f":"Orders!D80/VLOOKUP(B80,Tools!A:C,3,0)","v":18.465587044534413}]
[{"$f":"Orders!A81","v":"CC5387633"},{"$f":"VLOOKUP(A81,'Product-tool'!A:B,2,0)","v":"Tool 4"},{"$f":"Orders!B81/VLOOKUP(B81,Tools!A:C,3,0)","v":5.3265856950067478},{"$f":"Orders!C81/VLOOKUP(B81,Tools!A:C,3,0)","v":4.1524966261808371},{"$f":"Orders!D81/VLOOKUP(B81,Tools!A:C,3,0)","v":4.4687359424201532}]
[{"$f":"Orders!A82","v":"CC5505924"},{"$f":"VLOOKUP(A82,'Product-tool'!A:B,2,0)","v":"Tool 19"},{"$f":"Orders!B82/VLOOKUP(B82,Tools!A:C,3,0)","v":5.7041699449252555E-3},{"$f":"Orders!C82/VLOOKUP(B82,Tools!A:C,3,0)","v":8.0645161290322578E-3},{"$f":"Orders!D82/VLOOKUP(B82,Tools!A:C,3,0)","v":6.3926042486231313E-3}]
[{"$f":"Orders!A83","v":"CC5603244"},{"$f":"VLOOKUP(A83,'Product-tool'!A:B,2,0)","v":"Tool 12"},{"$f":"Orders!B83/VLOOKUP(B83,Tools!A:C,3,0)","v":0.45},{"$f":"Orders!C83/VLOOKUP(B83,Tools!A:C,3,0)","v":0.63924999999999998},{"$f":"Orders!D83/VLOOKUP(B83,Tools!A:C,3,0)","v":0.503}]
[{"$f":"Orders!A84","v":"CC5605066"},{"$f":"VLOOKUP(A84,'Product-tool'!A:B,2,0)","v":"Tool 8"},{"$f":"Orders!B84/VLOOKUP(B84,Tools!A:C,3,0)","v":87.258163265306123},{"$f":"Orders!C84/VLOOKUP(B84,Tools!A:C,3,0)","v":129.64438775510203},{"$f":"Orders!D84/VLOOKUP(B84,Tools!A:C,3,0)","v":99.996173469387756}]
[{"$f":"Orders!A85","v":"CC5646794"},{"$f":"VLOOKUP(A85,'Product-tool'!A:B,2,0)","v":"Tool 20"},{"$f":"Orders!B85/VLOOKUP(B85,Tools!A:C,3,0)","v":0.21229306206020171},{"$f":"Orders!C85/VLOOKUP(B85,Tools!A:C,3,0)","v":0.1608126316446426},{"$f":"Orders!D85/VLOOKUP(B85,Tools!A:C,3,0)","v":0.17610384859975917}]
[{"$f":"Orders!A86","v":"CC5671451"},{"$f":"VLOOKUP(A86,'Product-tool'!A:B,2,0)","v":"Tool 19"},{"$f":"Orders!B86/VLOOKUP(B86,Tools!A:C,3,0)","v":0.20898898505114083},{"$f":"Orders!C86/VLOOKUP(B86,Tools!A:C,3,0)","v":0.22285601888276949},{"$f":"Orders!D86/VLOOKUP(B86,Tools!A:C,3,0)","v":0.2014162077104642}]
[{"$f":"Orders!A87","v":"CC5798817"},{"$f":"VLOOKUP(A87,'Product-tool'!A:B,2,0)","v":"Tool 20"},{"$f":"Orders!B87/VLOOKUP(B87,Tools!A:C,3,0)","v":0.84522201719406842},{"$f":"Orders!C87/VLOOKUP(B87,Tools!A:C,3,0)","v":0.56602988095523166},{"$f":"Orders!D87/VLOOKUP(B87,Tools!A:C,3,0)","v":0.66873588817043139}]
[{"$f":"Orders!A88","v":"CC5805891"},{"$f":"VLOOKUP(A88,'Product-tool'!A:B,2,0)","v":"Tool 4"},{"$f":"Orders!B88/VLOOKUP(B88,Tools!A:C,3,0)","v":1.0494826810616285},{"$f":"Orders!C88/VLOOKUP(B88,Tools!A:C,3,0)","v":0.6576698155645524},{"$f":"Orders!D88/VLOOKUP(B88,Tools!A:C,3,0)","v":0.81061628430049482}]
[{"$f":"Orders!A89","v":"CC5803851"},{"$f":"VLOOKUP(A89,'Product-tool'!A:B,2,0)","v":"Tool 20"},{"$f":"Orders!B89/VLOOKUP(B89,Tools!A:C,3,0)","v":1.4378841010127947},{"$f":"Orders!C89/VLOOKUP(B89,Tools!A:C,3,0)","v":2.4357634341421104},{"$f":"Orders!D89/VLOOKUP(B89,Tools!A:C,3,0)","v":1.7779862514561793}]
[{"$f":"Orders!A90","v":"CC5835642"},{"$f":"VLOOKUP(A90,'Product-tool'!A:B,2,0)","v":"Tool 12"},{"$f":"Orders!B90/VLOOKUP(B90,Tools!A:C,3,0)","v":2E-3},{"$f":"Orders!C90/VLOOKUP(B90,Tools!A:C,3,0)","v":1.25E-3},{"$f":"Orders!D90/VLOOKUP(B90,Tools!A:C,3,0)","v":1.75E-3}]
[{"$f":"Orders!A91","v":"CC5844379"},{"$f":"VLOOKUP(A91,'Product-tool'!A:B,2,0)","v":"Tool 13"},{"$f":"Orders!B91/VLOOKUP(B91,Tools!A:C,3,0)","v":3.5504166666666666},{"$f":"Orders!C91/VLOOKUP(B91,Tools!A:C,3,0)","v":2.5783333333333331},{"$f":"Orders!D91/VLOOKUP(B91,Tools!A:C,3,0)","v":2.8962500000000002}]
[{"$f":"Orders!A92","v":"CC5859307"},{"$f":"VLOOKUP(A92,'Product-tool'!A:B,2,0)","v":"Tool 15"},{"$f":"Orders!B92/VLOOKUP(B92,Tools!A:C,3,0)","v":0.10590909090909091},{"$f":"Orders!C92/VLOOKUP(B92,Tools!A:C,3,0)","v":0.10159090909090909},{"$f":"Orders!D92/VLOOKUP(B92,Tools!A:C,3,0)","v":9.7272727272727275E-2}]
[{"$f":"Orders!A93","v":"CC5877145"},{"$f":"VLOOKUP(A93,'Product-tool'!A:B,2,0)","v":"Tool 12"},{"$f":"Orders!B93/VLOOKUP(B93,Tools!A:C,3,0)","v":0.32224999999999998},{"$f":"Orders!C93/VLOOKUP(B93,Tools!A:C,3,0)","v":0.45550000000000002},{"$f":"Orders!D93/VLOOKUP(B93,Tools!A:C,3,0)","v":0.35925000000000001}]
[{"$f":"Orders!A94","v":"CC5872620"},{"$f":"VLOOKUP(A94,'Product-tool'!A:B,2,0)","v":"Tool 19"},{"$f":"Orders!B94/VLOOKUP(B94,Tools!A:C,3,0)","v":7.1992525570416994},{"$f":"Orders!C94/VLOOKUP(B94,Tools!A:C,3,0)","v":10.933320220298977},{"$f":"Orders!D94/VLOOKUP(B94,Tools!A:C,3,0)","v":8.3532651455546816}]
[{"$f":"Orders!A95","v":"CC5949597"},{"$f":"VLOOKUP(A95,'Product-tool'!A:B,2,0)","v":"Tool 15"},{"$f":"Orders!B95/VLOOKUP(B95,Tools!A:C,3,0)","v":2.0709090909090908},{"$f":"Orders!C95/VLOOKUP(B95,Tools!A:C,3,0)","v":2.3063636363636362},{"$f":"Orders!D95/VLOOKUP(B95,Tools!A:C,3,0)","v":2.0381818181818181}]
[{"$f":"Orders!A96","v":"CC5951749"},{"$f":"VLOOKUP(A96,'Product-tool'!A:B,2,0)","v":"Tool 19"},{"$f":"Orders!B96/VLOOKUP(B96,Tools!A:C,3,0)","v":9.7364280094413853E-3},{"$f":"Orders!C96/VLOOKUP(B96,Tools!A:C,3,0)","v":1.0719905586152635E-2},{"$f":"Orders!D96/VLOOKUP(B96,Tools!A:C,3,0)","v":9.5397324940991353E-3}]
[{"$f":"Orders!A97","v":"CC6069687"},{"$f":"VLOOKUP(A97,'Product-tool'!A:B,2,0)","v":"Tool 4"},{"$f":"Orders!B97/VLOOKUP(B97,Tools!A:C,3,0)","v":5.9829059829059832E-2},{"$f":"Orders!C97/VLOOKUP(B97,Tools!A:C,3,0)","v":9.8965362123256864E-2},{"$f":"Orders!D97/VLOOKUP(B97,Tools!A:C,3,0)","v":7.3324336482231217E-2}]
[{"$f":"Orders!A98","v":"CC6146771"},{"$f":"VLOOKUP(A98,'Product-tool'!A:B,2,0)","v":"Tool 19"},{"$f":"Orders!B98/VLOOKUP(B98,Tools!A:C,3,0)","v":0.21754523996852873},{"$f":"Orders!C98/VLOOKUP(B98,Tools!A:C,3,0)","v":0.2292486231313926},{"$f":"Orders!D98/VLOOKUP(B98,Tools!A:C,3,0)","v":0.20839889850511409}]
[{"$f":"Orders!A99","v":"CC642531"},{"$f":"VLOOKUP(A99,'Product-tool'!A:B,2,0)","v":"Tool 19"},{"$f":"Orders!B99/VLOOKUP(B99,Tools!A:C,3,0)","v":0.10483870967741936},{"$f":"Orders!C99/VLOOKUP(B99,Tools!A:C,3,0)","v":7.149881982690795E-2},{"$f":"Orders!D99/VLOOKUP(B99,Tools!A:C,3,0)","v":8.3497246262785207E-2}]
[{"$f":"Orders!A100","v":"CC6514546"},{"$f":"VLOOKUP(A100,'Product-tool'!A:B,2,0)","v":"Tool 15"},{"$f":"Orders!B100/VLOOKUP(B100,Tools!A:C,3,0)","v":1.8863636363636364E-2},{"$f":"Orders!C100/VLOOKUP(B100,Tools!A:C,3,0)","v":2.8181818181818183E-2},{"$f":"Orders!D100/VLOOKUP(B100,Tools!A:C,3,0)","v":2.1590909090909091E-2}]
[{"$f":"Orders!A101","v":"CL1528731"},{"$f":"VLOOKUP(A101,'Product-tool'!A:B,2,0)","v":"Tool 15"},{"$f":"Orders!B101/VLOOKUP(B101,Tools!A:C,3,0)","v":0.93886363636363634},{"$f":"Orders!C101/VLOOKUP(B101,Tools!A:C,3,0)","v":1.1161363636363637},{"$f":"Orders!D101/VLOOKUP(B101,Tools!A:C,3,0)","v":0.95477272727272722}]
[{"$f":"Orders!A102","v":"CL4179003"},{"$f":"VLOOKUP(A102,'Product-tool'!A:B,2,0)","v":"Tool 8"},{"$f":"Orders!B102/VLOOKUP(B102,Tools!A:C,3,0)","v":0.42499999999999999},{"$f":"Orders!C102/VLOOKUP(B102,Tools!A:C,3,0)","v":0.54642857142857137},{"$f":"Orders!D102/VLOOKUP(B102,Tools!A:C,3,0)","v":0.45025510204081631}]
[{"$f":"Orders!A103","v":"CM2146129"},{"$f":"VLOOKUP(A103,'Product-tool'!A:B,2,0)","v":"Tool 8"},{"$f":"Orders!B103/VLOOKUP(B103,Tools!A:C,3,0)","v":0.32602040816326533},{"$f":"Orders!C103/VLOOKUP(B103,Tools!A:C,3,0)","v":0.52142857142857146},{"$f":"Orders!D103/VLOOKUP(B103,Tools!A:C,3,0)","v":0.38979591836734695}]
[{"$f":"Orders!A104","v":"CM2144500"},{"$f":"VLOOKUP(A104,'Product-tool'!A:B,2,0)","v":"Tool 8"},{"$f":"Orders!B104/VLOOKUP(B104,Tools!A:C,3,0)","v":1.3604591836734694},{"$f":"Orders!C104/VLOOKUP(B104,Tools!A:C,3,0)","v":2.1698979591836736},{"$f":"Orders!D104/VLOOKUP(B104,Tools!A:C,3,0)","v":1.6237244897959184}]
[{"$f":"Orders!A105","v":"CM2364748"},{"$f":"VLOOKUP(A105,'Product-tool'!A:B,2,0)","v":"Tool 4"},{"$f":"Orders!B105/VLOOKUP(B105,Tools!A:C,3,0)","v":0.49347728295096716},{"$f":"Orders!C105/VLOOKUP(B105,Tools!A:C,3,0)","v":0.4358974358974359},{"$f":"Orders!D105/VLOOKUP(B105,Tools!A:C,3,0)","v":0.43634727845254162}]
[{"$f":"Orders!A106","v":"CM2573429"},{"$f":"VLOOKUP(A106,'Product-tool'!A:B,2,0)","v":"Tool 8"},{"$f":"Orders!B106/VLOOKUP(B106,Tools!A:C,3,0)","v":6.1247448979591841},{"$f":"Orders!C106/VLOOKUP(B106,Tools!A:C,3,0)","v":4.4762755102040819},{"$f":"Orders!D106/VLOOKUP(B106,Tools!A:C,3,0)","v":5.0086734693877553}]
[{"$f":"Orders!A107","v":"CM267912"},{"$f":"VLOOKUP(A107,'Product-tool'!A:B,2,0)","v":"Tool 8"},{"$f":"Orders!B107/VLOOKUP(B107,Tools!A:C,3,0)","v":2.2704081632653063E-2},{"$f":"Orders!C107/VLOOKUP(B107,Tools!A:C,3,0)","v":3.0102040816326531E-2},{"$f":"Orders!D107/VLOOKUP(B107,Tools!A:C,3,0)","v":2.4489795918367346E-2}]
[{"$f":"Orders!A108","v":"CM2981742"},{"$f":"VLOOKUP(A108,'Product-tool'!A:B,2,0)","v":"Tool 10"},{"$f":"Orders!B108/VLOOKUP(B108,Tools!A:C,3,0)","v":7.7419354838709677E-3},{"$f":"Orders!C108/VLOOKUP(B108,Tools!A:C,3,0)","v":1.032258064516129E-2},{"$f":"Orders!D108/VLOOKUP(B108,Tools!A:C,3,0)","v":8.3870967741935479E-3}]
[{"$f":"Orders!A109","v":"CM350886"},{"$f":"VLOOKUP(A109,'Product-tool'!A:B,2,0)","v":"Tool 8"},{"$f":"Orders!B109/VLOOKUP(B109,Tools!A:C,3,0)","v":2.5510204081632651E-3},{"$f":"Orders!C109/VLOOKUP(B109,Tools!A:C,3,0)","v":1.2755102040816326E-3},{"$f":"Orders!D109/VLOOKUP(B109,Tools!A:C,3,0)","v":1.7857142857142857E-3}]
[{"$f":"Orders!A110","v":"CM3509051"},{"$f":"VLOOKUP(A110,'Product-tool'!A:B,2,0)","v":"Tool 8"},{"$f":"Orders!B110/VLOOKUP(B110,Tools!A:C,3,0)","v":1.8821428571428571},{"$f":"Orders!C110/VLOOKUP(B110,Tools!A:C,3,0)","v":2.3359693877551022},{"$f":"Orders!D110/VLOOKUP(B110,Tools!A:C,3,0)","v":1.9566326530612246}]
[{"$f":"Orders!A111","v":"CM5648071"},{"$f":"VLOOKUP(A111,'Product-tool'!A:B,2,0)","v":"Tool 19"},{"$f":"Orders!B111/VLOOKUP(B111,Tools!A:C,3,0)","v":7.9858379228953585E-2},{"$f":"Orders!C111/VLOOKUP(B111,Tools!A:C,3,0)","v":0.12677025963808025},{"$f":"Orders!D111/VLOOKUP(B111,Tools!A:C,3,0)","v":9.5003933910306843E-2}]
[{"$f":"Orders!A112","v":"CM5946003"},{"$f":"VLOOKUP(A112,'Product-tool'!A:B,2,0)","v":"Tool 19"},{"$f":"Orders!B112/VLOOKUP(B112,Tools!A:C,3,0)","v":0.99065696302124306},{"$f":"Orders!C112/VLOOKUP(B112,Tools!A:C,3,0)","v":0.83379228953579854},{"$f":"Orders!D112/VLOOKUP(B112,Tools!A:C,3,0)","v":0.85788749016522425}]
[{"$f":"Orders!A113","v":"CM5947011"},{"$f":"VLOOKUP(A113,'Product-tool'!A:B,2,0)","v":"Tool 4"},{"$f":"Orders!B113/VLOOKUP(B113,Tools!A:C,3,0)","v":5.42914979757085},{"$f":"Orders!C113/VLOOKUP(B113,Tools!A:C,3,0)","v":3.341880341880342},{"$f":"Orders!D113/VLOOKUP(B113,Tools!A:C,3,0)","v":4.1677912730544309}]
[{"$f":"Orders!A114","v":"CP2759269"},{"$f":"VLOOKUP(A114,'Product-tool'!A:B,2,0)","v":"Tool 9"},{"$f":"Orders!B114/VLOOKUP(B114,Tools!A:C,3,0)","v":14.208333333333334},{"$f":"Orders!C114/VLOOKUP(B114,Tools!A:C,3,0)","v":15.841666666666667},{"$f":"Orders!D114/VLOOKUP(B114,Tools!A:C,3,0)","v":13.99375}]
[{"$f":"Orders!A115","v":"CP3651771"},{"$f":"VLOOKUP(A115,'Product-tool'!A:B,2,0)","v":"Tool 2"},{"$f":"Orders!B115/VLOOKUP(B115,Tools!A:C,3,0)","v":3.7511538461538461},{"$f":"Orders!C115/VLOOKUP(B115,Tools!A:C,3,0)","v":4.9550000000000001},{"$f":"Orders!D115/VLOOKUP(B115,Tools!A:C,3,0)","v":4.03}]
[{"$f":"Orders!A116","v":"CP3782517"},{"$f":"VLOOKUP(A116,'Product-tool'!A:B,2,0)","v":"Tool 16"},{"$f":"Orders!B116/VLOOKUP(B116,Tools!A:C,3,0)","v":0.78985294117647054},{"$f":"Orders!C116/VLOOKUP(B116,Tools!A:C,3,0)","v":0.69279411764705878},{"$f":"Orders!D116/VLOOKUP(B116,Tools!A:C,3,0)","v":0.69617647058823529}]
[{"$f":"Orders!A117","v":"CP5891290"},{"$f":"VLOOKUP(A117,'Product-tool'!A:B,2,0)","v":"Tool 12"},{"$f":"Orders!B117/VLOOKUP(B117,Tools!A:C,3,0)","v":3.3250000000000002E-2},{"$f":"Orders!C117/VLOOKUP(B117,Tools!A:C,3,0)","v":2.725E-2},{"$f":"Orders!D117/VLOOKUP(B117,Tools!A:C,3,0)","v":2.8500000000000001E-2}]
[{"$f":"Orders!A118","v":"CP5915175"},{"$f":"VLOOKUP(A118,'Product-tool'!A:B,2,0)","v":"Tool 17"},{"$f":"Orders!B118/VLOOKUP(B118,Tools!A:C,3,0)","v":6.4264705882352946E-2},{"$f":"Orders!C118/VLOOKUP(B118,Tools!A:C,3,0)","v":6.9705882352941173E-2},{"$f":"Orders!D118/VLOOKUP(B118,Tools!A:C,3,0)","v":6.25E-2}]
[{"$f":"Orders!A119","v":"CT0314214"},{"$f":"VLOOKUP(A119,'Product-tool'!A:B,2,0)","v":"Tool 20"},{"$f":"Orders!B119/VLOOKUP(B119,Tools!A:C,3,0)","v":5.5749228482195825},{"$f":"Orders!C119/VLOOKUP(B119,Tools!A:C,3,0)","v":9.3733885666784982},{"$f":"Orders!D119/VLOOKUP(B119,Tools!A:C,3,0)","v":6.8628255962642761}]
[{"$f":"Orders!A120","v":"CT0686710"},{"$f":"VLOOKUP(A120,'Product-tool'!A:B,2,0)","v":"Tool 4"},{"$f":"Orders!B120/VLOOKUP(B120,Tools!A:C,3,0)","v":0.86189833558254614},{"$f":"Orders!C120/VLOOKUP(B120,Tools!A:C,3,0)","v":1.3085919928025191},{"$f":"Orders!D120/VLOOKUP(B120,Tools!A:C,3,0)","v":1}]
[{"$f":"Orders!A121","v":"CT0911438"},{"$f":"VLOOKUP(A121,'Product-tool'!A:B,2,0)","v":"Tool 13"},{"$f":"Orders!B121/VLOOKUP(B121,Tools!A:C,3,0)","v":0.59},{"$f":"Orders!C121/VLOOKUP(B121,Tools!A:C,3,0)","v":0.62624999999999997},{"$f":"Orders!D121/VLOOKUP(B121,Tools!A:C,3,0)","v":0.5675}]
[{"$f":"Orders!A122","v":"CT1153413"},{"$f":"VLOOKUP(A122,'Product-tool'!A:B,2,0)","v":"Tool 20"},{"$f":"Orders!B122/VLOOKUP(B122,Tools!A:C,3,0)","v":0.38941632512363533},{"$f":"Orders!C122/VLOOKUP(B122,Tools!A:C,3,0)","v":0.59648488805750555},{"$f":"Orders!D122/VLOOKUP(B122,Tools!A:C,3,0)","v":0.45402171675900282}]
[{"$f":"Orders!A123","v":"CT1195860"},{"$f":"VLOOKUP(A123,'Product-tool'!A:B,2,0)","v":"Tool 19"},{"$f":"Orders!B123/VLOOKUP(B123,Tools!A:C,3,0)","v":0.13109756097560976},{"$f":"Orders!C123/VLOOKUP(B123,Tools!A:C,3,0)","v":0.21193941778127459},{"$f":"Orders!D123/VLOOKUP(B123,Tools!A:C,3,0)","v":0.15765145554681353}]
[{"$f":"Orders!A124","v":"CT1344126"},{"$f":"VLOOKUP(A124,'Product-tool'!A:B,2,0)","v":"Tool 16"},{"$f":"Orders!B124/VLOOKUP(B124,Tools!A:C,3,0)","v":1.2254411764705881},{"$f":"Orders!C124/VLOOKUP(B124,Tools!A:C,3,0)","v":0.96},{"$f":"Orders!D124/VLOOKUP(B124,Tools!A:C,3,0)","v":1.0301470588235293}]
[{"$f":"Orders!A125","v":"CT1427436"},{"$f":"VLOOKUP(A125,'Product-tool'!A:B,2,0)","v":"Tool 16"},{"$f":"Orders!B125/VLOOKUP(B125,Tools!A:C,3,0)","v":3.2058823529411765E-2},{"$f":"Orders!C125/VLOOKUP(B125,Tools!A:C,3,0)","v":3.7499999999999999E-2},{"$f":"Orders!D125/VLOOKUP(B125,Tools!A:C,3,0)","v":3.2352941176470591E-2}]
[{"$f":"Orders!A126","v":"CT1422602"},{"$f":"VLOOKUP(A126,'Product-tool'!A:B,2,0)","v":"Tool 13"},{"$f":"Orders!B126/VLOOKUP(B126,Tools!A:C,3,0)","v":1.9529166666666666},{"$f":"Orders!C126/VLOOKUP(B126,Tools!A:C,3,0)","v":2.4},{"$f":"Orders!D126/VLOOKUP(B126,Tools!A:C,3,0)","v":2.02}]
[{"$f":"Orders!A127","v":"CT1693771"},{"$f":"VLOOKUP(A127,'Product-tool'!A:B,2,0)","v":"Tool 19"},{"$f":"Orders!B127/VLOOKUP(B127,Tools!A:C,3,0)","v":1.0571400472069237},{"$f":"Orders!C127/VLOOKUP(B127,Tools!A:C,3,0)","v":1.3973249409913453},{"$f":"Orders!D127/VLOOKUP(B127,Tools!A:C,3,0)","v":1.1361132966168372}]
[{"$f":"Orders!A128","v":"CT2356543"},{"$f":"VLOOKUP(A128,'Product-tool'!A:B,2,0)","v":"Tool 18"},{"$f":"Orders!B128/VLOOKUP(B128,Tools!A:C,3,0)","v":1.1307142857142858},{"$f":"Orders!C128/VLOOKUP(B128,Tools!A:C,3,0)","v":1.3149999999999999},{"$f":"Orders!D128/VLOOKUP(B128,Tools!A:C,3,0)","v":1.1371428571428572}]
[{"$f":"Orders!A129","v":"CT2727204"},{"$f":"VLOOKUP(A129,'Product-tool'!A:B,2,0)","v":"Tool 11"},{"$f":"Orders!B129/VLOOKUP(B129,Tools!A:C,3,0)","v":2.5915354330708662},{"$f":"Orders!C129/VLOOKUP(B129,Tools!A:C,3,0)","v":1.8882874015748032},{"$f":"Orders!D129/VLOOKUP(B129,Tools!A:C,3,0)","v":2.1171259842519685}]
[{"$f":"Orders!A130","v":"CT2748008"},{"$f":"VLOOKUP(A130,'Product-tool'!A:B,2,0)","v":"Tool 20"},{"$f":"Orders!B130/VLOOKUP(B130,Tools!A:C,3,0)","v":6.7918488642309427E-2},{"$f":"Orders!C130/VLOOKUP(B130,Tools!A:C,3,0)","v":5.0206162335966073E-2},{"$f":"Orders!D130/VLOOKUP(B130,Tools!A:C,3,0)","v":5.5812941886175478E-2}]
[{"$f":"Orders!A131","v":"CT2882108"},{"$f":"VLOOKUP(A131,'Product-tool'!A:B,2,0)","v":"Tool 19"},{"$f":"Orders!B131/VLOOKUP(B131,Tools!A:C,3,0)","v":11.174763965381588},{"$f":"Orders!C131/VLOOKUP(B131,Tools!A:C,3,0)","v":9.5543863099921325},{"$f":"Orders!D131/VLOOKUP(B131,Tools!A:C,3,0)","v":9.7414437450826128}]
[{"$f":"Orders!A132","v":"CT2899279"},{"$f":"VLOOKUP(A132,'Product-tool'!A:B,2,0)","v":"Tool 11"},{"$f":"Orders!B132/VLOOKUP(B132,Tools!A:C,3,0)","v":0.81988188976377951},{"$f":"Orders!C132/VLOOKUP(B132,Tools!A:C,3,0)","v":0.92519685039370081},{"$f":"Orders!D132/VLOOKUP(B132,Tools!A:C,3,0)","v":0.8125}]
[{"$f":"Orders!A133","v":"CT2921184"},{"$f":"VLOOKUP(A133,'Product-tool'!A:B,2,0)","v":"Tool 15"},{"$f":"Orders!B133/VLOOKUP(B133,Tools!A:C,3,0)","v":3.0490909090909093},{"$f":"Orders!C133/VLOOKUP(B133,Tools!A:C,3,0)","v":3.7697727272727271},{"$f":"Orders!D133/VLOOKUP(B133,Tools!A:C,3,0)","v":3.1636363636363636}]
[{"$f":"Orders!A134","v":"CT2976643"},{"$f":"VLOOKUP(A134,'Product-tool'!A:B,2,0)","v":"Tool 18"},{"$f":"Orders!B134/VLOOKUP(B134,Tools!A:C,3,0)","v":0.39035714285714285},{"$f":"Orders!C134/VLOOKUP(B134,Tools!A:C,3,0)","v":0.61642857142857144},{"$f":"Orders!D134/VLOOKUP(B134,Tools!A:C,3,0)","v":0.46321428571428569}]
[{"$f":"Orders!A135","v":"CT3251740"},{"$f":"VLOOKUP(A135,'Product-tool'!A:B,2,0)","v":"Tool 18"},{"$f":"Orders!B135/VLOOKUP(B135,Tools!A:C,3,0)","v":2.0089285714285716},{"$f":"Orders!C135/VLOOKUP(B135,Tools!A:C,3,0)","v":2.2135714285714285},{"$f":"Orders!D135/VLOOKUP(B135,Tools!A:C,3,0)","v":1.9667857142857144}]
[{"$f":"Orders!A136","v":"CT3327591"},{"$f":"VLOOKUP(A136,'Product-tool'!A:B,2,0)","v":"Tool 20"},{"$f":"Orders!B136/VLOOKUP(B136,Tools!A:C,3,0)","v":2.1810372450314603},{"$f":"Orders!C136/VLOOKUP(B136,Tools!A:C,3,0)","v":3.6100014694871034},{"$f":"Orders!D136/VLOOKUP(B136,Tools!A:C,3,0)","v":2.6600346161504866}]
[{"$f":"Orders!A137","v":"CT3389630"},{"$f":"VLOOKUP(A137,'Product-tool'!A:B,2,0)","v":"Tool 3"},{"$f":"Orders!B137/VLOOKUP(B137,Tools!A:C,3,0)","v":0.33791666666666664},{"$f":"Orders!C137/VLOOKUP(B137,Tools!A:C,3,0)","v":0.55458333333333332},{"$f":"Orders!D137/VLOOKUP(B137,Tools!A:C,3,0)","v":0.41041666666666665}]
[{"$f":"Orders!A138","v":"CT3513686"},{"$f":"VLOOKUP(A138,'Product-tool'!A:B,2,0)","v":"Tool 15"},{"$f":"Orders!B138/VLOOKUP(B138,Tools!A:C,3,0)","v":1.7500000000000002E-2},{"$f":"Orders!C138/VLOOKUP(B138,Tools!A:C,3,0)","v":1.9772727272727272E-2},{"$f":"Orders!D138/VLOOKUP(B138,Tools!A:C,3,0)","v":1.7272727272727273E-2}]
[{"$f":"Orders!A139","v":"CT3676279"},{"$f":"VLOOKUP(A139,'Product-tool'!A:B,2,0)","v":"Tool 18"},{"$f":"Orders!B139/VLOOKUP(B139,Tools!A:C,3,0)","v":14.258928571428571},{"$f":"Orders!C139/VLOOKUP(B139,Tools!A:C,3,0)","v":14.701071428571428},{"$f":"Orders!D139/VLOOKUP(B139,Tools!A:C,3,0)","v":13.521428571428572}]
[{"$f":"Orders!A140","v":"CT3847465"},{"$f":"VLOOKUP(A140,'Product-tool'!A:B,2,0)","v":"Tool 8"},{"$f":"Orders!B140/VLOOKUP(B140,Tools!A:C,3,0)","v":26.37219387755102},{"$f":"Orders!C140/VLOOKUP(B140,Tools!A:C,3,0)","v":20.321683673469387},{"$f":"Orders!D140/VLOOKUP(B140,Tools!A:C,3,0)","v":22.021683673469386}]
[{"$f":"Orders!A141","v":"CT3866790"},{"$f":"VLOOKUP(A141,'Product-tool'!A:B,2,0)","v":"Tool 20"},{"$f":"Orders!B141/VLOOKUP(B141,Tools!A:C,3,0)","v":8.7042703980841889},{"$f":"Orders!C141/VLOOKUP(B141,Tools!A:C,3,0)","v":9.1635166139695237},{"$f":"Orders!D141/VLOOKUP(B141,Tools!A:C,3,0)","v":8.3362617766977163}]
[{"$f":"Orders!A142","v":"CT4394015"},{"$f":"VLOOKUP(A142,'Product-tool'!A:B,2,0)","v":"Tool 4"},{"$f":"Orders!B142/VLOOKUP(B142,Tools!A:C,3,0)","v":10.940620782726047},{"$f":"Orders!C142/VLOOKUP(B142,Tools!A:C,3,0)","v":16.394511920827711},{"$f":"Orders!D142/VLOOKUP(B142,Tools!A:C,3,0)","v":10.06072874493927}]
[{"$f":"Orders!A143","v":"CT4485707"},{"$f":"VLOOKUP(A143,'Product-tool'!A:B,2,0)","v":"Tool 19"},{"$f":"Orders!B143/VLOOKUP(B143,Tools!A:C,3,0)","v":5.7041699449252555E-3},{"$f":"Orders!C143/VLOOKUP(B143,Tools!A:C,3,0)","v":6.1959087332808813E-3},{"$f":"Orders!D143/VLOOKUP(B143,Tools!A:C,3,0)","v":5.5074744295830055E-3}]
[{"$f":"Orders!A144","v":"CT4625235"},{"$f":"VLOOKUP(A144,'Product-tool'!A:B,2,0)","v":"Tool 11"},{"$f":"Orders!B144/VLOOKUP(B144,Tools!A:C,3,0)","v":0.6067913385826772},{"$f":"Orders!C144/VLOOKUP(B144,Tools!A:C,3,0)","v":0.94438976377952755},{"$f":"Orders!D144/VLOOKUP(B144,Tools!A:C,3,0)","v":0.71407480314960625}]
[{"$f":"Orders!A145","v":"CT4696984"},{"$f":"VLOOKUP(A145,'Product-tool'!A:B,2,0)","v":"Tool 12"},{"$f":"Orders!B145/VLOOKUP(B145,Tools!A:C,3,0)","v":1.6025},{"$f":"Orders!C145/VLOOKUP(B145,Tools!A:C,3,0)","v":1.9570000000000001},{"$f":"Orders!D145/VLOOKUP(B145,Tools!A:C,3,0)","v":1.65225}]
[{"$f":"Orders!A146","v":"CT4766693"},{"$f":"VLOOKUP(A146,'Product-tool'!A:B,2,0)","v":"Tool 19"},{"$f":"Orders!B146/VLOOKUP(B146,Tools!A:C,3,0)","v":1.1767309205350118},{"$f":"Orders!C146/VLOOKUP(B146,Tools!A:C,3,0)","v":1.7845200629425648},{"$f":"Orders!D146/VLOOKUP(B146,Tools!A:C,3,0)","v":1.3642800944138473}]
[{"$f":"Orders!A147","v":"CT4972454"},{"$f":"VLOOKUP(A147,'Product-tool'!A:B,2,0)","v":"Tool 20"},{"$f":"Orders!B147/VLOOKUP(B147,Tools!A:C,3,0)","v":6.2858370098245437},{"$f":"Orders!C147/VLOOKUP(B147,Tools!A:C,3,0)","v":5.6473012751404683},{"$f":"Orders!D147/VLOOKUP(B147,Tools!A:C,3,0)","v":5.5982419540761361}]
[{"$f":"Orders!A148","v":"CT4983245"},{"$f":"VLOOKUP(A148,'Product-tool'!A:B,2,0)","v":"Tool 19"},{"$f":"Orders!B148/VLOOKUP(B148,Tools!A:C,3,0)","v":1.2588512981904012},{"$f":"Orders!C148/VLOOKUP(B148,Tools!A:C,3,0)","v":1.2031864673485444},{"$f":"Orders!D148/VLOOKUP(B148,Tools!A:C,3,0)","v":1.1525373721479151}]
[{"$f":"Orders!A149","v":"CT4998062"},{"$f":"VLOOKUP(A149,'Product-tool'!A:B,2,0)","v":"Tool 19"},{"$f":"Orders!B149/VLOOKUP(B149,Tools!A:C,3,0)","v":4.0912667191188044E-2},{"$f":"Orders!C149/VLOOKUP(B149,Tools!A:C,3,0)","v":3.589693154996066E-2},{"$f":"Orders!D149/VLOOKUP(B149,Tools!A:C,3,0)","v":3.6093627065302912E-2}]
[{"$f":"Orders!A150","v":"CT5306052"},{"$f":"VLOOKUP(A150,'Product-tool'!A:B,2,0)","v":"Tool 20"},{"$f":"Orders!B150/VLOOKUP(B150,Tools!A:C,3,0)","v":3.0582433910233141E-2},{"$f":"Orders!C150/VLOOKUP(B150,Tools!A:C,3,0)","v":2.9563019446558703E-2},{"$f":"Orders!D150/VLOOKUP(B150,Tools!A:C,3,0)","v":2.816132455900635E-2}]
[{"$f":"Orders!A151","v":"CT5312249"},{"$f":"VLOOKUP(A151,'Product-tool'!A:B,2,0)","v":"Tool 19"},{"$f":"Orders!B151/VLOOKUP(B151,Tools!A:C,3,0)","v":7.8678206136900079E-4},{"$f":"Orders!C151/VLOOKUP(B151,Tools!A:C,3,0)","v":1.0818253343823762E-3},{"$f":"Orders!D151/VLOOKUP(B151,Tools!A:C,3,0)","v":8.8512981904012588E-4}]
[{"$f":"Orders!A152","v":"CT5387974"},{"$f":"VLOOKUP(A152,'Product-tool'!A:B,2,0)","v":"Tool 10"},{"$f":"Orders!B152/VLOOKUP(B152,Tools!A:C,3,0)","v":5.1612903225806452E-3},{"$f":"Orders!C152/VLOOKUP(B152,Tools!A:C,3,0)","v":3.2258064516129032E-3},{"$f":"Orders!D152/VLOOKUP(B152,Tools!A:C,3,0)","v":3.8709677419354839E-3}]
[{"$f":"Orders!A153","v":"CT5424793"},{"$f":"VLOOKUP(A153,'Product-tool'!A:B,2,0)","v":"Tool 12"},{"$f":"Orders!B153/VLOOKUP(B153,Tools!A:C,3,0)","v":0.64100000000000001},{"$f":"Orders!C153/VLOOKUP(B153,Tools!A:C,3,0)","v":0.55625000000000002},{"$f":"Orders!D153/VLOOKUP(B153,Tools!A:C,3,0)","v":0.56225000000000003}]
[{"$f":"Orders!A154","v":"CT54540"},{"$f":"VLOOKUP(A154,'Product-tool'!A:B,2,0)","v":"Tool 15"},{"$f":"Orders!B154/VLOOKUP(B154,Tools!A:C,3,0)","v":4.1395454545454546},{"$f":"Orders!C154/VLOOKUP(B154,Tools!A:C,3,0)","v":4.375909090909091},{"$f":"Orders!D154/VLOOKUP(B154,Tools!A:C,3,0)","v":3.9722727272727272}]
[{"$f":"Orders!A155","v":"CT5587547"},{"$f":"VLOOKUP(A155,'Product-tool'!A:B,2,0)","v":"Tool 19"},{"$f":"Orders!B155/VLOOKUP(B155,Tools!A:C,3,0)","v":9.3430369787568836E-3},{"$f":"Orders!C155/VLOOKUP(B155,Tools!A:C,3,0)","v":7.7694728560188829E-3},{"$f":"Orders!D155/VLOOKUP(B155,Tools!A:C,3,0)","v":8.0645161290322578E-3}]
[{"$f":"Orders!A156","v":"CT5594793"},{"$f":"VLOOKUP(A156,'Product-tool'!A:B,2,0)","v":"Tool 18"},{"$f":"Orders!B156/VLOOKUP(B156,Tools!A:C,3,0)","v":0.375},{"$f":"Orders!C156/VLOOKUP(B156,Tools!A:C,3,0)","v":0.58535714285714291},{"$f":"Orders!D156/VLOOKUP(B156,Tools!A:C,3,0)","v":0.44214285714285712}]
[{"$f":"Orders!A157","v":"CT5668919"},{"$f":"VLOOKUP(A157,'Product-tool'!A:B,2,0)","v":"Tool 20"},{"$f":"Orders!B157/VLOOKUP(B157,Tools!A:C,3,0)","v":6.3203696747815161E-2},{"$f":"Orders!C157/VLOOKUP(B157,Tools!A:C,3,0)","v":6.0018026548832537E-2},{"$f":"Orders!D157/VLOOKUP(B157,Tools!A:C,3,0)","v":5.7724344005565052E-2}]
[{"$f":"Orders!A158","v":"CT5745169"},{"$f":"VLOOKUP(A158,'Product-tool'!A:B,2,0)","v":"Tool 12"},{"$f":"Orders!B158/VLOOKUP(B158,Tools!A:C,3,0)","v":5.0750000000000003E-2},{"$f":"Orders!C158/VLOOKUP(B158,Tools!A:C,3,0)","v":6.6250000000000003E-2},{"$f":"Orders!D158/VLOOKUP(B158,Tools!A:C,3,0)","v":5.425E-2}]
[{"$f":"Orders!A159","v":"CT5745914"},{"$f":"VLOOKUP(A159,'Product-tool'!A:B,2,0)","v":"Tool 12"},{"$f":"Orders!B159/VLOOKUP(B159,Tools!A:C,3,0)","v":0.39574999999999999},{"$f":"Orders!C159/VLOOKUP(B159,Tools!A:C,3,0)","v":0.41899999999999998},{"$f":"Orders!D159/VLOOKUP(B159,Tools!A:C,3,0)","v":0.38024999999999998}]
[{"$f":"Orders!A160","v":"CT5783436"},{"$f":"VLOOKUP(A160,'Product-tool'!A:B,2,0)","v":"Tool 20"},{"$f":"Orders!B160/VLOOKUP(B160,Tools!A:C,3,0)","v":3.4405238149012281E-3},{"$f":"Orders!C160/VLOOKUP(B160,Tools!A:C,3,0)","v":4.2050846626570573E-3},{"$f":"Orders!D160/VLOOKUP(B160,Tools!A:C,3,0)","v":3.567950622860533E-3}]
[{"$f":"Orders!A161","v":"CT5802839"},{"$f":"VLOOKUP(A161,'Product-tool'!A:B,2,0)","v":"Tool 19"},{"$f":"Orders!B161/VLOOKUP(B161,Tools!A:C,3,0)","v":0.11467348544453186},{"$f":"Orders!C161/VLOOKUP(B161,Tools!A:C,3,0)","v":0.14791502753737215},{"$f":"Orders!D161/VLOOKUP(B161,Tools!A:C,3,0)","v":0.12165617623918175}]
[{"$f":"Orders!A162","v":"CT5819298"},{"$f":"VLOOKUP(A162,'Product-tool'!A:B,2,0)","v":"Tool 20"},{"$f":"Orders!B162/VLOOKUP(B162,Tools!A:C,3,0)","v":2.5612788399820254E-2},{"$f":"Orders!C162/VLOOKUP(B162,Tools!A:C,3,0)","v":3.160184837390758E-2},{"$f":"Orders!D162/VLOOKUP(B162,Tools!A:C,3,0)","v":2.6632202863494693E-2}]
[{"$f":"Orders!A163","v":"CT5829315"},{"$f":"VLOOKUP(A163,'Product-tool'!A:B,2,0)","v":"Tool 18"},{"$f":"Orders!B163/VLOOKUP(B163,Tools!A:C,3,0)","v":0.11892857142857143},{"$f":"Orders!C163/VLOOKUP(B163,Tools!A:C,3,0)","v":9.2499999999999999E-2},{"$f":"Orders!D163/VLOOKUP(B163,Tools!A:C,3,0)","v":9.9642857142857144E-2}]
[{"$f":"Orders!A164","v":"CT5869387"},{"$f":"VLOOKUP(A164,'Product-tool'!A:B,2,0)","v":"Tool 19"},{"$f":"Orders!B164/VLOOKUP(B164,Tools!A:C,3,0)","v":0.70731707317073167},{"$f":"Orders!C164/VLOOKUP(B164,Tools!A:C,3,0)","v":1.0429779701022817},{"$f":"Orders!D164/VLOOKUP(B164,Tools!A:C,3,0)","v":0.80714004720692367}]
[{"$f":"Orders!A165","v":"CT588550"},{"$f":"VLOOKUP(A165,'Product-tool'!A:B,2,0)","v":"Tool 11"},{"$f":"Orders!B165/VLOOKUP(B165,Tools!A:C,3,0)","v":0.35531496062992124},{"$f":"Orders!C165/VLOOKUP(B165,Tools!A:C,3,0)","v":0.21751968503937008},{"$f":"Orders!D165/VLOOKUP(B165,Tools!A:C,3,0)","v":0.2721456692913386}]
[{"$f":"Orders!A166","v":"CT5885641"},{"$f":"VLOOKUP(A166,'Product-tool'!A:B,2,0)","v":"Tool 18"},{"$f":"Orders!B166/VLOOKUP(B166,Tools!A:C,3,0)","v":1.2378571428571428},{"$f":"Orders!C166/VLOOKUP(B166,Tools!A:C,3,0)","v":0.99750000000000005},{"$f":"Orders!D166/VLOOKUP(B166,Tools!A:C,3,0)","v":1.0528571428571429}]
[{"$f":"Orders!A167","v":"CT593521"},{"$f":"VLOOKUP(A167,'Product-tool'!A:B,2,0)","v":"Tool 18"},{"$f":"Orders!B167/VLOOKUP(B167,Tools!A:C,3,0)","v":20.7775},{"$f":"Orders!C167/VLOOKUP(B167,Tools!A:C,3,0)","v":25.833214285714284},{"$f":"Orders!D167/VLOOKUP(B167,Tools!A:C,3,0)","v":21.620714285714286}]
[{"$f":"Orders!A168","v":"CT5932817"},{"$f":"VLOOKUP(A168,'Product-tool'!A:B,2,0)","v":"Tool 20"},{"$f":"Orders!B168/VLOOKUP(B168,Tools!A:C,3,0)","v":1.6947765458587533E-2},{"$f":"Orders!C168/VLOOKUP(B168,Tools!A:C,3,0)","v":1.8094606730221275E-2},{"$f":"Orders!D168/VLOOKUP(B168,Tools!A:C,3,0)","v":1.6310631418791008E-2}]
[{"$f":"Orders!A169","v":"CT5982395"},{"$f":"VLOOKUP(A169,'Product-tool'!A:B,2,0)","v":"Tool 4"},{"$f":"Orders!B169/VLOOKUP(B169,Tools!A:C,3,0)","v":0.12370670265407108},{"$f":"Orders!C169/VLOOKUP(B169,Tools!A:C,3,0)","v":0.13360323886639677},{"$f":"Orders!D169/VLOOKUP(B169,Tools!A:C,3,0)","v":0.12010796221322537}]
[{"$f":"Orders!A170","v":"CT6358073"},{"$f":"VLOOKUP(A170,'Product-tool'!A:B,2,0)","v":"Tool 20"},{"$f":"Orders!B170/VLOOKUP(B170,Tools!A:C,3,0)","v":3.1856701989826188E-3},{"$f":"Orders!C170/VLOOKUP(B170,Tools!A:C,3,0)","v":3.4405238149012281E-3},{"$f":"Orders!D170/VLOOKUP(B170,Tools!A:C,3,0)","v":3.058243391023314E-3}]
[{"$f":"Orders!A171","v":"CT6438604"},{"$f":"VLOOKUP(A171,'Product-tool'!A:B,2,0)","v":"Tool 20"},{"$f":"Orders!B171/VLOOKUP(B171,Tools!A:C,3,0)","v":1.019414463674438E-3},{"$f":"Orders!C171/VLOOKUP(B171,Tools!A:C,3,0)","v":1.529121695511657E-3},{"$f":"Orders!D171/VLOOKUP(B171,Tools!A:C,3,0)","v":1.1468412716337428E-3}]
[{"$f":"Orders!A172","v":"CT6445143"},{"$f":"VLOOKUP(A172,'Product-tool'!A:B,2,0)","v":"Tool 20"},{"$f":"Orders!B172/VLOOKUP(B172,Tools!A:C,3,0)","v":0.57227379454523764},{"$f":"Orders!C172/VLOOKUP(B172,Tools!A:C,3,0)","v":0.8464962852736615},{"$f":"Orders!D172/VLOOKUP(B172,Tools!A:C,3,0)","v":0.65420923206307058}]
[{"$f":"Orders!A173","v":"CT823663"},{"$f":"VLOOKUP(A173,'Product-tool'!A:B,2,0)","v":"Tool 7"},{"$f":"Orders!B173/VLOOKUP(B173,Tools!A:C,3,0)","v":0.16921875},{"$f":"Orders!C173/VLOOKUP(B173,Tools!A:C,3,0)","v":0.125},{"$f":"Orders!D173/VLOOKUP(B173,Tools!A:C,3,0)","v":0.13890625000000001}]
[{"$f":"Orders!A174","v":"DA2128864"},{"$f":"VLOOKUP(A174,'Product-tool'!A:B,2,0)","v":"Tool 5"},{"$f":"Orders!B174/VLOOKUP(B174,Tools!A:C,3,0)","v":3.3333333333333335},{"$f":"Orders!C174/VLOOKUP(B174,Tools!A:C,3,0)","v":3.6233333333333335},{"$f":"Orders!D174/VLOOKUP(B174,Tools!A:C,3,0)","v":3.2416666666666667}]
[{"$f":"Orders!A175","v":"DA5685201"},{"$f":"VLOOKUP(A175,'Product-tool'!A:B,2,0)","v":"Tool 1"},{"$f":"Orders!B175/VLOOKUP(B175,Tools!A:C,3,0)","v":0.11083333333333334},{"$f":"Orders!C175/VLOOKUP(B175,Tools!A:C,3,0)","v":7.166666666666667E-2},{"$f":"Orders!D175/VLOOKUP(B175,Tools!A:C,3,0)","v":8.666666666666667E-2}]
[{"$f":"Orders!A176","v":"DP0098702"},{"$f":"VLOOKUP(A176,'Product-tool'!A:B,2,0)","v":"Tool 17"},{"$f":"Orders!B176/VLOOKUP(B176,Tools!A:C,3,0)","v":1.1439705882352942},{"$f":"Orders!C176/VLOOKUP(B176,Tools!A:C,3,0)","v":1.4747058823529411},{"$f":"Orders!D176/VLOOKUP(B176,Tools!A:C,3,0)","v":1.2130882352941177}]
[{"$f":"Orders!A177","v":"DP087138"},{"$f":"VLOOKUP(A177,'Product-tool'!A:B,2,0)","v":"Tool 14"},{"$f":"Orders!B177/VLOOKUP(B177,Tools!A:C,3,0)","v":13.049565217391304},{"$f":"Orders!C177/VLOOKUP(B177,Tools!A:C,3,0)","v":18.757391304347827},{"$f":"Orders!D177/VLOOKUP(B177,Tools!A:C,3,0)","v":14.68}]
[{"$f":"Orders!A178","v":"DP1792938"},{"$f":"VLOOKUP(A178,'Product-tool'!A:B,2,0)","v":"Tool 15"},{"$f":"Orders!B178/VLOOKUP(B178,Tools!A:C,3,0)","v":5.9227272727272728},{"$f":"Orders!C178/VLOOKUP(B178,Tools!A:C,3,0)","v":8.4431818181818183},{"$f":"Orders!D178/VLOOKUP(B178,Tools!A:C,3,0)","v":6.6322727272727269}]
[{"$f":"Orders!A179","v":"DP2403779"},{"$f":"VLOOKUP(A179,'Product-tool'!A:B,2,0)","v":"Tool 15"},{"$f":"Orders!B179/VLOOKUP(B179,Tools!A:C,3,0)","v":2.0168181818181816},{"$f":"Orders!C179/VLOOKUP(B179,Tools!A:C,3,0)","v":1.8002272727272728},{"$f":"Orders!D179/VLOOKUP(B179,Tools!A:C,3,0)","v":1.7911363636363635}]
[{"$f":"Orders!A180","v":"DP2404504"},{"$f":"VLOOKUP(A180,'Product-tool'!A:B,2,0)","v":"Tool 3"},{"$f":"Orders!B180/VLOOKUP(B180,Tools!A:C,3,0)","v":0.24291666666666667},{"$f":"Orders!C180/VLOOKUP(B180,Tools!A:C,3,0)","v":0.41125},{"$f":"Orders!D180/VLOOKUP(B180,Tools!A:C,3,0)","v":0.30041666666666667}]
[{"$f":"Orders!A181","v":"DP4769417"},{"$f":"VLOOKUP(A181,'Product-tool'!A:B,2,0)","v":"Tool 17"},{"$f":"Orders!B181/VLOOKUP(B181,Tools!A:C,3,0)","v":0.24132352941176471},{"$f":"Orders!C181/VLOOKUP(B181,Tools!A:C,3,0)","v":0.20029411764705882},{"$f":"Orders!D181/VLOOKUP(B181,Tools!A:C,3,0)","v":0.20779411764705882}]
[{"$f":"Orders!A182","v":"DP4764853"},{"$f":"VLOOKUP(A182,'Product-tool'!A:B,2,0)","v":"Tool 18"},{"$f":"Orders!B182/VLOOKUP(B182,Tools!A:C,3,0)","v":6.7539285714285713},{"$f":"Orders!C182/VLOOKUP(B182,Tools!A:C,3,0)","v":7.3525},{"$f":"Orders!D182/VLOOKUP(B182,Tools!A:C,3,0)","v":6.5739285714285716}]
[{"$f":"Orders!A183","v":"DP5007199"},{"$f":"VLOOKUP(A183,'Product-tool'!A:B,2,0)","v":"Tool 1"},{"$f":"Orders!B183/VLOOKUP(B183,Tools!A:C,3,0)","v":33.718333333333334},{"$f":"Orders!C183/VLOOKUP(B183,Tools!A:C,3,0)","v":32.737499999999997},{"$f":"Orders!D183/VLOOKUP(B183,Tools!A:C,3,0)","v":31.092500000000001}]
[{"$f":"Orders!A184","v":"DP5383174"},{"$f":"VLOOKUP(A184,'Product-tool'!A:B,2,0)","v":"Tool 1"},{"$f":"Orders!B184/VLOOKUP(B184,Tools!A:C,3,0)","v":4.0966666666666667},{"$f":"Orders!C184/VLOOKUP(B184,Tools!A:C,3,0)","v":4.3583333333333334},{"$f":"Orders!D184/VLOOKUP(B184,Tools!A:C,3,0)","v":3.9433333333333334}]
[{"$f":"Orders!A185","v":"DP5698799"},{"$f":"VLOOKUP(A185,'Product-tool'!A:B,2,0)","v":"Tool 1"},{"$f":"Orders!B185/VLOOKUP(B185,Tools!A:C,3,0)","v":0.82916666666666672},{"$f":"Orders!C185/VLOOKUP(B185,Tools!A:C,3,0)","v":0.53833333333333333},{"$f":"Orders!D185/VLOOKUP(B185,Tools!A:C,3,0)","v":0.64916666666666667}]
[{"$f":"Orders!A186","v":"DP5908334"},{"$f":"VLOOKUP(A186,'Product-tool'!A:B,2,0)","v":"Tool 1"},{"$f":"Orders!B186/VLOOKUP(B186,Tools!A:C,3,0)","v":29.489166666666666},{"$f":"Orders!C186/VLOOKUP(B186,Tools!A:C,3,0)","v":31.612500000000001},{"$f":"Orders!D186/VLOOKUP(B186,Tools!A:C,3,0)","v":28.489166666666666}]
[{"$f":"Orders!A187","v":"DP638679"},{"$f":"VLOOKUP(A187,'Product-tool'!A:B,2,0)","v":"Tool 18"},{"$f":"Orders!B187/VLOOKUP(B187,Tools!A:C,3,0)","v":3.3928571428571426E-2},{"$f":"Orders!C187/VLOOKUP(B187,Tools!A:C,3,0)","v":2.2142857142857141E-2},{"$f":"Orders!D187/VLOOKUP(B187,Tools!A:C,3,0)","v":2.6785714285714284E-2}]
[{"$f":"Orders!A188","v":"FR0061274"},{"$f":"VLOOKUP(A188,'Product-tool'!A:B,2,0)","v":"Tool 11"},{"$f":"Orders!B188/VLOOKUP(B188,Tools!A:C,3,0)","v":3.5433070866141732E-2},{"$f":"Orders!C188/VLOOKUP(B188,Tools!A:C,3,0)","v":3.3956692913385829E-2},{"$f":"Orders!D188/VLOOKUP(B188,Tools!A:C,3,0)","v":3.2480314960629919E-2}]
[{"$f":"Orders!A189","v":"FR009628"},{"$f":"VLOOKUP(A189,'Product-tool'!A:B,2,0)","v":"Tool 11"},{"$f":"Orders!B189/VLOOKUP(B189,Tools!A:C,3,0)","v":12.35728346456693},{"$f":"Orders!C189/VLOOKUP(B189,Tools!A:C,3,0)","v":19.562007874015748},{"$f":"Orders!D189/VLOOKUP(B189,Tools!A:C,3,0)","v":14.684055118110237}]
[{"$f":"Orders!A190","v":"FR0362571"},{"$f":"VLOOKUP(A190,'Product-tool'!A:B,2,0)","v":"Tool 11"},{"$f":"Orders!B190/VLOOKUP(B190,Tools!A:C,3,0)","v":6.8479330708661417},{"$f":"Orders!C190/VLOOKUP(B190,Tools!A:C,3,0)","v":8.4099409448818889},{"$f":"Orders!D190/VLOOKUP(B190,Tools!A:C,3,0)","v":7.0802165354330713}]
[{"$f":"Orders!A191","v":"FR0614261"},{"$f":"VLOOKUP(A191,'Product-tool'!A:B,2,0)","v":"Tool 11"},{"$f":"Orders!B191/VLOOKUP(B191,Tools!A:C,3,0)","v":1.123523622047244},{"$f":"Orders!C191/VLOOKUP(B191,Tools!A:C,3,0)","v":0.75492125984251968},{"$f":"Orders!D191/VLOOKUP(B191,Tools!A:C,3,0)","v":0.890255905511811}]
[{"$f":"Orders!A192","v":"FR0622263"},{"$f":"VLOOKUP(A192,'Product-tool'!A:B,2,0)","v":"Tool 11"},{"$f":"Orders!B192/VLOOKUP(B192,Tools!A:C,3,0)","v":0.26230314960629919},{"$f":"Orders!C192/VLOOKUP(B192,Tools!A:C,3,0)","v":0.38533464566929132},{"$f":"Orders!D192/VLOOKUP(B192,Tools!A:C,3,0)","v":0.29872047244094491}]
[{"$f":"Orders!A193","v":"FR066151"},{"$f":"VLOOKUP(A193,'Product-tool'!A:B,2,0)","v":"Tool 4"},{"$f":"Orders!B193/VLOOKUP(B193,Tools!A:C,3,0)","v":0.61718398560503829},{"$f":"Orders!C193/VLOOKUP(B193,Tools!A:C,3,0)","v":1.0566801619433199},{"$f":"Orders!D193/VLOOKUP(B193,Tools!A:C,3,0)","v":0.76788124156545212}]
[{"$f":"Orders!A194","v":"FR0667973"},{"$f":"VLOOKUP(A194,'Product-tool'!A:B,2,0)","v":"Tool 11"},{"$f":"Orders!B194/VLOOKUP(B194,Tools!A:C,3,0)","v":0.81988188976377951},{"$f":"Orders!C194/VLOOKUP(B194,Tools!A:C,3,0)","v":0.89960629921259838},{"$f":"Orders!D194/VLOOKUP(B194,Tools!A:C,3,0)","v":0.80118110236220474}]
[{"$f":"Orders!A195","v":"FR0679719"},{"$f":"VLOOKUP(A195,'Product-tool'!A:B,2,0)","v":"Tool 10"},{"$f":"Orders!B195/VLOOKUP(B195,Tools!A:C,3,0)","v":6.9677419354838704E-2},{"$f":"Orders!C195/VLOOKUP(B195,Tools!A:C,3,0)","v":4.0645161290322578E-2},{"$f":"Orders!D195/VLOOKUP(B195,Tools!A:C,3,0)","v":5.2258064516129035E-2}]
[{"$f":"Orders!A196","v":"FR0696557"},{"$f":"VLOOKUP(A196,'Product-tool'!A:B,2,0)","v":"Tool 15"},{"$f":"Orders!B196/VLOOKUP(B196,Tools!A:C,3,0)","v":0.4209090909090909},{"$f":"Orders!C196/VLOOKUP(B196,Tools!A:C,3,0)","v":0.71840909090909089},{"$f":"Orders!D196/VLOOKUP(B196,Tools!A:C,3,0)","v":0.52295454545454545}]
[{"$f":"Orders!A197","v":"FR0905418"},{"$f":"VLOOKUP(A197,'Product-tool'!A:B,2,0)","v":"Tool 15"},{"$f":"Orders!B197/VLOOKUP(B197,Tools!A:C,3,0)","v":0.61363636363636365},{"$f":"Orders!C197/VLOOKUP(B197,Tools!A:C,3,0)","v":0.81045454545454543},{"$f":"Orders!D197/VLOOKUP(B197,Tools!A:C,3,0)","v":0.65909090909090906}]
[{"$f":"Orders!A198","v":"FR0919209"},{"$f":"VLOOKUP(A198,'Product-tool'!A:B,2,0)","v":"Tool 11"},{"$f":"Orders!B198/VLOOKUP(B198,Tools!A:C,3,0)","v":1.6574803149606299},{"$f":"Orders!C198/VLOOKUP(B198,Tools!A:C,3,0)","v":1.0989173228346456},{"$f":"Orders!D198/VLOOKUP(B198,Tools!A:C,3,0)","v":1.3065944881889764}]
[{"$f":"Orders!A199","v":"FR0935436"},{"$f":"VLOOKUP(A199,'Product-tool'!A:B,2,0)","v":"Tool 11"},{"$f":"Orders!B199/VLOOKUP(B199,Tools!A:C,3,0)","v":5.7578740157480317E-2},{"$f":"Orders!C199/VLOOKUP(B199,Tools!A:C,3,0)","v":9.2519685039370081E-2},{"$f":"Orders!D199/VLOOKUP(B199,Tools!A:C,3,0)","v":6.9389763779527561E-2}]
[{"$f":"Orders!A200","v":"FR1379592"},{"$f":"VLOOKUP(A200,'Product-tool'!A:B,2,0)","v":"Tool 15"},{"$f":"Orders!B200/VLOOKUP(B200,Tools!A:C,3,0)","v":0.18681818181818183},{"$f":"Orders!C200/VLOOKUP(B200,Tools!A:C,3,0)","v":0.15909090909090909},{"$f":"Orders!D200/VLOOKUP(B200,Tools!A:C,3,0)","v":0.16272727272727272}]
[{"$f":"Orders!A201","v":"FR141742"},{"$f":"VLOOKUP(A201,'Product-tool'!A:B,2,0)","v":"Tool 15"},{"$f":"Orders!B201/VLOOKUP(B201,Tools!A:C,3,0)","v":1.8863636363636364E-2},{"$f":"Orders!C201/VLOOKUP(B201,Tools!A:C,3,0)","v":2.7045454545454546E-2},{"$f":"Orders!D201/VLOOKUP(B201,Tools!A:C,3,0)","v":2.1136363636363637E-2}]
[{"$f":"Orders!A202","v":"FR1415438"},{"$f":"VLOOKUP(A202,'Product-tool'!A:B,2,0)","v":"Tool 11"},{"$f":"Orders!B202/VLOOKUP(B202,Tools!A:C,3,0)","v":0.98425196850393704},{"$f":"Orders!C202/VLOOKUP(B202,Tools!A:C,3,0)","v":1.1894685039370079},{"$f":"Orders!D202/VLOOKUP(B202,Tools!A:C,3,0)","v":1.0093503937007875}]
[{"$f":"Orders!A203","v":"FR1452826"},{"$f":"VLOOKUP(A203,'Product-tool'!A:B,2,0)","v":"Tool 18"},{"$f":"Orders!B203/VLOOKUP(B203,Tools!A:C,3,0)","v":2.8571428571428571E-3},{"$f":"Orders!C203/VLOOKUP(B203,Tools!A:C,3,0)","v":3.9285714285714288E-3},{"$f":"Orders!D203/VLOOKUP(B203,Tools!A:C,3,0)","v":3.2142857142857142E-3}]
[{"$f":"Orders!A204","v":"FR1615194"},{"$f":"VLOOKUP(A204,'Product-tool'!A:B,2,0)","v":"Tool 15"},{"$f":"Orders!B204/VLOOKUP(B204,Tools!A:C,3,0)","v":1.8863636363636364E-2},{"$f":"Orders!C204/VLOOKUP(B204,Tools!A:C,3,0)","v":1.2954545454545455E-2},{"$f":"Orders!D204/VLOOKUP(B204,Tools!A:C,3,0)","v":1.4999999999999999E-2}]
[{"$f":"Orders!A205","v":"FR219333"},{"$f":"VLOOKUP(A205,'Product-tool'!A:B,2,0)","v":"Tool 19"},{"$f":"Orders!B205/VLOOKUP(B205,Tools!A:C,3,0)","v":1.4063729346970888E-2},{"$f":"Orders!C205/VLOOKUP(B205,Tools!A:C,3,0)","v":9.5397324940991353E-3},{"$f":"Orders!D205/VLOOKUP(B205,Tools!A:C,3,0)","v":1.1211644374508261E-2}]
[{"$f":"Orders!A206","v":"FR2345868"},{"$f":"VLOOKUP(A206,'Product-tool'!A:B,2,0)","v":"Tool 15"},{"$f":"Orders!B206/VLOOKUP(B206,Tools!A:C,3,0)","v":0.49227272727272725},{"$f":"Orders!C206/VLOOKUP(B206,Tools!A:C,3,0)","v":0.29659090909090907},{"$f":"Orders!D206/VLOOKUP(B206,Tools!A:C,3,0)","v":0.37522727272727274}]
[{"$f":"Orders!A207","v":"FR2492515"},{"$f":"VLOOKUP(A207,'Product-tool'!A:B,2,0)","v":"Tool 19"},{"$f":"Orders!B207/VLOOKUP(B207,Tools!A:C,3,0)","v":0.19669551534225019},{"$f":"Orders!C207/VLOOKUP(B207,Tools!A:C,3,0)","v":0.16787962234461054},{"$f":"Orders!D207/VLOOKUP(B207,Tools!A:C,3,0)","v":0.17132179386309992}]
[{"$f":"Orders!A208","v":"FR2795111"},{"$f":"VLOOKUP(A208,'Product-tool'!A:B,2,0)","v":"Tool 11"},{"$f":"Orders!B208/VLOOKUP(B208,Tools!A:C,3,0)","v":8.1692913385826765E-2},{"$f":"Orders!C208/VLOOKUP(B208,Tools!A:C,3,0)","v":9.2027559055118113E-2},{"$f":"Orders!D208/VLOOKUP(B208,Tools!A:C,3,0)","v":8.1200787401574798E-2}]
[{"$f":"Orders!A209","v":"FR2815273"},{"$f":"VLOOKUP(A209,'Product-tool'!A:B,2,0)","v":"Tool 11"},{"$f":"Orders!B209/VLOOKUP(B209,Tools!A:C,3,0)","v":12.415846456692913},{"$f":"Orders!C209/VLOOKUP(B209,Tools!A:C,3,0)","v":19.041338582677167},{"$f":"Orders!D209/VLOOKUP(B209,Tools!A:C,3,0)","v":14.486712598425196}]
[{"$f":"Orders!A210","v":"FR2948803"},{"$f":"VLOOKUP(A210,'Product-tool'!A:B,2,0)","v":"Tool 11"},{"$f":"Orders!B210/VLOOKUP(B210,Tools!A:C,3,0)","v":0.32283464566929132},{"$f":"Orders!C210/VLOOKUP(B210,Tools!A:C,3,0)","v":0.34596456692913385},{"$f":"Orders!D210/VLOOKUP(B210,Tools!A:C,3,0)","v":0.31200787401574803}]
[{"$f":"Orders!A211","v":"FR317601"},{"$f":"VLOOKUP(A211,'Product-tool'!A:B,2,0)","v":"Tool 11"},{"$f":"Orders!B211/VLOOKUP(B211,Tools!A:C,3,0)","v":0.25098425196850394},{"$f":"Orders!C211/VLOOKUP(B211,Tools!A:C,3,0)","v":0.30856299212598426},{"$f":"Orders!D211/VLOOKUP(B211,Tools!A:C,3,0)","v":0.25984251968503935}]
[{"$f":"Orders!A212","v":"FR3359591"},{"$f":"VLOOKUP(A212,'Product-tool'!A:B,2,0)","v":"Tool 19"},{"$f":"Orders!B212/VLOOKUP(B212,Tools!A:C,3,0)","v":7.8678206136900079E-4},{"$f":"Orders!C212/VLOOKUP(B212,Tools!A:C,3,0)","v":1.0818253343823762E-3},{"$f":"Orders!D212/VLOOKUP(B212,Tools!A:C,3,0)","v":8.8512981904012588E-4}]
[{"$f":"Orders!A213","v":"FR3467978"},{"$f":"VLOOKUP(A213,'Product-tool'!A:B,2,0)","v":"Tool 18"},{"$f":"Orders!B213/VLOOKUP(B213,Tools!A:C,3,0)","v":0.88678571428571429},{"$f":"Orders!C213/VLOOKUP(B213,Tools!A:C,3,0)","v":0.87785714285714289},{"$f":"Orders!D213/VLOOKUP(B213,Tools!A:C,3,0)","v":0.82499999999999996}]
[{"$f":"Orders!A214","v":"FR3576193"},{"$f":"VLOOKUP(A214,'Product-tool'!A:B,2,0)","v":"Tool 11"},{"$f":"Orders!B214/VLOOKUP(B214,Tools!A:C,3,0)","v":1.7578740157480315},{"$f":"Orders!C214/VLOOKUP(B214,Tools!A:C,3,0)","v":2.7559055118110236},{"$f":"Orders!D214/VLOOKUP(B214,Tools!A:C,3,0)","v":2.0772637795275593}]
[{"$f":"Orders!A215","v":"FR3597468"},{"$f":"VLOOKUP(A215,'Product-tool'!A:B,2,0)","v":"Tool 19"},{"$f":"Orders!B215/VLOOKUP(B215,Tools!A:C,3,0)","v":3.6880409126671912E-2},{"$f":"Orders!C215/VLOOKUP(B215,Tools!A:C,3,0)","v":6.2647521636506692E-2},{"$f":"Orders!D215/VLOOKUP(B215,Tools!A:C,3,0)","v":4.5633359559402044E-2}]
[{"$f":"Orders!A216","v":"FR3659141"},{"$f":"VLOOKUP(A216,'Product-tool'!A:B,2,0)","v":"Tool 11"},{"$f":"Orders!B216/VLOOKUP(B216,Tools!A:C,3,0)","v":7.4311023622047251E-2},{"$f":"Orders!C216/VLOOKUP(B216,Tools!A:C,3,0)","v":0.10187007874015748},{"$f":"Orders!D216/VLOOKUP(B216,Tools!A:C,3,0)","v":8.1200787401574798E-2}]
[{"$f":"Orders!A217","v":"FR378786"},{"$f":"VLOOKUP(A217,'Product-tool'!A:B,2,0)","v":"Tool 11"},{"$f":"Orders!B217/VLOOKUP(B217,Tools!A:C,3,0)","v":5.3887795275590555},{"$f":"Orders!C217/VLOOKUP(B217,Tools!A:C,3,0)","v":4.5826771653543306},{"$f":"Orders!D217/VLOOKUP(B217,Tools!A:C,3,0)","v":4.6870078740157481}]
[{"$f":"Orders!A218","v":"FR3966167"},{"$f":"VLOOKUP(A218,'Product-tool'!A:B,2,0)","v":"Tool 3"},{"$f":"Orders!B218/VLOOKUP(B218,Tools!A:C,3,0)","v":3.3333333333333335E-3},{"$f":"Orders!C218/VLOOKUP(B218,Tools!A:C,3,0)","v":2.0833333333333333E-3},{"$f":"Orders!D218/VLOOKUP(B218,Tools!A:C,3,0)","v":2.5000000000000001E-3}]
[{"$f":"Orders!A219","v":"FR3998413"},{"$f":"VLOOKUP(A219,'Product-tool'!A:B,2,0)","v":"Tool 15"},{"$f":"Orders!B219/VLOOKUP(B219,Tools!A:C,3,0)","v":0.11363636363636363},{"$f":"Orders!C219/VLOOKUP(B219,Tools!A:C,3,0)","v":0.18022727272727274},{"$f":"Orders!D219/VLOOKUP(B219,Tools!A:C,3,0)","v":0.13522727272727272}]
[{"$f":"Orders!A220","v":"FR4374057"},{"$f":"VLOOKUP(A220,'Product-tool'!A:B,2,0)","v":"Tool 19"},{"$f":"Orders!B220/VLOOKUP(B220,Tools!A:C,3,0)","v":8.1628638867033837E-3},{"$f":"Orders!C220/VLOOKUP(B220,Tools!A:C,3,0)","v":9.8347757671125094E-3},{"$f":"Orders!D220/VLOOKUP(B220,Tools!A:C,3,0)","v":8.3595594020456337E-3}]
[{"$f":"Orders!A221","v":"FR4526775"},{"$f":"VLOOKUP(A221,'Product-tool'!A:B,2,0)","v":"Tool 11"},{"$f":"Orders!B221/VLOOKUP(B221,Tools!A:C,3,0)","v":4.0846456692913383E-2},{"$f":"Orders!C221/VLOOKUP(B221,Tools!A:C,3,0)","v":3.1988188976377951E-2},{"$f":"Orders!D221/VLOOKUP(B221,Tools!A:C,3,0)","v":3.4448818897637797E-2}]
[{"$f":"Orders!A222","v":"FR4539511"},{"$f":"VLOOKUP(A222,'Product-tool'!A:B,2,0)","v":"Tool 11"},{"$f":"Orders!B222/VLOOKUP(B222,Tools!A:C,3,0)","v":4.0846456692913383E-2},{"$f":"Orders!C222/VLOOKUP(B222,Tools!A:C,3,0)","v":4.2322834645669292E-2},{"$f":"Orders!D222/VLOOKUP(B222,Tools!A:C,3,0)","v":3.8877952755905512E-2}]
[{"$f":"Orders!A223","v":"FR457233"},{"$f":"VLOOKUP(A223,'Product-tool'!A:B,2,0)","v":"Tool 18"},{"$f":"Orders!B223/VLOOKUP(B223,Tools!A:C,3,0)","v":0.12178571428571429},{"$f":"Orders!C223/VLOOKUP(B223,Tools!A:C,3,0)","v":0.17749999999999999},{"$f":"Orders!D223/VLOOKUP(B223,Tools!A:C,3,0)","v":0.13821428571428571}]
[{"$f":"Orders!A224","v":"FR4624850"},{"$f":"VLOOKUP(A224,'Product-tool'!A:B,2,0)","v":"Tool 11"},{"$f":"Orders!B224/VLOOKUP(B224,Tools!A:C,3,0)","v":1.4350393700787401},{"$f":"Orders!C224/VLOOKUP(B224,Tools!A:C,3,0)","v":0.93405511811023623},{"$f":"Orders!D224/VLOOKUP(B224,Tools!A:C,3,0)","v":1.123523622047244}]
[{"$f":"Orders!A225","v":"FR4897160"},{"$f":"VLOOKUP(A225,'Product-tool'!A:B,2,0)","v":"Tool 15"},{"$f":"Orders!B225/VLOOKUP(B225,Tools!A:C,3,0)","v":6.3636363636363638E-3},{"$f":"Orders!C225/VLOOKUP(B225,Tools!A:C,3,0)","v":7.4999999999999997E-3},{"$f":"Orders!D225/VLOOKUP(B225,Tools!A:C,3,0)","v":6.5909090909090908E-3}]
[{"$f":"Orders!A226","v":"FR4954051"},{"$f":"VLOOKUP(A226,'Product-tool'!A:B,2,0)","v":"Tool 19"},{"$f":"Orders!B226/VLOOKUP(B226,Tools!A:C,3,0)","v":1.5735641227380016E-3},{"$f":"Orders!C226/VLOOKUP(B226,Tools!A:C,3,0)","v":1.3768686073957514E-3},{"$f":"Orders!D226/VLOOKUP(B226,Tools!A:C,3,0)","v":1.3768686073957514E-3}]
[{"$f":"Orders!A227","v":"FR4965335"},{"$f":"VLOOKUP(A227,'Product-tool'!A:B,2,0)","v":"Tool 11"},{"$f":"Orders!B227/VLOOKUP(B227,Tools!A:C,3,0)","v":0.63976377952755903},{"$f":"Orders!C227/VLOOKUP(B227,Tools!A:C,3,0)","v":0.90994094488188981},{"$f":"Orders!D227/VLOOKUP(B227,Tools!A:C,3,0)","v":0.71555118110236215}]
[{"$f":"Orders!A228","v":"FR5342502"},{"$f":"VLOOKUP(A228,'Product-tool'!A:B,2,0)","v":"Tool 11"},{"$f":"Orders!B228/VLOOKUP(B228,Tools!A:C,3,0)","v":1.1058070866141732},{"$f":"Orders!C228/VLOOKUP(B228,Tools!A:C,3,0)","v":1.3144685039370079},{"$f":"Orders!D228/VLOOKUP(B228,Tools!A:C,3,0)","v":1.1245078740157479}]
[{"$f":"Orders!A229","v":"FR5371365"},{"$f":"VLOOKUP(A229,'Product-tool'!A:B,2,0)","v":"Tool 15"},{"$f":"Orders!B229/VLOOKUP(B229,Tools!A:C,3,0)","v":5.113636363636364E-2},{"$f":"Orders!C229/VLOOKUP(B229,Tools!A:C,3,0)","v":4.0909090909090909E-2},{"$f":"Orders!D229/VLOOKUP(B229,Tools!A:C,3,0)","v":4.3409090909090911E-2}]
[{"$f":"Orders!A230","v":"FR5384444"},{"$f":"VLOOKUP(A230,'Product-tool'!A:B,2,0)","v":"Tool 11"},{"$f":"Orders!B230/VLOOKUP(B230,Tools!A:C,3,0)","v":0.71751968503937003},{"$f":"Orders!C230/VLOOKUP(B230,Tools!A:C,3,0)","v":1.0590551181102361},{"$f":"Orders!D230/VLOOKUP(B230,Tools!A:C,3,0)","v":0.81938976377952755}]
[{"$f":"Orders!A231","v":"FR5404360"},{"$f":"VLOOKUP(A231,'Product-tool'!A:B,2,0)","v":"Tool 19"},{"$f":"Orders!B231/VLOOKUP(B231,Tools!A:C,3,0)","v":7.8678206136900079E-4},{"$f":"Orders!C231/VLOOKUP(B231,Tools!A:C,3,0)","v":1.2785208497246264E-3},{"$f":"Orders!D231/VLOOKUP(B231,Tools!A:C,3,0)","v":9.8347757671125098E-4}]
[{"$f":"Orders!A232","v":"FR5454864"},{"$f":"VLOOKUP(A232,'Product-tool'!A:B,2,0)","v":"Tool 11"},{"$f":"Orders!B232/VLOOKUP(B232,Tools!A:C,3,0)","v":0.22539370078740156},{"$f":"Orders!C232/VLOOKUP(B232,Tools!A:C,3,0)","v":0.25935039370078738},{"$f":"Orders!D232/VLOOKUP(B232,Tools!A:C,3,0)","v":0.22539370078740156}]
[{"$f":"Orders!A233","v":"FR5608301"},{"$f":"VLOOKUP(A233,'Product-tool'!A:B,2,0)","v":"Tool 11"},{"$f":"Orders!B233/VLOOKUP(B233,Tools!A:C,3,0)","v":7.874015748031496E-3},{"$f":"Orders!C233/VLOOKUP(B233,Tools!A:C,3,0)","v":9.8425196850393699E-3},{"$f":"Orders!D233/VLOOKUP(B233,Tools!A:C,3,0)","v":8.3661417322834653E-3}]
[{"$f":"Orders!A234","v":"FR5664727"},{"$f":"VLOOKUP(A234,'Product-tool'!A:B,2,0)","v":"Tool 11"},{"$f":"Orders!B234/VLOOKUP(B234,Tools!A:C,3,0)","v":8.1692913385826765E-2},{"$f":"Orders!C234/VLOOKUP(B234,Tools!A:C,3,0)","v":8.4645669291338585E-2},{"$f":"Orders!D234/VLOOKUP(B234,Tools!A:C,3,0)","v":7.7755905511811024E-2}]
[{"$f":"Orders!A235","v":"FR5671746"},{"$f":"VLOOKUP(A235,'Product-tool'!A:B,2,0)","v":"Tool 15"},{"$f":"Orders!B235/VLOOKUP(B235,Tools!A:C,3,0)","v":0.22500000000000001},{"$f":"Orders!C235/VLOOKUP(B235,Tools!A:C,3,0)","v":0.34795454545454546},{"$f":"Orders!D235/VLOOKUP(B235,Tools!A:C,3,0)","v":0.26386363636363636}]
[{"$f":"Orders!A236","v":"FR5682241"},{"$f":"VLOOKUP(A236,'Product-tool'!A:B,2,0)","v":"Tool 11"},{"$f":"Orders!B236/VLOOKUP(B236,Tools!A:C,3,0)","v":9.8425196850393699E-3},{"$f":"Orders!C236/VLOOKUP(B236,Tools!A:C,3,0)","v":1.2303149606299213E-2},{"$f":"Orders!D236/VLOOKUP(B236,Tools!A:C,3,0)","v":1.0334645669291339E-2}]
[{"$f":"Orders!A237","v":"FR5684287"},{"$f":"VLOOKUP(A237,'Product-tool'!A:B,2,0)","v":"Tool 11"},{"$f":"Orders!B237/VLOOKUP(B237,Tools!A:C,3,0)","v":0.21210629921259844},{"$f":"Orders!C237/VLOOKUP(B237,Tools!A:C,3,0)","v":0.20374015748031496},{"$f":"Orders!D237/VLOOKUP(B237,Tools!A:C,3,0)","v":0.19438976377952755}]
[{"$f":"Orders!A238","v":"FR5744950"},{"$f":"VLOOKUP(A238,'Product-tool'!A:B,2,0)","v":"Tool 11"},{"$f":"Orders!B238/VLOOKUP(B238,Tools!A:C,3,0)","v":0.39271653543307089},{"$f":"Orders!C238/VLOOKUP(B238,Tools!A:C,3,0)","v":0.4611220472440945},{"$f":"Orders!D238/VLOOKUP(B238,Tools!A:C,3,0)","v":0.39665354330708663}]
[{"$f":"Orders!A239","v":"FR5796610"},{"$f":"VLOOKUP(A239,'Product-tool'!A:B,2,0)","v":"Tool 11"},{"$f":"Orders!B239/VLOOKUP(B239,Tools!A:C,3,0)","v":1.3597440944881889},{"$f":"Orders!C239/VLOOKUP(B239,Tools!A:C,3,0)","v":1.5526574803149606},{"$f":"Orders!D239/VLOOKUP(B239,Tools!A:C,3,0)","v":1.3553149606299213}]
[{"$f":"Orders!A240","v":"FR5894727"},{"$f":"VLOOKUP(A240,'Product-tool'!A:B,2,0)","v":"Tool 11"},{"$f":"Orders!B240/VLOOKUP(B240,Tools!A:C,3,0)","v":0.17224409448818898},{"$f":"Orders!C240/VLOOKUP(B240,Tools!A:C,3,0)","v":0.28444881889763779},{"$f":"Orders!D240/VLOOKUP(B240,Tools!A:C,3,0)","v":0.20964566929133857}]
[{"$f":"Orders!A241","v":"FR5931113"},{"$f":"VLOOKUP(A241,'Product-tool'!A:B,2,0)","v":"Tool 17"},{"$f":"Orders!B241/VLOOKUP(B241,Tools!A:C,3,0)","v":0.21249999999999999},{"$f":"Orders!C241/VLOOKUP(B241,Tools!A:C,3,0)","v":0.29558823529411765},{"$f":"Orders!D241/VLOOKUP(B241,Tools!A:C,3,0)","v":0.23470588235294118}]
[{"$f":"Orders!A242","v":"FR5935871"},{"$f":"VLOOKUP(A242,'Product-tool'!A:B,2,0)","v":"Tool 11"},{"$f":"Orders!B242/VLOOKUP(B242,Tools!A:C,3,0)","v":0.90206692913385822},{"$f":"Orders!C242/VLOOKUP(B242,Tools!A:C,3,0)","v":1.2795275590551181},{"$f":"Orders!D242/VLOOKUP(B242,Tools!A:C,3,0)","v":1.0073818897637796}]
[{"$f":"Orders!A243","v":"FR5969812"},{"$f":"VLOOKUP(A243,'Product-tool'!A:B,2,0)","v":"Tool 11"},{"$f":"Orders!B243/VLOOKUP(B243,Tools!A:C,3,0)","v":7.8129921259842519},{"$f":"Orders!C243/VLOOKUP(B243,Tools!A:C,3,0)","v":13.788877952755906},{"$f":"Orders!D243/VLOOKUP(B243,Tools!A:C,3,0)","v":16.068405511811022}]
[{"$f":"Orders!A244","v":"FR5979463"},{"$f":"VLOOKUP(A244,'Product-tool'!A:B,2,0)","v":"Tool 11"},{"$f":"Orders!B244/VLOOKUP(B244,Tools!A:C,3,0)","v":0.91830708661417326},{"$f":"Orders!C244/VLOOKUP(B244,Tools!A:C,3,0)","v":0.80068897637795278},{"$f":"Orders!D244/VLOOKUP(B244,Tools!A:C,3,0)","v":0.80757874015748032}]
[{"$f":"Orders!A245","v":"FR5992952"},{"$f":"VLOOKUP(A245,'Product-tool'!A:B,2,0)","v":"Tool 11"},{"$f":"Orders!B245/VLOOKUP(B245,Tools!A:C,3,0)","v":1.6417322834645669},{"$f":"Orders!C245/VLOOKUP(B245,Tools!A:C,3,0)","v":1.8774606299212599},{"$f":"Orders!D245/VLOOKUP(B245,Tools!A:C,3,0)","v":1.6373031496062993}]
[{"$f":"Orders!A246","v":"FR6818423"},{"$f":"VLOOKUP(A246,'Product-tool'!A:B,2,0)","v":"Tool 14"},{"$f":"Orders!B246/VLOOKUP(B246,Tools!A:C,3,0)","v":1.2795652173913044},{"$f":"Orders!C246/VLOOKUP(B246,Tools!A:C,3,0)","v":1.7269565217391305},{"$f":"Orders!D246/VLOOKUP(B246,Tools!A:C,3,0)","v":1.3908695652173912}]
[{"$f":"Orders!A247","v":"GF0013491"},{"$f":"VLOOKUP(A247,'Product-tool'!A:B,2,0)","v":"Tool 14"},{"$f":"Orders!B247/VLOOKUP(B247,Tools!A:C,3,0)","v":0.18086956521739131},{"$f":"Orders!C247/VLOOKUP(B247,Tools!A:C,3,0)","v":0.21782608695652175},{"$f":"Orders!D247/VLOOKUP(B247,Tools!A:C,3,0)","v":0.18521739130434783}]
[{"$f":"Orders!A248","v":"GF0149565"},{"$f":"VLOOKUP(A248,'Product-tool'!A:B,2,0)","v":"Tool 14"},{"$f":"Orders!B248/VLOOKUP(B248,Tools!A:C,3,0)","v":0.84217391304347822},{"$f":"Orders!C248/VLOOKUP(B248,Tools!A:C,3,0)","v":1.3639130434782609},{"$f":"Orders!D248/VLOOKUP(B248,Tools!A:C,3,0)","v":1.0143478260869565}]
[{"$f":"Orders!A249","v":"GF1114780"},{"$f":"VLOOKUP(A249,'Product-tool'!A:B,2,0)","v":"Tool 17"},{"$f":"Orders!B249/VLOOKUP(B249,Tools!A:C,3,0)","v":2.5000000000000001E-3},{"$f":"Orders!C249/VLOOKUP(B249,Tools!A:C,3,0)","v":3.6764705882352941E-3},{"$f":"Orders!D249/VLOOKUP(B249,Tools!A:C,3,0)","v":2.9411764705882353E-3}]
[{"$f":"Orders!A250","v":"GF1349895"},{"$f":"VLOOKUP(A250,'Product-tool'!A:B,2,0)","v":"Tool 14"},{"$f":"Orders!B250/VLOOKUP(B250,Tools!A:C,3,0)","v":7.2173913043478255E-2},{"$f":"Orders!C250/VLOOKUP(B250,Tools!A:C,3,0)","v":8.9130434782608695E-2},{"$f":"Orders!D250/VLOOKUP(B250,Tools!A:C,3,0)","v":7.5217391304347819E-2}]
[{"$f":"Orders!A251","v":"GF1438930"},{"$f":"VLOOKUP(A251,'Product-tool'!A:B,2,0)","v":"Tool 14"},{"$f":"Orders!B251/VLOOKUP(B251,Tools!A:C,3,0)","v":1.3765217391304347},{"$f":"Orders!C251/VLOOKUP(B251,Tools!A:C,3,0)","v":1.1447826086956521},{"$f":"Orders!D251/VLOOKUP(B251,Tools!A:C,3,0)","v":1.1860869565217391}]
[{"$f":"Orders!A252","v":"GF368849"},{"$f":"VLOOKUP(A252,'Product-tool'!A:B,2,0)","v":"Tool 14"},{"$f":"Orders!B252/VLOOKUP(B252,Tools!A:C,3,0)","v":2.0434782608695651E-2},{"$f":"Orders!C252/VLOOKUP(B252,Tools!A:C,3,0)","v":1.2608695652173913E-2},{"$f":"Orders!D252/VLOOKUP(B252,Tools!A:C,3,0)","v":1.6086956521739131E-2}]
[{"$f":"Orders!A253","v":"GF3811858"},{"$f":"VLOOKUP(A253,'Product-tool'!A:B,2,0)","v":"Tool 14"},{"$f":"Orders!B253/VLOOKUP(B253,Tools!A:C,3,0)","v":1.4347826086956521E-2},{"$f":"Orders!C253/VLOOKUP(B253,Tools!A:C,3,0)","v":1.2608695652173913E-2},{"$f":"Orders!D253/VLOOKUP(B253,Tools!A:C,3,0)","v":1.3043478260869565E-2}]
[{"$f":"Orders!A254","v":"GF4305823"},{"$f":"VLOOKUP(A254,'Product-tool'!A:B,2,0)","v":"Tool 14"},{"$f":"Orders!B254/VLOOKUP(B254,Tools!A:C,3,0)","v":0.37130434782608696},{"$f":"Orders!C254/VLOOKUP(B254,Tools!A:C,3,0)","v":0.37217391304347824},{"$f":"Orders!D254/VLOOKUP(B254,Tools!A:C,3,0)","v":0.34782608695652173}]
[{"$f":"Orders!A255","v":"GF498873"},{"$f":"VLOOKUP(A255,'Product-tool'!A:B,2,0)","v":"Tool 14"},{"$f":"Orders!B255/VLOOKUP(B255,Tools!A:C,3,0)","v":1.0869565217391304E-2},{"$f":"Orders!C255/VLOOKUP(B255,Tools!A:C,3,0)","v":1.5652173913043479E-2},{"$f":"Orders!D255/VLOOKUP(B255,Tools!A:C,3,0)","v":1.2608695652173913E-2}]
[{"$f":"Orders!A256","v":"GF5598636"},{"$f":"VLOOKUP(A256,'Product-tool'!A:B,2,0)","v":"Tool 14"},{"$f":"Orders!B256/VLOOKUP(B256,Tools!A:C,3,0)","v":5.8695652173913045E-2},{"$f":"Orders!C256/VLOOKUP(B256,Tools!A:C,3,0)","v":5.8260869565217394E-2},{"$f":"Orders!D256/VLOOKUP(B256,Tools!A:C,3,0)","v":5.4782608695652171E-2}]
[{"$f":"Orders!A257","v":"GF5747120"},{"$f":"VLOOKUP(A257,'Product-tool'!A:B,2,0)","v":"Tool 14"},{"$f":"Orders!B257/VLOOKUP(B257,Tools!A:C,3,0)","v":0.46347826086956523},{"$f":"Orders!C257/VLOOKUP(B257,Tools!A:C,3,0)","v":0.50391304347826082},{"$f":"Orders!D257/VLOOKUP(B257,Tools!A:C,3,0)","v":0.4508695652173913}]
[{"$f":"Orders!A258","v":"GF586901"},{"$f":"VLOOKUP(A258,'Product-tool'!A:B,2,0)","v":"Tool 14"},{"$f":"Orders!B258/VLOOKUP(B258,Tools!A:C,3,0)","v":0.21739130434782608},{"$f":"Orders!C258/VLOOKUP(B258,Tools!A:C,3,0)","v":0.25478260869565217},{"$f":"Orders!D258/VLOOKUP(B258,Tools!A:C,3,0)","v":0.21956521739130436}]
[{"$f":"Orders!A259","v":"GF5886834"},{"$f":"VLOOKUP(A259,'Product-tool'!A:B,2,0)","v":"Tool 14"},{"$f":"Orders!B259/VLOOKUP(B259,Tools!A:C,3,0)","v":2.21},{"$f":"Orders!C259/VLOOKUP(B259,Tools!A:C,3,0)","v":1.4769565217391305},{"$f":"Orders!D259/VLOOKUP(B259,Tools!A:C,3,0)","v":1.7469565217391305}]
[{"$f":"Orders!A260","v":"GF5885097"},{"$f":"VLOOKUP(A260,'Product-tool'!A:B,2,0)","v":"Tool 14"},{"$f":"Orders!B260/VLOOKUP(B260,Tools!A:C,3,0)","v":15.473478260869566},{"$f":"Orders!C260/VLOOKUP(B260,Tools!A:C,3,0)","v":20.580434782608695},{"$f":"Orders!D260/VLOOKUP(B260,Tools!A:C,3,0)","v":16.684782608695652}]
[{"$f":"Orders!A261","v":"GF5892823"},{"$f":"VLOOKUP(A261,'Product-tool'!A:B,2,0)","v":"Tool 14"},{"$f":"Orders!B261/VLOOKUP(B261,Tools!A:C,3,0)","v":0.48608695652173911},{"$f":"Orders!C261/VLOOKUP(B261,Tools!A:C,3,0)","v":0.74173913043478257},{"$f":"Orders!D261/VLOOKUP(B261,Tools!A:C,3,0)","v":0.56565217391304345}]
[{"$f":"Orders!A262","v":"GF5942175"},{"$f":"VLOOKUP(A262,'Product-tool'!A:B,2,0)","v":"Tool 14"},{"$f":"Orders!B262/VLOOKUP(B262,Tools!A:C,3,0)","v":3.3043478260869563E-2},{"$f":"Orders!C262/VLOOKUP(B262,Tools!A:C,3,0)","v":5.3478260869565218E-2},{"$f":"Orders!D262/VLOOKUP(B262,Tools!A:C,3,0)","v":0.04}]
[{"$f":"Orders!A263","v":"GF67655"},{"$f":"VLOOKUP(A263,'Product-tool'!A:B,2,0)","v":"Tool 11"},{"$f":"Orders!B263/VLOOKUP(B263,Tools!A:C,3,0)","v":3.5182086614173227},{"$f":"Orders!C263/VLOOKUP(B263,Tools!A:C,3,0)","v":4.9468503937007871},{"$f":"Orders!D263/VLOOKUP(B263,Tools!A:C,3,0)","v":3.9099409448818898}]
[{"$f":"Orders!A264","v":"IP453302"},{"$f":"VLOOKUP(A264,'Product-tool'!A:B,2,0)","v":"Tool 5"},{"$f":"Orders!B264/VLOOKUP(B264,Tools!A:C,3,0)","v":0.16666666666666666},{"$f":"Orders!C264/VLOOKUP(B264,Tools!A:C,3,0)","v":0.2525},{"$f":"Orders!D264/VLOOKUP(B264,Tools!A:C,3,0)","v":0.19333333333333333}]
[{"$f":"Orders!A265","v":"IR1385574"},{"$f":"VLOOKUP(A265,'Product-tool'!A:B,2,0)","v":"Tool 19"},{"$f":"Orders!B265/VLOOKUP(B265,Tools!A:C,3,0)","v":1.3080251770259638E-2},{"$f":"Orders!C265/VLOOKUP(B265,Tools!A:C,3,0)","v":1.4752163650668764E-2},{"$f":"Orders!D265/VLOOKUP(B265,Tools!A:C,3,0)","v":1.2981904012588513E-2}]
[{"$f":"Orders!A266","v":"IR539559"},{"$f":"VLOOKUP(A266,'Product-tool'!A:B,2,0)","v":"Tool 5"},{"$f":"Orders!B266/VLOOKUP(B266,Tools!A:C,3,0)","v":0.27750000000000002},{"$f":"Orders!C266/VLOOKUP(B266,Tools!A:C,3,0)","v":0.4325},{"$f":"Orders!D266/VLOOKUP(B266,Tools!A:C,3,0)","v":0.32666666666666666}]
[{"$f":"Orders!A267","v":"IR5796915"},{"$f":"VLOOKUP(A267,'Product-tool'!A:B,2,0)","v":"Tool 12"},{"$f":"Orders!B267/VLOOKUP(B267,Tools!A:C,3,0)","v":0.5},{"$f":"Orders!C267/VLOOKUP(B267,Tools!A:C,3,0)","v":0.53325},{"$f":"Orders!D267/VLOOKUP(B267,Tools!A:C,3,0)","v":0.48175000000000001}]
[{"$f":"Orders!A268","v":"IR6327281"},{"$f":"VLOOKUP(A268,'Product-tool'!A:B,2,0)","v":"Tool 12"},{"$f":"Orders!B268/VLOOKUP(B268,Tools!A:C,3,0)","v":3.3250000000000002E-2},{"$f":"Orders!C268/VLOOKUP(B268,Tools!A:C,3,0)","v":2.1999999999999999E-2},{"$f":"Orders!D268/VLOOKUP(B268,Tools!A:C,3,0)","v":2.6249999999999999E-2}]
[{"$f":"Orders!A269","v":"MC3428427"},{"$f":"VLOOKUP(A269,'Product-tool'!A:B,2,0)","v":"Tool 13"},{"$f":"Orders!B269/VLOOKUP(B269,Tools!A:C,3,0)","v":6.9166666666666668E-2},{"$f":"Orders!C269/VLOOKUP(B269,Tools!A:C,3,0)","v":4.3749999999999997E-2},{"$f":"Orders!D269/VLOOKUP(B269,Tools!A:C,3,0)","v":5.3749999999999999E-2}]
[{"$f":"Orders!A270","v":"MC3543546"},{"$f":"VLOOKUP(A270,'Product-tool'!A:B,2,0)","v":"Tool 11"},{"$f":"Orders!B270/VLOOKUP(B270,Tools!A:C,3,0)","v":1.0275590551181102},{"$f":"Orders!C270/VLOOKUP(B270,Tools!A:C,3,0)","v":0.69438976377952755},{"$f":"Orders!D270/VLOOKUP(B270,Tools!A:C,3,0)","v":0.81594488188976377}]
[{"$f":"Orders!A271","v":"MC3717873"},{"$f":"VLOOKUP(A271,'Product-tool'!A:B,2,0)","v":"Tool 12"},{"$f":"Orders!B271/VLOOKUP(B271,Tools!A:C,3,0)","v":5.2625000000000002},{"$f":"Orders!C271/VLOOKUP(B271,Tools!A:C,3,0)","v":8.2992500000000007},{"$f":"Orders!D271/VLOOKUP(B271,Tools!A:C,3,0)","v":6.2394999999999996}]
[{"$f":"Orders!A272","v":"MC4244977"},{"$f":"VLOOKUP(A272,'Product-tool'!A:B,2,0)","v":"Tool 11"},{"$f":"Orders!B272/VLOOKUP(B272,Tools!A:C,3,0)","v":5.5644685039370083},{"$f":"Orders!C272/VLOOKUP(B272,Tools!A:C,3,0)","v":8.1427165354330704},{"$f":"Orders!D272/VLOOKUP(B272,Tools!A:C,3,0)","v":6.3223425196850398}]
[{"$f":"Orders!A273","v":"MC4291921"},{"$f":"VLOOKUP(A273,'Product-tool'!A:B,2,0)","v":"Tool 10"},{"$f":"Orders!B273/VLOOKUP(B273,Tools!A:C,3,0)","v":0.26838709677419353},{"$f":"Orders!C273/VLOOKUP(B273,Tools!A:C,3,0)","v":0.3038709677419355},{"$f":"Orders!D273/VLOOKUP(B273,Tools!A:C,3,0)","v":0.26645161290322583}]
[{"$f":"Orders!A274","v":"MC4993575"},{"$f":"VLOOKUP(A274,'Product-tool'!A:B,2,0)","v":"Tool 19"},{"$f":"Orders!B274/VLOOKUP(B274,Tools!A:C,3,0)","v":1.5735641227380016E-3},{"$f":"Orders!C274/VLOOKUP(B274,Tools!A:C,3,0)","v":1.966955153422502E-3},{"$f":"Orders!D274/VLOOKUP(B274,Tools!A:C,3,0)","v":1.6719118804091268E-3}]
[{"$f":"Orders!A275","v":"MC4997628"},{"$f":"VLOOKUP(A275,'Product-tool'!A:B,2,0)","v":"Tool 19"},{"$f":"Orders!B275/VLOOKUP(B275,Tools!A:C,3,0)","v":10.455940204563335},{"$f":"Orders!C275/VLOOKUP(B275,Tools!A:C,3,0)","v":13.438532651455548},{"$f":"Orders!D275/VLOOKUP(B275,Tools!A:C,3,0)","v":11.07081038552321}]
[{"$f":"Orders!A276","v":"MC5625753"},{"$f":"VLOOKUP(A276,'Product-tool'!A:B,2,0)","v":"Tool 5"},{"$f":"Orders!B276/VLOOKUP(B276,Tools!A:C,3,0)","v":15.475},{"$f":"Orders!C276/VLOOKUP(B276,Tools!A:C,3,0)","v":15.771666666666667},{"$f":"Orders!D276/VLOOKUP(B276,Tools!A:C,3,0)","v":14.595000000000001}]
[{"$f":"Orders!A277","v":"MC5663542"},{"$f":"VLOOKUP(A277,'Product-tool'!A:B,2,0)","v":"Tool 5"},{"$f":"Orders!B277/VLOOKUP(B277,Tools!A:C,3,0)","v":0.13833333333333334},{"$f":"Orders!C277/VLOOKUP(B277,Tools!A:C,3,0)","v":0.11833333333333333},{"$f":"Orders!D277/VLOOKUP(B277,Tools!A:C,3,0)","v":0.12083333333333333}]
[{"$f":"Orders!A278","v":"MC5823622"},{"$f":"VLOOKUP(A278,'Product-tool'!A:B,2,0)","v":"Tool 19"},{"$f":"Orders!B278/VLOOKUP(B278,Tools!A:C,3,0)","v":0.41630605822187255},{"$f":"Orders!C278/VLOOKUP(B278,Tools!A:C,3,0)","v":0.59215184893784423},{"$f":"Orders!D278/VLOOKUP(B278,Tools!A:C,3,0)","v":0.46567663257277736}]
[{"$f":"Orders!A279","v":"MC594145"},{"$f":"VLOOKUP(A279,'Product-tool'!A:B,2,0)","v":"Tool 8"},{"$f":"Orders!B279/VLOOKUP(B279,Tools!A:C,3,0)","v":0.25816326530612244},{"$f":"Orders!C279/VLOOKUP(B279,Tools!A:C,3,0)","v":0.31198979591836734},{"$f":"Orders!D279/VLOOKUP(B279,Tools!A:C,3,0)","v":0.26479591836734695}]
[{"$f":"Orders!A280","v":"ME8004536"},{"$f":"VLOOKUP(A280,'Product-tool'!A:B,2,0)","v":"Tool 8"},{"$f":"Orders!B280/VLOOKUP(B280,Tools!A:C,3,0)","v":0.76147959183673475},{"$f":"Orders!C280/VLOOKUP(B280,Tools!A:C,3,0)","v":1.1005102040816326},{"$f":"Orders!D280/VLOOKUP(B280,Tools!A:C,3,0)","v":0.85918367346938773}]
[{"$f":"Orders!A281","v":"ME8004064"},{"$f":"VLOOKUP(A281,'Product-tool'!A:B,2,0)","v":"Tool 8"},{"$f":"Orders!B281/VLOOKUP(B281,Tools!A:C,3,0)","v":1.2755102040816326},{"$f":"Orders!C281/VLOOKUP(B281,Tools!A:C,3,0)","v":1.1426020408163264},{"$f":"Orders!D281/VLOOKUP(B281,Tools!A:C,3,0)","v":1.1344387755102041}]
[{"$f":"Orders!A282","v":"ME8009107"},{"$f":"VLOOKUP(A282,'Product-tool'!A:B,2,0)","v":"Tool 8"},{"$f":"Orders!B282/VLOOKUP(B282,Tools!A:C,3,0)","v":0.87576530612244896},{"$f":"Orders!C282/VLOOKUP(B282,Tools!A:C,3,0)","v":1.0535714285714286},{"$f":"Orders!D282/VLOOKUP(B282,Tools!A:C,3,0)","v":0.89617346938775511}]
[{"$f":"Orders!A283","v":"ME8007924"},{"$f":"VLOOKUP(A283,'Product-tool'!A:B,2,0)","v":"Tool 8"},{"$f":"Orders!B283/VLOOKUP(B283,Tools!A:C,3,0)","v":2.9081632653061223E-2},{"$f":"Orders!C283/VLOOKUP(B283,Tools!A:C,3,0)","v":3.4438775510204078E-2},{"$f":"Orders!D283/VLOOKUP(B283,Tools!A:C,3,0)","v":2.9591836734693878E-2}]
[{"$f":"Orders!A284","v":"ME8082434"},{"$f":"VLOOKUP(A284,'Product-tool'!A:B,2,0)","v":"Tool 8"},{"$f":"Orders!B284/VLOOKUP(B284,Tools!A:C,3,0)","v":0.1767857142857143},{"$f":"Orders!C284/VLOOKUP(B284,Tools!A:C,3,0)","v":0.25382653061224492},{"$f":"Orders!D284/VLOOKUP(B284,Tools!A:C,3,0)","v":0.19897959183673469}]
[{"$f":"Orders!A285","v":"ME8115997"},{"$f":"VLOOKUP(A285,'Product-tool'!A:B,2,0)","v":"Tool 8"},{"$f":"Orders!B285/VLOOKUP(B285,Tools!A:C,3,0)","v":2.8571428571428571E-2},{"$f":"Orders!C285/VLOOKUP(B285,Tools!A:C,3,0)","v":3.4438775510204078E-2},{"$f":"Orders!D285/VLOOKUP(B285,Tools!A:C,3,0)","v":2.9336734693877552E-2}]
[{"$f":"Orders!A286","v":"ME8144143"},{"$f":"VLOOKUP(A286,'Product-tool'!A:B,2,0)","v":"Tool 8"},{"$f":"Orders!B286/VLOOKUP(B286,Tools!A:C,3,0)","v":0.42295918367346941},{"$f":"Orders!C286/VLOOKUP(B286,Tools!A:C,3,0)","v":0.45612244897959181},{"$f":"Orders!D286/VLOOKUP(B286,Tools!A:C,3,0)","v":0.40969387755102044}]
[{"$f":"Orders!A287","v":"ME81564"},{"$f":"VLOOKUP(A287,'Product-tool'!A:B,2,0)","v":"Tool 8"},{"$f":"Orders!B287/VLOOKUP(B287,Tools!A:C,3,0)","v":0.10612244897959183},{"$f":"Orders!C287/VLOOKUP(B287,Tools!A:C,3,0)","v":0.13316326530612244},{"$f":"Orders!D287/VLOOKUP(B287,Tools!A:C,3,0)","v":0.11096938775510204}]
[{"$f":"Orders!A288","v":"ME8164351"},{"$f":"VLOOKUP(A288,'Product-tool'!A:B,2,0)","v":"Tool 11"},{"$f":"Orders!B288/VLOOKUP(B288,Tools!A:C,3,0)","v":2.0984251968503935},{"$f":"Orders!C288/VLOOKUP(B288,Tools!A:C,3,0)","v":1.7470472440944882},{"$f":"Orders!D288/VLOOKUP(B288,Tools!A:C,3,0)","v":1.8085629921259843}]
[{"$f":"Orders!A289","v":"ME8183059"},{"$f":"VLOOKUP(A289,'Product-tool'!A:B,2,0)","v":"Tool 8"},{"$f":"Orders!B289/VLOOKUP(B289,Tools!A:C,3,0)","v":3.1821428571428569},{"$f":"Orders!C289/VLOOKUP(B289,Tools!A:C,3,0)","v":4.2336734693877549},{"$f":"Orders!D289/VLOOKUP(B289,Tools!A:C,3,0)","v":3.431887755102041}]
[{"$f":"Orders!A290","v":"ME8182883"},{"$f":"VLOOKUP(A290,'Product-tool'!A:B,2,0)","v":"Tool 8"},{"$f":"Orders!B290/VLOOKUP(B290,Tools!A:C,3,0)","v":0.68392857142857144},{"$f":"Orders!C290/VLOOKUP(B290,Tools!A:C,3,0)","v":0.58367346938775511},{"$f":"Orders!D290/VLOOKUP(B290,Tools!A:C,3,0)","v":0.59566326530612246}]
[{"$f":"Orders!A291","v":"ME8186457"},{"$f":"VLOOKUP(A291,'Product-tool'!A:B,2,0)","v":"Tool 8"},{"$f":"Orders!B291/VLOOKUP(B291,Tools!A:C,3,0)","v":0.3454081632653061},{"$f":"Orders!C291/VLOOKUP(B291,Tools!A:C,3,0)","v":0.23673469387755103},{"$f":"Orders!D291/VLOOKUP(B291,Tools!A:C,3,0)","v":0.27551020408163263}]
[{"$f":"Orders!A292","v":"ME8183894"},{"$f":"VLOOKUP(A292,'Product-tool'!A:B,2,0)","v":"Tool 8"},{"$f":"Orders!B292/VLOOKUP(B292,Tools!A:C,3,0)","v":4.7841836734693874},{"$f":"Orders!C292/VLOOKUP(B292,Tools!A:C,3,0)","v":6.1992346938775507},{"$f":"Orders!D292/VLOOKUP(B292,Tools!A:C,3,0)","v":5.0875000000000004}]
[{"$f":"Orders!A293","v":"ME8203838"},{"$f":"VLOOKUP(A293,'Product-tool'!A:B,2,0)","v":"Tool 8"},{"$f":"Orders!B293/VLOOKUP(B293,Tools!A:C,3,0)","v":2.7012755102040815},{"$f":"Orders!C293/VLOOKUP(B293,Tools!A:C,3,0)","v":2.2890306122448978},{"$f":"Orders!D293/VLOOKUP(B293,Tools!A:C,3,0)","v":2.3459183673469388}]
[{"$f":"Orders!A294","v":"ME8216708"},{"$f":"VLOOKUP(A294,'Product-tool'!A:B,2,0)","v":"Tool 8"},{"$f":"Orders!B294/VLOOKUP(B294,Tools!A:C,3,0)","v":0.91836734693877553},{"$f":"Orders!C294/VLOOKUP(B294,Tools!A:C,3,0)","v":1.4239795918367346},{"$f":"Orders!D294/VLOOKUP(B294,Tools!A:C,3,0)","v":1.0783163265306122}]
[{"$f":"Orders!A295","v":"ME8212034"},{"$f":"VLOOKUP(A295,'Product-tool'!A:B,2,0)","v":"Tool 8"},{"$f":"Orders!B295/VLOOKUP(B295,Tools!A:C,3,0)","v":0.28903061224489796},{"$f":"Orders!C295/VLOOKUP(B295,Tools!A:C,3,0)","v":0.30637755102040815},{"$f":"Orders!D295/VLOOKUP(B295,Tools!A:C,3,0)","v":0.27780612244897956}]
[{"$f":"Orders!A296","v":"ME8219605"},{"$f":"VLOOKUP(A296,'Product-tool'!A:B,2,0)","v":"Tool 8"},{"$f":"Orders!B296/VLOOKUP(B296,Tools!A:C,3,0)","v":1.053826530612245},{"$f":"Orders!C296/VLOOKUP(B296,Tools!A:C,3,0)","v":1.659438775510204},{"$f":"Orders!D296/VLOOKUP(B296,Tools!A:C,3,0)","v":1.2484693877551021}]
[{"$f":"Orders!A297","v":"ME8227923"},{"$f":"VLOOKUP(A297,'Product-tool'!A:B,2,0)","v":"Tool 8"},{"$f":"Orders!B297/VLOOKUP(B297,Tools!A:C,3,0)","v":2.8571428571428571E-2},{"$f":"Orders!C297/VLOOKUP(B297,Tools!A:C,3,0)","v":4.3622448979591839E-2},{"$f":"Orders!D297/VLOOKUP(B297,Tools!A:C,3,0)","v":3.3163265306122451E-2}]
[{"$f":"Orders!A298","v":"ME8254069"},{"$f":"VLOOKUP(A298,'Product-tool'!A:B,2,0)","v":"Tool 8"},{"$f":"Orders!B298/VLOOKUP(B298,Tools!A:C,3,0)","v":0.12755102040816327},{"$f":"Orders!C298/VLOOKUP(B298,Tools!A:C,3,0)","v":0.15561224489795919},{"$f":"Orders!D298/VLOOKUP(B298,Tools!A:C,3,0)","v":0.13137755102040816}]
[{"$f":"Orders!A299","v":"ME8294469"},{"$f":"VLOOKUP(A299,'Product-tool'!A:B,2,0)","v":"Tool 8"},{"$f":"Orders!B299/VLOOKUP(B299,Tools!A:C,3,0)","v":1.450765306122449},{"$f":"Orders!C299/VLOOKUP(B299,Tools!A:C,3,0)","v":2.3308673469387755},{"$f":"Orders!D299/VLOOKUP(B299,Tools!A:C,3,0)","v":1.7387755102040816}]
[{"$f":"Orders!A300","v":"ME8314847"},{"$f":"VLOOKUP(A300,'Product-tool'!A:B,2,0)","v":"Tool 8"},{"$f":"Orders!B300/VLOOKUP(B300,Tools!A:C,3,0)","v":9.7959183673469383E-2},{"$f":"Orders!C300/VLOOKUP(B300,Tools!A:C,3,0)","v":0.14591836734693878},{"$f":"Orders!D300/VLOOKUP(B300,Tools!A:C,3,0)","v":0.1125}]
[{"$f":"Orders!A301","v":"ME8808939"},{"$f":"VLOOKUP(A301,'Product-tool'!A:B,2,0)","v":"Tool 8"},{"$f":"Orders!B301/VLOOKUP(B301,Tools!A:C,3,0)","v":0.50688775510204087},{"$f":"Orders!C301/VLOOKUP(B301,Tools!A:C,3,0)","v":0.67142857142857137},{"$f":"Orders!D301/VLOOKUP(B301,Tools!A:C,3,0)","v":0.54540816326530617}]
[{"$f":"Orders!A302","v":"ME8804901"},{"$f":"VLOOKUP(A302,'Product-tool'!A:B,2,0)","v":"Tool 8"},{"$f":"Orders!B302/VLOOKUP(B302,Tools!A:C,3,0)","v":10.9125},{"$f":"Orders!C302/VLOOKUP(B302,Tools!A:C,3,0)","v":18.520153061224491},{"$f":"Orders!D302/VLOOKUP(B302,Tools!A:C,3,0)","v":13.508673469387755}]
[{"$f":"Orders!A303","v":"ME8809588"},{"$f":"VLOOKUP(A303,'Product-tool'!A:B,2,0)","v":"Tool 8"},{"$f":"Orders!B303/VLOOKUP(B303,Tools!A:C,3,0)","v":0.16198979591836735},{"$f":"Orders!C303/VLOOKUP(B303,Tools!A:C,3,0)","v":0.16479591836734694},{"$f":"Orders!D303/VLOOKUP(B303,Tools!A:C,3,0)","v":0.15255102040816326}]
[{"$f":"Orders!A304","v":"ME8846873"},{"$f":"VLOOKUP(A304,'Product-tool'!A:B,2,0)","v":"Tool 8"},{"$f":"Orders!B304/VLOOKUP(B304,Tools!A:C,3,0)","v":2.1900510204081631},{"$f":"Orders!C304/VLOOKUP(B304,Tools!A:C,3,0)","v":2.0198979591836737},{"$f":"Orders!D304/VLOOKUP(B304,Tools!A:C,3,0)","v":1.9734693877551019}]
[{"$f":"Orders!A305","v":"ME8876987"},{"$f":"VLOOKUP(A305,'Product-tool'!A:B,2,0)","v":"Tool 4"},{"$f":"Orders!B305/VLOOKUP(B305,Tools!A:C,3,0)","v":0.16194331983805668},{"$f":"Orders!C305/VLOOKUP(B305,Tools!A:C,3,0)","v":0.11875843454790823},{"$f":"Orders!D305/VLOOKUP(B305,Tools!A:C,3,0)","v":0.13270355375618534}]
[{"$f":"Orders!A306","v":"MP8004078"},{"$f":"VLOOKUP(A306,'Product-tool'!A:B,2,0)","v":"Tool 4"},{"$f":"Orders!B306/VLOOKUP(B306,Tools!A:C,3,0)","v":6.8623481781376521},{"$f":"Orders!C306/VLOOKUP(B306,Tools!A:C,3,0)","v":4.5802968960863701},{"$f":"Orders!D306/VLOOKUP(B306,Tools!A:C,3,0)","v":5.4228520017993702}]
[{"$f":"Orders!A307","v":"MP8026858"},{"$f":"VLOOKUP(A307,'Product-tool'!A:B,2,0)","v":"Tool 4"},{"$f":"Orders!B307/VLOOKUP(B307,Tools!A:C,3,0)","v":14.543859649122806},{"$f":"Orders!C307/VLOOKUP(B307,Tools!A:C,3,0)","v":14.34412955465587},{"$f":"Orders!D307/VLOOKUP(B307,Tools!A:C,3,0)","v":13.508771929824562}]
[{"$f":"Orders!A308","v":"MP8061520"},{"$f":"VLOOKUP(A308,'Product-tool'!A:B,2,0)","v":"Tool 4"},{"$f":"Orders!B308/VLOOKUP(B308,Tools!A:C,3,0)","v":10.221772379667117},{"$f":"Orders!C308/VLOOKUP(B308,Tools!A:C,3,0)","v":15.303643724696355},{"$f":"Orders!D308/VLOOKUP(B308,Tools!A:C,3,0)","v":11.764732343679713}]
[{"$f":"Orders!A309","v":"MP8104858"},{"$f":"VLOOKUP(A309,'Product-tool'!A:B,2,0)","v":"Tool 4"},{"$f":"Orders!B309/VLOOKUP(B309,Tools!A:C,3,0)","v":14.462438146648672},{"$f":"Orders!C309/VLOOKUP(B309,Tools!A:C,3,0)","v":34.556905083220876},{"$f":"Orders!D309/VLOOKUP(B309,Tools!A:C,3,0)","v":9.8965362123256853}]
[{"$f":"Orders!A310","v":"MP8109471"},{"$f":"VLOOKUP(A310,'Product-tool'!A:B,2,0)","v":"Tool 4"},{"$f":"Orders!B310/VLOOKUP(B310,Tools!A:C,3,0)","v":0.85470085470085466},{"$f":"Orders!C310/VLOOKUP(B310,Tools!A:C,3,0)","v":1.2168241115609537},{"$f":"Orders!D310/VLOOKUP(B310,Tools!A:C,3,0)","v":0.95636527215474587}]
[{"$f":"Orders!A311","v":"MP8189416"},{"$f":"VLOOKUP(A311,'Product-tool'!A:B,2,0)","v":"Tool 7"},{"$f":"Orders!B311/VLOOKUP(B311,Tools!A:C,3,0)","v":4.5859375},{"$f":"Orders!C311/VLOOKUP(B311,Tools!A:C,3,0)","v":3.3043749999999998},{"$f":"Orders!D311/VLOOKUP(B311,Tools!A:C,3,0)","v":3.7296874999999998}]
[{"$f":"Orders!A312","v":"MR0869382"},{"$f":"VLOOKUP(A312,'Product-tool'!A:B,2,0)","v":"Tool 10"},{"$f":"Orders!B312/VLOOKUP(B312,Tools!A:C,3,0)","v":0.13419354838709677},{"$f":"Orders!C312/VLOOKUP(B312,Tools!A:C,3,0)","v":9.1612903225806452E-2},{"$f":"Orders!D312/VLOOKUP(B312,Tools!A:C,3,0)","v":0.10709677419354839}]
[{"$f":"Orders!A313","v":"MT0524796"},{"$f":"VLOOKUP(A313,'Product-tool'!A:B,2,0)","v":"Tool 9"},{"$f":"Orders!B313/VLOOKUP(B313,Tools!A:C,3,0)","v":3.6708333333333334},{"$f":"Orders!C313/VLOOKUP(B313,Tools!A:C,3,0)","v":5.6604166666666664},{"$f":"Orders!D313/VLOOKUP(B313,Tools!A:C,3,0)","v":4.2979166666666666}]
[{"$f":"Orders!A314","v":"MT458935"},{"$f":"VLOOKUP(A314,'Product-tool'!A:B,2,0)","v":"Tool 9"},{"$f":"Orders!B314/VLOOKUP(B314,Tools!A:C,3,0)","v":5.770833333333333},{"$f":"Orders!C314/VLOOKUP(B314,Tools!A:C,3,0)","v":7.8208333333333337},{"$f":"Orders!D314/VLOOKUP(B314,Tools!A:C,3,0)","v":6.2874999999999996}]
[{"$f":"Orders!A315","v":"MT4603768"},{"$f":"VLOOKUP(A315,'Product-tool'!A:B,2,0)","v":"Tool 15"},{"$f":"Orders!B315/VLOOKUP(B315,Tools!A:C,3,0)","v":1.4999999999999999E-2},{"$f":"Orders!C315/VLOOKUP(B315,Tools!A:C,3,0)","v":9.5454545454545462E-3},{"$f":"Orders!D315/VLOOKUP(B315,Tools!A:C,3,0)","v":1.1590909090909091E-2}]
[{"$f":"Orders!A316","v":"NU0449734"},{"$f":"VLOOKUP(A316,'Product-tool'!A:B,2,0)","v":"Tool 15"},{"$f":"Orders!B316/VLOOKUP(B316,Tools!A:C,3,0)","v":5.2234090909090911},{"$f":"Orders!C316/VLOOKUP(B316,Tools!A:C,3,0)","v":6.8559090909090905},{"$f":"Orders!D316/VLOOKUP(B316,Tools!A:C,3,0)","v":5.5925000000000002}]
[{"$f":"Orders!A317","v":"NU0799419"},{"$f":"VLOOKUP(A317,'Product-tool'!A:B,2,0)","v":"Tool 15"},{"$f":"Orders!B317/VLOOKUP(B317,Tools!A:C,3,0)","v":1.4999999999999999E-2},{"$f":"Orders!C317/VLOOKUP(B317,Tools!A:C,3,0)","v":1.7045454545454544E-2},{"$f":"Orders!D317/VLOOKUP(B317,Tools!A:C,3,0)","v":1.4999999999999999E-2}]
[{"$f":"Orders!A318","v":"NU0913559"},{"$f":"VLOOKUP(A318,'Product-tool'!A:B,2,0)","v":"Tool 15"},{"$f":"Orders!B318/VLOOKUP(B318,Tools!A:C,3,0)","v":0.69545454545454544},{"$f":"Orders!C318/VLOOKUP(B318,Tools!A:C,3,0)","v":1.0040909090909091},{"$f":"Orders!D318/VLOOKUP(B318,Tools!A:C,3,0)","v":0.7843181818181818}]
[{"$f":"Orders!A319","v":"NU1662490"},{"$f":"VLOOKUP(A319,'Product-tool'!A:B,2,0)","v":"Tool 15"},{"$f":"Orders!B319/VLOOKUP(B319,Tools!A:C,3,0)","v":1.8863636363636364E-2},{"$f":"Orders!C319/VLOOKUP(B319,Tools!A:C,3,0)","v":0.02},{"$f":"Orders!D319/VLOOKUP(B319,Tools!A:C,3,0)","v":1.8181818181818181E-2}]
[{"$f":"Orders!A320","v":"NU1816428"},{"$f":"VLOOKUP(A320,'Product-tool'!A:B,2,0)","v":"Tool 10"},{"$f":"Orders!B320/VLOOKUP(B320,Tools!A:C,3,0)","v":7.2283870967741937},{"$f":"Orders!C320/VLOOKUP(B320,Tools!A:C,3,0)","v":8.0329032258064519},{"$f":"Orders!D320/VLOOKUP(B320,Tools!A:C,3,0)","v":7.1064516129032258}]
[{"$f":"Orders!A321","v":"NU2694528"},{"$f":"VLOOKUP(A321,'Product-tool'!A:B,2,0)","v":"Tool 15"},{"$f":"Orders!B321/VLOOKUP(B321,Tools!A:C,3,0)","v":3.7727272727272727E-2},{"$f":"Orders!C321/VLOOKUP(B321,Tools!A:C,3,0)","v":5.5909090909090908E-2},{"$f":"Orders!D321/VLOOKUP(B321,Tools!A:C,3,0)","v":4.3181818181818182E-2}]
[{"$f":"Orders!A322","v":"NU2703355"},{"$f":"VLOOKUP(A322,'Product-tool'!A:B,2,0)","v":"Tool 2"},{"$f":"Orders!B322/VLOOKUP(B322,Tools!A:C,3,0)","v":1.4196153846153847},{"$f":"Orders!C322/VLOOKUP(B322,Tools!A:C,3,0)","v":2.4184615384615387},{"$f":"Orders!D322/VLOOKUP(B322,Tools!A:C,3,0)","v":1.7611538461538461}]
[{"$f":"Orders!A323","v":"NU2754771"},{"$f":"VLOOKUP(A323,'Product-tool'!A:B,2,0)","v":"Tool 5"},{"$f":"Orders!B323/VLOOKUP(B323,Tools!A:C,3,0)","v":3.125},{"$f":"Orders!C323/VLOOKUP(B323,Tools!A:C,3,0)","v":4.7841666666666667},{"$f":"Orders!D323/VLOOKUP(B323,Tools!A:C,3,0)","v":3.6425000000000001}]
[{"$f":"Orders!A324","v":"NU290431"},{"$f":"VLOOKUP(A324,'Product-tool'!A:B,2,0)","v":"Tool 15"},{"$f":"Orders!B324/VLOOKUP(B324,Tools!A:C,3,0)","v":0.72818181818181815},{"$f":"Orders!C324/VLOOKUP(B324,Tools!A:C,3,0)","v":1.2345454545454546},{"$f":"Orders!D324/VLOOKUP(B324,Tools!A:C,3,0)","v":0.90090909090909088}]
[{"$f":"Orders!A325","v":"NU3608271"},{"$f":"VLOOKUP(A325,'Product-tool'!A:B,2,0)","v":"Tool 10"},{"$f":"Orders!B325/VLOOKUP(B325,Tools!A:C,3,0)","v":0.62903225806451613},{"$f":"Orders!C325/VLOOKUP(B325,Tools!A:C,3,0)","v":0.52},{"$f":"Orders!D325/VLOOKUP(B325,Tools!A:C,3,0)","v":0.54064516129032258}]
[{"$f":"Orders!A326","v":"NU3708683"},{"$f":"VLOOKUP(A326,'Product-tool'!A:B,2,0)","v":"Tool 2"},{"$f":"Orders!B326/VLOOKUP(B326,Tools!A:C,3,0)","v":0.80346153846153845},{"$f":"Orders!C326/VLOOKUP(B326,Tools!A:C,3,0)","v":1.3180769230769231},{"$f":"Orders!D326/VLOOKUP(B326,Tools!A:C,3,0)","v":0.97499999999999998}]
[{"$f":"Orders!A327","v":"NU3827246"},{"$f":"VLOOKUP(A327,'Product-tool'!A:B,2,0)","v":"Tool 2"},{"$f":"Orders!B327/VLOOKUP(B327,Tools!A:C,3,0)","v":0.36384615384615382},{"$f":"Orders!C327/VLOOKUP(B327,Tools!A:C,3,0)","v":0.47},{"$f":"Orders!D327/VLOOKUP(B327,Tools!A:C,3,0)","v":0.38653846153846155}]
[{"$f":"Orders!A328","v":"NU3927324"},{"$f":"VLOOKUP(A328,'Product-tool'!A:B,2,0)","v":"Tool 11"},{"$f":"Orders!B328/VLOOKUP(B328,Tools!A:C,3,0)","v":1.297736220472441},{"$f":"Orders!C328/VLOOKUP(B328,Tools!A:C,3,0)","v":2.0841535433070866},{"$f":"Orders!D328/VLOOKUP(B328,Tools!A:C,3,0)","v":1.5551181102362204}]
[{"$f":"Orders!A329","v":"NU4893598"},{"$f":"VLOOKUP(A329,'Product-tool'!A:B,2,0)","v":"Tool 2"},{"$f":"Orders!B329/VLOOKUP(B329,Tools!A:C,3,0)","v":3.1923076923076922E-2},{"$f":"Orders!C329/VLOOKUP(B329,Tools!A:C,3,0)","v":3.6923076923076927E-2},{"$f":"Orders!D329/VLOOKUP(B329,Tools!A:C,3,0)","v":3.2307692307692308E-2}]
[{"$f":"Orders!A330","v":"NU5305035"},{"$f":"VLOOKUP(A330,'Product-tool'!A:B,2,0)","v":"Tool 17"},{"$f":"Orders!B330/VLOOKUP(B330,Tools!A:C,3,0)","v":1.4264705882352941E-2},{"$f":"Orders!C330/VLOOKUP(B330,Tools!A:C,3,0)","v":1.8235294117647058E-2},{"$f":"Orders!D330/VLOOKUP(B330,Tools!A:C,3,0)","v":1.5147058823529411E-2}]
[{"$f":"Orders!A331","v":"NU5785654"},{"$f":"VLOOKUP(A331,'Product-tool'!A:B,2,0)","v":"Tool 10"},{"$f":"Orders!B331/VLOOKUP(B331,Tools!A:C,3,0)","v":0.10193548387096774},{"$f":"Orders!C331/VLOOKUP(B331,Tools!A:C,3,0)","v":7.483870967741936E-2},{"$f":"Orders!D331/VLOOKUP(B331,Tools!A:C,3,0)","v":8.387096774193549E-2}]
[{"$f":"Orders!A332","v":"OX5859021"},{"$f":"VLOOKUP(A332,'Product-tool'!A:B,2,0)","v":"Tool 10"},{"$f":"Orders!B332/VLOOKUP(B332,Tools!A:C,3,0)","v":9.0322580645161299E-3},{"$f":"Orders!C332/VLOOKUP(B332,Tools!A:C,3,0)","v":1.5483870967741935E-2},{"$f":"Orders!D332/VLOOKUP(B332,Tools!A:C,3,0)","v":1.1612903225806452E-2}]
[{"$f":"Orders!A333","v":"OX5851901"},{"$f":"VLOOKUP(A333,'Product-tool'!A:B,2,0)","v":"Tool 16"},{"$f":"Orders!B333/VLOOKUP(B333,Tools!A:C,3,0)","v":4.8529411764705885E-3},{"$f":"Orders!C333/VLOOKUP(B333,Tools!A:C,3,0)","v":8.2352941176470594E-3},{"$f":"Orders!D333/VLOOKUP(B333,Tools!A:C,3,0)","v":6.0294117647058821E-3}]
[{"$f":"Orders!A334","v":"RC146190"},{"$f":"VLOOKUP(A334,'Product-tool'!A:B,2,0)","v":"Tool 18"},{"$f":"Orders!B334/VLOOKUP(B334,Tools!A:C,3,0)","v":0.50571428571428567},{"$f":"Orders!C334/VLOOKUP(B334,Tools!A:C,3,0)","v":0.84535714285714281},{"$f":"Orders!D334/VLOOKUP(B334,Tools!A:C,3,0)","v":0.62071428571428566}]
[{"$f":"Orders!A335","v":"RC4928508"},{"$f":"VLOOKUP(A335,'Product-tool'!A:B,2,0)","v":"Tool 18"},{"$f":"Orders!B335/VLOOKUP(B335,Tools!A:C,3,0)","v":2.3928571428571428E-2},{"$f":"Orders!C335/VLOOKUP(B335,Tools!A:C,3,0)","v":3.9642857142857139E-2},{"$f":"Orders!D335/VLOOKUP(B335,Tools!A:C,3,0)","v":2.9285714285714286E-2}]
[{"$f":"Orders!A336","v":"RM0095773"},{"$f":"VLOOKUP(A336,'Product-tool'!A:B,2,0)","v":"Tool 18"},{"$f":"Orders!B336/VLOOKUP(B336,Tools!A:C,3,0)","v":0.78035714285714286},{"$f":"Orders!C336/VLOOKUP(B336,Tools!A:C,3,0)","v":0.95499999999999996},{"$f":"Orders!D336/VLOOKUP(B336,Tools!A:C,3,0)","v":0.80535714285714288}]
[{"$f":"Orders!A337","v":"RM1193363"},{"$f":"VLOOKUP(A337,'Product-tool'!A:B,2,0)","v":"Tool 18"},{"$f":"Orders!B337/VLOOKUP(B337,Tools!A:C,3,0)","v":2.8571428571428571E-3},{"$f":"Orders!C337/VLOOKUP(B337,Tools!A:C,3,0)","v":3.9285714285714288E-3},{"$f":"Orders!D337/VLOOKUP(B337,Tools!A:C,3,0)","v":3.2142857142857142E-3}]
[{"$f":"Orders!A338","v":"RM12722"},{"$f":"VLOOKUP(A338,'Product-tool'!A:B,2,0)","v":"Tool 18"},{"$f":"Orders!B338/VLOOKUP(B338,Tools!A:C,3,0)","v":1.2857142857142857E-2},{"$f":"Orders!C338/VLOOKUP(B338,Tools!A:C,3,0)","v":0.02},{"$f":"Orders!D338/VLOOKUP(B338,Tools!A:C,3,0)","v":1.4999999999999999E-2}]
[{"$f":"Orders!A339","v":"RM2364622"},{"$f":"VLOOKUP(A339,'Product-tool'!A:B,2,0)","v":"Tool 18"},{"$f":"Orders!B339/VLOOKUP(B339,Tools!A:C,3,0)","v":0.92107142857142854},{"$f":"Orders!C339/VLOOKUP(B339,Tools!A:C,3,0)","v":0.89178571428571429},{"$f":"Orders!D339/VLOOKUP(B339,Tools!A:C,3,0)","v":0.8482142857142857}]
[{"$f":"Orders!A340","v":"RM4669200"},{"$f":"VLOOKUP(A340,'Product-tool'!A:B,2,0)","v":"Tool 18"},{"$f":"Orders!B340/VLOOKUP(B340,Tools!A:C,3,0)","v":5.7142857142857143E-3},{"$f":"Orders!C340/VLOOKUP(B340,Tools!A:C,3,0)","v":9.285714285714286E-3},{"$f":"Orders!D340/VLOOKUP(B340,Tools!A:C,3,0)","v":6.7857142857142855E-3}]
[{"$f":"Orders!A341","v":"RM4667709"},{"$f":"VLOOKUP(A341,'Product-tool'!A:B,2,0)","v":"Tool 18"},{"$f":"Orders!B341/VLOOKUP(B341,Tools!A:C,3,0)","v":1.2053571428571428},{"$f":"Orders!C341/VLOOKUP(B341,Tools!A:C,3,0)","v":1.5428571428571429},{"$f":"Orders!D341/VLOOKUP(B341,Tools!A:C,3,0)","v":1.2735714285714286}]
[{"$f":"Orders!A342","v":"RM4695168"},{"$f":"VLOOKUP(A342,'Product-tool'!A:B,2,0)","v":"Tool 18"},{"$f":"Orders!B342/VLOOKUP(B342,Tools!A:C,3,0)","v":0.60250000000000004},{"$f":"Orders!C342/VLOOKUP(B342,Tools!A:C,3,0)","v":0.92749999999999999},{"$f":"Orders!D342/VLOOKUP(B342,Tools!A:C,3,0)","v":0.70464285714285713}]
[{"$f":"Orders!A343","v":"RM4934415"},{"$f":"VLOOKUP(A343,'Product-tool'!A:B,2,0)","v":"Tool 18"},{"$f":"Orders!B343/VLOOKUP(B343,Tools!A:C,3,0)","v":8.0357142857142863E-2},{"$f":"Orders!C343/VLOOKUP(B343,Tools!A:C,3,0)","v":6.9285714285714284E-2},{"$f":"Orders!D343/VLOOKUP(B343,Tools!A:C,3,0)","v":7.0357142857142854E-2}]
[{"$f":"Orders!A344","v":"RM5456028"},{"$f":"VLOOKUP(A344,'Product-tool'!A:B,2,0)","v":"Tool 18"},{"$f":"Orders!B344/VLOOKUP(B344,Tools!A:C,3,0)","v":5.9285714285714289E-2},{"$f":"Orders!C344/VLOOKUP(B344,Tools!A:C,3,0)","v":3.785714285714286E-2},{"$f":"Orders!D344/VLOOKUP(B344,Tools!A:C,3,0)","v":4.6071428571428569E-2}]
[{"$f":"Orders!A345","v":"RM56355"},{"$f":"VLOOKUP(A345,'Product-tool'!A:B,2,0)","v":"Tool 18"},{"$f":"Orders!B345/VLOOKUP(B345,Tools!A:C,3,0)","v":43.400357142857146},{"$f":"Orders!C345/VLOOKUP(B345,Tools!A:C,3,0)","v":26.892142857142858},{"$f":"Orders!D345/VLOOKUP(B345,Tools!A:C,3,0)","v":33.392499999999998}]
[{"$f":"Orders!A346","v":"RM5696783"},{"$f":"VLOOKUP(A346,'Product-tool'!A:B,2,0)","v":"Tool 18"},{"$f":"Orders!B346/VLOOKUP(B346,Tools!A:C,3,0)","v":1.3214285714285715E-2},{"$f":"Orders!C346/VLOOKUP(B346,Tools!A:C,3,0)","v":1.9285714285714285E-2},{"$f":"Orders!D346/VLOOKUP(B346,Tools!A:C,3,0)","v":1.4999999999999999E-2}]
[{"$f":"Orders!A347","v":"RM5699820"},{"$f":"VLOOKUP(A347,'Product-tool'!A:B,2,0)","v":"Tool 18"},{"$f":"Orders!B347/VLOOKUP(B347,Tools!A:C,3,0)","v":2.1074999999999999},{"$f":"Orders!C347/VLOOKUP(B347,Tools!A:C,3,0)","v":1.6232142857142857},{"$f":"Orders!D347/VLOOKUP(B347,Tools!A:C,3,0)","v":1.7596428571428571}]
[{"$f":"Orders!A348","v":"RM5986206"},{"$f":"VLOOKUP(A348,'Product-tool'!A:B,2,0)","v":"Tool 18"},{"$f":"Orders!B348/VLOOKUP(B348,Tools!A:C,3,0)","v":0.4325},{"$f":"Orders!C348/VLOOKUP(B348,Tools!A:C,3,0)","v":0.38464285714285712},{"$f":"Orders!D348/VLOOKUP(B348,Tools!A:C,3,0)","v":0.38357142857142856}]
[{"$f":"Orders!A349","v":"RM6463347"},{"$f":"VLOOKUP(A349,'Product-tool'!A:B,2,0)","v":"Tool 18"},{"$f":"Orders!B349/VLOOKUP(B349,Tools!A:C,3,0)","v":0.47249999999999998},{"$f":"Orders!C349/VLOOKUP(B349,Tools!A:C,3,0)","v":0.6607142857142857},{"$f":"Orders!D349/VLOOKUP(B349,Tools!A:C,3,0)","v":0.52357142857142858}]
[{"$f":"Orders!A350","v":"RT2524952"},{"$f":"VLOOKUP(A350,'Product-tool'!A:B,2,0)","v":"Tool 18"},{"$f":"Orders!B350/VLOOKUP(B350,Tools!A:C,3,0)","v":2.7385714285714284},{"$f":"Orders!C350/VLOOKUP(B350,Tools!A:C,3,0)","v":2.0557142857142856},{"$f":"Orders!D350/VLOOKUP(B350,Tools!A:C,3,0)","v":2.2632142857142856}]
[{"$f":"Orders!A351","v":"RT2601597"},{"$f":"VLOOKUP(A351,'Product-tool'!A:B,2,0)","v":"Tool 18"},{"$f":"Orders!B351/VLOOKUP(B351,Tools!A:C,3,0)","v":0.22},{"$f":"Orders!C351/VLOOKUP(B351,Tools!A:C,3,0)","v":0.32535714285714284},{"$f":"Orders!D351/VLOOKUP(B351,Tools!A:C,3,0)","v":0.25142857142857145}]
[{"$f":"Orders!A352","v":"RT2887016"},{"$f":"VLOOKUP(A352,'Product-tool'!A:B,2,0)","v":"Tool 18"},{"$f":"Orders!B352/VLOOKUP(B352,Tools!A:C,3,0)","v":8.9749999999999996},{"$f":"Orders!C352/VLOOKUP(B352,Tools!A:C,3,0)","v":13.162857142857144},{"$f":"Orders!D352/VLOOKUP(B352,Tools!A:C,3,0)","v":10.210357142857143}]
[{"$f":"Orders!A353","v":"RT3164824"},{"$f":"VLOOKUP(A353,'Product-tool'!A:B,2,0)","v":"Tool 10"},{"$f":"Orders!B353/VLOOKUP(B353,Tools!A:C,3,0)","v":49.710967741935484},{"$f":"Orders!C353/VLOOKUP(B353,Tools!A:C,3,0)","v":71.39290322580645},{"$f":"Orders!D353/VLOOKUP(B353,Tools!A:C,3,0)","v":55.896129032258067}]
[{"$f":"Orders!A354","v":"SB0191101"},{"$f":"VLOOKUP(A354,'Product-tool'!A:B,2,0)","v":"Tool 15"},{"$f":"Orders!B354/VLOOKUP(B354,Tools!A:C,3,0)","v":1.7272727272727273E-2},{"$f":"Orders!C354/VLOOKUP(B354,Tools!A:C,3,0)","v":1.0454545454545454E-2},{"$f":"Orders!D354/VLOOKUP(B354,Tools!A:C,3,0)","v":1.3181818181818182E-2}]
[{"$f":"Orders!A355","v":"SB0898923"},{"$f":"VLOOKUP(A355,'Product-tool'!A:B,2,0)","v":"Tool 7"},{"$f":"Orders!B355/VLOOKUP(B355,Tools!A:C,3,0)","v":0.121875},{"$f":"Orders!C355/VLOOKUP(B355,Tools!A:C,3,0)","v":9.4375000000000001E-2},{"$f":"Orders!D355/VLOOKUP(B355,Tools!A:C,3,0)","v":0.10203125}]
[{"$f":"Orders!A356","v":"SB1429502"},{"$f":"VLOOKUP(A356,'Product-tool'!A:B,2,0)","v":"Tool 10"},{"$f":"Orders!B356/VLOOKUP(B356,Tools!A:C,3,0)","v":1.0664516129032258},{"$f":"Orders!C356/VLOOKUP(B356,Tools!A:C,3,0)","v":1.5748387096774195},{"$f":"Orders!D356/VLOOKUP(B356,Tools!A:C,3,0)","v":1.2180645161290322}]
[{"$f":"Orders!A357","v":"SB2162364"},{"$f":"VLOOKUP(A357,'Product-tool'!A:B,2,0)","v":"Tool 15"},{"$f":"Orders!B357/VLOOKUP(B357,Tools!A:C,3,0)","v":1.2272727272727272E-2},{"$f":"Orders!C357/VLOOKUP(B357,Tools!A:C,3,0)","v":1.9772727272727272E-2},{"$f":"Orders!D357/VLOOKUP(B357,Tools!A:C,3,0)","v":1.4772727272727272E-2}]
[{"$f":"Orders!A358","v":"SB3338674"},{"$f":"VLOOKUP(A358,'Product-tool'!A:B,2,0)","v":"Tool 2"},{"$f":"Orders!B358/VLOOKUP(B358,Tools!A:C,3,0)","v":5.0000000000000001E-3},{"$f":"Orders!C358/VLOOKUP(B358,Tools!A:C,3,0)","v":5.3846153846153844E-3},{"$f":"Orders!D358/VLOOKUP(B358,Tools!A:C,3,0)","v":5.0000000000000001E-3}]
[{"$f":"Orders!A359","v":"SB4985987"},{"$f":"VLOOKUP(A359,'Product-tool'!A:B,2,0)","v":"Tool 2"},{"$f":"Orders!B359/VLOOKUP(B359,Tools!A:C,3,0)","v":4.9230769230769231E-2},{"$f":"Orders!C359/VLOOKUP(B359,Tools!A:C,3,0)","v":4.9615384615384617E-2},{"$f":"Orders!D359/VLOOKUP(B359,Tools!A:C,3,0)","v":4.6153846153846156E-2}]
[{"$f":"Orders!A360","v":"SB585933"},{"$f":"VLOOKUP(A360,'Product-tool'!A:B,2,0)","v":"Tool 16"},{"$f":"Orders!B360/VLOOKUP(B360,Tools!A:C,3,0)","v":9.1176470588235289E-3},{"$f":"Orders!C360/VLOOKUP(B360,Tools!A:C,3,0)","v":1.4999999999999999E-2},{"$f":"Orders!D360/VLOOKUP(B360,Tools!A:C,3,0)","v":1.1176470588235295E-2}]
[{"$f":"Orders!A361","v":"SB6619702"},{"$f":"VLOOKUP(A361,'Product-tool'!A:B,2,0)","v":"Tool 2"},{"$f":"Orders!B361/VLOOKUP(B361,Tools!A:C,3,0)","v":3.2650000000000001},{"$f":"Orders!C361/VLOOKUP(B361,Tools!A:C,3,0)","v":3.2473076923076922},{"$f":"Orders!D361/VLOOKUP(B361,Tools!A:C,3,0)","v":3.0446153846153847}]
[{"$f":"Orders!A362","v":"SB6782689"},{"$f":"VLOOKUP(A362,'Product-tool'!A:B,2,0)","v":"Tool 15"},{"$f":"Orders!B362/VLOOKUP(B362,Tools!A:C,3,0)","v":0.50090909090909086},{"$f":"Orders!C362/VLOOKUP(B362,Tools!A:C,3,0)","v":0.59090909090909094},{"$f":"Orders!D362/VLOOKUP(B362,Tools!A:C,3,0)","v":0.50727272727272732}]
[{"$f":"Orders!A363","v":"SB6851891"},{"$f":"VLOOKUP(A363,'Product-tool'!A:B,2,0)","v":"Tool 15"},{"$f":"Orders!B363/VLOOKUP(B363,Tools!A:C,3,0)","v":0.58227272727272728},{"$f":"Orders!C363/VLOOKUP(B363,Tools!A:C,3,0)","v":0.90181818181818185},{"$f":"Orders!D363/VLOOKUP(B363,Tools!A:C,3,0)","v":0.68340909090909085}]
[{"$f":"Orders!A364","v":"SB6883672"},{"$f":"VLOOKUP(A364,'Product-tool'!A:B,2,0)","v":"Tool 10"},{"$f":"Orders!B364/VLOOKUP(B364,Tools!A:C,3,0)","v":2.3838709677419354},{"$f":"Orders!C364/VLOOKUP(B364,Tools!A:C,3,0)","v":1.3741935483870968},{"$f":"Orders!D364/VLOOKUP(B364,Tools!A:C,3,0)","v":1.7896774193548388}]
[{"$f":"Orders!A365","v":"SB699340"},{"$f":"VLOOKUP(A365,'Product-tool'!A:B,2,0)","v":"Tool 10"},{"$f":"Orders!B365/VLOOKUP(B365,Tools!A:C,3,0)","v":1.1980645161290322},{"$f":"Orders!C365/VLOOKUP(B365,Tools!A:C,3,0)","v":1.6193548387096774},{"$f":"Orders!D365/VLOOKUP(B365,Tools!A:C,3,0)","v":1.3032258064516129}]
[{"$f":"Orders!A366","v":"SL035245"},{"$f":"VLOOKUP(A366,'Product-tool'!A:B,2,0)","v":"Tool 15"},{"$f":"Orders!B366/VLOOKUP(B366,Tools!A:C,3,0)","v":0.17045454545454544},{"$f":"Orders!C366/VLOOKUP(B366,Tools!A:C,3,0)","v":0.10977272727272727},{"$f":"Orders!D366/VLOOKUP(B366,Tools!A:C,3,0)","v":0.13295454545454546}]
[{"$f":"Orders!A367","v":"SL04371"},{"$f":"VLOOKUP(A367,'Product-tool'!A:B,2,0)","v":"Tool 17"},{"$f":"Orders!B367/VLOOKUP(B367,Tools!A:C,3,0)","v":0.20955882352941177},{"$f":"Orders!C367/VLOOKUP(B367,Tools!A:C,3,0)","v":0.2872058823529412},{"$f":"Orders!D367/VLOOKUP(B367,Tools!A:C,3,0)","v":0.22970588235294118}]
[{"$f":"Orders!A368","v":"SL0454342"},{"$f":"VLOOKUP(A368,'Product-tool'!A:B,2,0)","v":"Tool 9"},{"$f":"Orders!B368/VLOOKUP(B368,Tools!A:C,3,0)","v":3.3333333333333333E-2},{"$f":"Orders!C368/VLOOKUP(B368,Tools!A:C,3,0)","v":0.05},{"$f":"Orders!D368/VLOOKUP(B368,Tools!A:C,3,0)","v":3.9583333333333331E-2}]
[{"$f":"Orders!A369","v":"SL0979997"},{"$f":"VLOOKUP(A369,'Product-tool'!A:B,2,0)","v":"Tool 9"},{"$f":"Orders!B369/VLOOKUP(B369,Tools!A:C,3,0)","v":18.737500000000001},{"$f":"Orders!C369/VLOOKUP(B369,Tools!A:C,3,0)","v":25.270833333333332},{"$f":"Orders!D369/VLOOKUP(B369,Tools!A:C,3,0)","v":20.356249999999999}]
[{"$f":"Orders!A370","v":"SL0973907"},{"$f":"VLOOKUP(A370,'Product-tool'!A:B,2,0)","v":"Tool 16"},{"$f":"Orders!B370/VLOOKUP(B370,Tools!A:C,3,0)","v":0.10529411764705883},{"$f":"Orders!C370/VLOOKUP(B370,Tools!A:C,3,0)","v":0.16279411764705881},{"$f":"Orders!D370/VLOOKUP(B370,Tools!A:C,3,0)","v":0.12352941176470589}]
[{"$f":"Orders!A371","v":"SL1205692"},{"$f":"VLOOKUP(A371,'Product-tool'!A:B,2,0)","v":"Tool 2"},{"$f":"Orders!B371/VLOOKUP(B371,Tools!A:C,3,0)","v":0.3403846153846154},{"$f":"Orders!C371/VLOOKUP(B371,Tools!A:C,3,0)","v":0.45500000000000002},{"$f":"Orders!D371/VLOOKUP(B371,Tools!A:C,3,0)","v":0.36807692307692308}]
[{"$f":"Orders!A372","v":"SL1739082"},{"$f":"VLOOKUP(A372,'Product-tool'!A:B,2,0)","v":"Tool 2"},{"$f":"Orders!B372/VLOOKUP(B372,Tools!A:C,3,0)","v":0.11538461538461539},{"$f":"Orders!C372/VLOOKUP(B372,Tools!A:C,3,0)","v":0.155},{"$f":"Orders!D372/VLOOKUP(B372,Tools!A:C,3,0)","v":0.125}]
[{"$f":"Orders!A373","v":"SL1814144"},{"$f":"VLOOKUP(A373,'Product-tool'!A:B,2,0)","v":"Tool 2"},{"$f":"Orders!B373/VLOOKUP(B373,Tools!A:C,3,0)","v":0.4646153846153846},{"$f":"Orders!C373/VLOOKUP(B373,Tools!A:C,3,0)","v":0.61961538461538457},{"$f":"Orders!D373/VLOOKUP(B373,Tools!A:C,3,0)","v":0.50153846153846149}]
[{"$f":"Orders!A374","v":"SL2223216"},{"$f":"VLOOKUP(A374,'Product-tool'!A:B,2,0)","v":"Tool 2"},{"$f":"Orders!B374/VLOOKUP(B374,Tools!A:C,3,0)","v":3.0769230769230769E-3},{"$f":"Orders!C374/VLOOKUP(B374,Tools!A:C,3,0)","v":2.3076923076923079E-3},{"$f":"Orders!D374/VLOOKUP(B374,Tools!A:C,3,0)","v":2.6923076923076922E-3}]
[{"$f":"Orders!A375","v":"SL4542202"},{"$f":"VLOOKUP(A375,'Product-tool'!A:B,2,0)","v":"Tool 2"},{"$f":"Orders!B375/VLOOKUP(B375,Tools!A:C,3,0)","v":2.0511538461538463},{"$f":"Orders!C375/VLOOKUP(B375,Tools!A:C,3,0)","v":3.2780769230769229},{"$f":"Orders!D375/VLOOKUP(B375,Tools!A:C,3,0)","v":2.4507692307692306}]
[{"$f":"Orders!A376","v":"SL6923987"},{"$f":"VLOOKUP(A376,'Product-tool'!A:B,2,0)","v":"Tool 16"},{"$f":"Orders!B376/VLOOKUP(B376,Tools!A:C,3,0)","v":1.3063235294117648},{"$f":"Orders!C376/VLOOKUP(B376,Tools!A:C,3,0)","v":1.3455882352941178},{"$f":"Orders!D376/VLOOKUP(B376,Tools!A:C,3,0)","v":1.2382352941176471}]
[{"$f":"Orders!A377","v":"SL6949404"},{"$f":"VLOOKUP(A377,'Product-tool'!A:B,2,0)","v":"Tool 9"},{"$f":"Orders!B377/VLOOKUP(B377,Tools!A:C,3,0)","v":0.83333333333333337},{"$f":"Orders!C377/VLOOKUP(B377,Tools!A:C,3,0)","v":0.78333333333333333},{"$f":"Orders!D377/VLOOKUP(B377,Tools!A:C,3,0)","v":0.75624999999999998}]
[{"$f":"Orders!A378","v":"SS0108"},{"$f":"VLOOKUP(A378,'Product-tool'!A:B,2,0)","v":"Tool 9"},{"$f":"Orders!B378/VLOOKUP(B378,Tools!A:C,3,0)","v":2.1},{"$f":"Orders!C378/VLOOKUP(B378,Tools!A:C,3,0)","v":2.35},{"$f":"Orders!D378/VLOOKUP(B378,Tools!A:C,3,0)","v":2.0708333333333333}]
[{"$f":"Orders!A379","v":"ST0044507"},{"$f":"VLOOKUP(A379,'Product-tool'!A:B,2,0)","v":"Tool 2"},{"$f":"Orders!B379/VLOOKUP(B379,Tools!A:C,3,0)","v":2.8757692307692309},{"$f":"Orders!C379/VLOOKUP(B379,Tools!A:C,3,0)","v":3.0519230769230767},{"$f":"Orders!D379/VLOOKUP(B379,Tools!A:C,3,0)","v":2.7646153846153845}]
[{"$f":"Orders!A380","v":"ST0248243"},{"$f":"VLOOKUP(A380,'Product-tool'!A:B,2,0)","v":"Tool 2"},{"$f":"Orders!B380/VLOOKUP(B380,Tools!A:C,3,0)","v":0.11846153846153847},{"$f":"Orders!C380/VLOOKUP(B380,Tools!A:C,3,0)","v":0.12115384615384615},{"$f":"Orders!D380/VLOOKUP(B380,Tools!A:C,3,0)","v":0.11192307692307692}]
[{"$f":"Orders!A381","v":"ST0249290"},{"$f":"VLOOKUP(A381,'Product-tool'!A:B,2,0)","v":"Tool 9"},{"$f":"Orders!B381/VLOOKUP(B381,Tools!A:C,3,0)","v":0.17291666666666666},{"$f":"Orders!C381/VLOOKUP(B381,Tools!A:C,3,0)","v":0.25208333333333333},{"$f":"Orders!D381/VLOOKUP(B381,Tools!A:C,3,0)","v":0.19583333333333333}]
[{"$f":"Orders!A382","v":"ST086120"},{"$f":"VLOOKUP(A382,'Product-tool'!A:B,2,0)","v":"Tool 2"},{"$f":"Orders!B382/VLOOKUP(B382,Tools!A:C,3,0)","v":0.94923076923076921},{"$f":"Orders!C382/VLOOKUP(B382,Tools!A:C,3,0)","v":1.4053846153846155},{"$f":"Orders!D382/VLOOKUP(B382,Tools!A:C,3,0)","v":1.0857692307692308}]
[{"$f":"Orders!A383","v":"ST0904669"},{"$f":"VLOOKUP(A383,'Product-tool'!A:B,2,0)","v":"Tool 2"},{"$f":"Orders!B383/VLOOKUP(B383,Tools!A:C,3,0)","v":0.76923076923076927},{"$f":"Orders!C383/VLOOKUP(B383,Tools!A:C,3,0)","v":0.66846153846153844},{"$f":"Orders!D383/VLOOKUP(B383,Tools!A:C,3,0)","v":0.67538461538461536}]
[{"$f":"Orders!A384","v":"ST1025440"},{"$f":"VLOOKUP(A384,'Product-tool'!A:B,2,0)","v":"Tool 9"},{"$f":"Orders!B384/VLOOKUP(B384,Tools!A:C,3,0)","v":9.3833333333333329},{"$f":"Orders!C384/VLOOKUP(B384,Tools!A:C,3,0)","v":13.164583333333333},{"$f":"Orders!D384/VLOOKUP(B384,Tools!A:C,3,0)","v":10.414583333333333}]
[{"$f":"Orders!A385","v":"ST1444632"},{"$f":"VLOOKUP(A385,'Product-tool'!A:B,2,0)","v":"Tool 2"},{"$f":"Orders!B385/VLOOKUP(B385,Tools!A:C,3,0)","v":1.9711538461538463},{"$f":"Orders!C385/VLOOKUP(B385,Tools!A:C,3,0)","v":3.1530769230769229},{"$f":"Orders!D385/VLOOKUP(B385,Tools!A:C,3,0)","v":2.3565384615384617}]
[{"$f":"Orders!A386","v":"ST1661696"},{"$f":"VLOOKUP(A386,'Product-tool'!A:B,2,0)","v":"Tool 2"},{"$f":"Orders!B386/VLOOKUP(B386,Tools!A:C,3,0)","v":0.20499999999999999},{"$f":"Orders!C386/VLOOKUP(B386,Tools!A:C,3,0)","v":0.24115384615384616},{"$f":"Orders!D386/VLOOKUP(B386,Tools!A:C,3,0)","v":0.2073076923076923}]
[{"$f":"Orders!A387","v":"ST269903"},{"$f":"VLOOKUP(A387,'Product-tool'!A:B,2,0)","v":"Tool 15"},{"$f":"Orders!B387/VLOOKUP(B387,Tools!A:C,3,0)","v":0.68818181818181823},{"$f":"Orders!C387/VLOOKUP(B387,Tools!A:C,3,0)","v":1.0334090909090909},{"$f":"Orders!D387/VLOOKUP(B387,Tools!A:C,3,0)","v":0.79340909090909095}]
[{"$f":"Orders!A388","v":"ST3078513"},{"$f":"VLOOKUP(A388,'Product-tool'!A:B,2,0)","v":"Tool 2"},{"$f":"Orders!B388/VLOOKUP(B388,Tools!A:C,3,0)","v":0.24923076923076923},{"$f":"Orders!C388/VLOOKUP(B388,Tools!A:C,3,0)","v":0.32769230769230767},{"$f":"Orders!D388/VLOOKUP(B388,Tools!A:C,3,0)","v":0.26692307692307693}]
[{"$f":"Orders!A389","v":"ST3795473"},{"$f":"VLOOKUP(A389,'Product-tool'!A:B,2,0)","v":"Tool 2"},{"$f":"Orders!B389/VLOOKUP(B389,Tools!A:C,3,0)","v":0.50769230769230766},{"$f":"Orders!C389/VLOOKUP(B389,Tools!A:C,3,0)","v":0.52192307692307693},{"$f":"Orders!D389/VLOOKUP(B389,Tools!A:C,3,0)","v":0.48076923076923078}]
[{"$f":"Orders!A390","v":"ST3859207"},{"$f":"VLOOKUP(A390,'Product-tool'!A:B,2,0)","v":"Tool 2"},{"$f":"Orders!B390/VLOOKUP(B390,Tools!A:C,3,0)","v":0.28192307692307694},{"$f":"Orders!C390/VLOOKUP(B390,Tools!A:C,3,0)","v":0.35846153846153844},{"$f":"Orders!D390/VLOOKUP(B390,Tools!A:C,3,0)","v":0.2969230769230769}]
[{"$f":"Orders!A391","v":"ST5444150"},{"$f":"VLOOKUP(A391,'Product-tool'!A:B,2,0)","v":"Tool 2"},{"$f":"Orders!B391/VLOOKUP(B391,Tools!A:C,3,0)","v":0.65},{"$f":"Orders!C391/VLOOKUP(B391,Tools!A:C,3,0)","v":0.46153846153846156},{"$f":"Orders!D391/VLOOKUP(B391,Tools!A:C,3,0)","v":0.52576923076923077}]
[{"$f":"Orders!A392","v":"ST5622830"},{"$f":"VLOOKUP(A392,'Product-tool'!A:B,2,0)","v":"Tool 2"},{"$f":"Orders!B392/VLOOKUP(B392,Tools!A:C,3,0)","v":8.807692307692308E-2},{"$f":"Orders!C392/VLOOKUP(B392,Tools!A:C,3,0)","v":9.3461538461538457E-2},{"$f":"Orders!D392/VLOOKUP(B392,Tools!A:C,3,0)","v":8.461538461538462E-2}]
[{"$f":"Orders!A393","v":"ST5775560"},{"$f":"VLOOKUP(A393,'Product-tool'!A:B,2,0)","v":"Tool 2"},{"$f":"Orders!B393/VLOOKUP(B393,Tools!A:C,3,0)","v":4.2692307692307689E-2},{"$f":"Orders!C393/VLOOKUP(B393,Tools!A:C,3,0)","v":4.1538461538461538E-2},{"$f":"Orders!D393/VLOOKUP(B393,Tools!A:C,3,0)","v":3.9230769230769229E-2}]
[{"$f":"Orders!A394","v":"ST5866857"},{"$f":"VLOOKUP(A394,'Product-tool'!A:B,2,0)","v":"Tool 2"},{"$f":"Orders!B394/VLOOKUP(B394,Tools!A:C,3,0)","v":7.2307692307692309E-2},{"$f":"Orders!C394/VLOOKUP(B394,Tools!A:C,3,0)","v":0.10653846153846154},{"$f":"Orders!D394/VLOOKUP(B394,Tools!A:C,3,0)","v":8.2307692307692304E-2}]
[{"$f":"Orders!A395","v":"ST5905549"},{"$f":"VLOOKUP(A395,'Product-tool'!A:B,2,0)","v":"Tool 15"},{"$f":"Orders!B395/VLOOKUP(B395,Tools!A:C,3,0)","v":1.7686363636363636},{"$f":"Orders!C395/VLOOKUP(B395,Tools!A:C,3,0)","v":1.8831818181818183},{"$f":"Orders!D395/VLOOKUP(B395,Tools!A:C,3,0)","v":1.7031818181818181}]
[{"$f":"Orders!A396","v":"UV0008455"},{"$f":"VLOOKUP(A396,'Product-tool'!A:B,2,0)","v":"Tool 2"},{"$f":"Orders!B396/VLOOKUP(B396,Tools!A:C,3,0)","v":0.44846153846153847},{"$f":"Orders!C396/VLOOKUP(B396,Tools!A:C,3,0)","v":0.75346153846153852},{"$f":"Orders!D396/VLOOKUP(B396,Tools!A:C,3,0)","v":0.55192307692307696}]
[{"$f":"Orders!A397","v":"UV0002089"},{"$f":"VLOOKUP(A397,'Product-tool'!A:B,2,0)","v":"Tool 15"},{"$f":"Orders!B397/VLOOKUP(B397,Tools!A:C,3,0)","v":3.2272727272727272E-2},{"$f":"Orders!C397/VLOOKUP(B397,Tools!A:C,3,0)","v":3.7045454545454548E-2},{"$f":"Orders!D397/VLOOKUP(B397,Tools!A:C,3,0)","v":3.2272727272727272E-2}]
[{"$f":"Orders!A398","v":"UV0122500"},{"$f":"VLOOKUP(A398,'Product-tool'!A:B,2,0)","v":"Tool 17"},{"$f":"Orders!B398/VLOOKUP(B398,Tools!A:C,3,0)","v":4.2647058823529413E-3},{"$f":"Orders!C398/VLOOKUP(B398,Tools!A:C,3,0)","v":6.1764705882352937E-3},{"$f":"Orders!D398/VLOOKUP(B398,Tools!A:C,3,0)","v":4.8529411764705885E-3}]
[{"$f":"Orders!A399","v":"UV0167578"},{"$f":"VLOOKUP(A399,'Product-tool'!A:B,2,0)","v":"Tool 16"},{"$f":"Orders!B399/VLOOKUP(B399,Tools!A:C,3,0)","v":0.27573529411764708},{"$f":"Orders!C399/VLOOKUP(B399,Tools!A:C,3,0)","v":0.39367647058823529},{"$f":"Orders!D399/VLOOKUP(B399,Tools!A:C,3,0)","v":0.30897058823529411}]
[{"$f":"Orders!A400","v":"UV0185671"},{"$f":"VLOOKUP(A400,'Product-tool'!A:B,2,0)","v":"Tool 9"},{"$f":"Orders!B400/VLOOKUP(B400,Tools!A:C,3,0)","v":3.6458333333333335},{"$f":"Orders!C400/VLOOKUP(B400,Tools!A:C,3,0)","v":3.1833333333333331},{"$f":"Orders!D400/VLOOKUP(B400,Tools!A:C,3,0)","v":3.2062499999999998}]
[{"$f":"Orders!A401","v":"UV0432519"},{"$f":"VLOOKUP(A401,'Product-tool'!A:B,2,0)","v":"Tool 16"},{"$f":"Orders!B401/VLOOKUP(B401,Tools!A:C,3,0)","v":1.9558823529411764E-2},{"$f":"Orders!C401/VLOOKUP(B401,Tools!A:C,3,0)","v":3.2205882352941174E-2},{"$f":"Orders!D401/VLOOKUP(B401,Tools!A:C,3,0)","v":2.3823529411764705E-2}]
[{"$f":"Orders!A402","v":"UV0436753"},{"$f":"VLOOKUP(A402,'Product-tool'!A:B,2,0)","v":"Tool 17"},{"$f":"Orders!B402/VLOOKUP(B402,Tools!A:C,3,0)","v":8.6029411764705882E-2},{"$f":"Orders!C402/VLOOKUP(B402,Tools!A:C,3,0)","v":7.6764705882352943E-2},{"$f":"Orders!D402/VLOOKUP(B402,Tools!A:C,3,0)","v":7.6323529411764707E-2}]
[{"$f":"Orders!A403","v":"UV046672"},{"$f":"VLOOKUP(A403,'Product-tool'!A:B,2,0)","v":"Tool 2"},{"$f":"Orders!B403/VLOOKUP(B403,Tools!A:C,3,0)","v":1.7434615384615384},{"$f":"Orders!C403/VLOOKUP(B403,Tools!A:C,3,0)","v":2.4403846153846156},{"$f":"Orders!D403/VLOOKUP(B403,Tools!A:C,3,0)","v":1.9326923076923077}]
[{"$f":"Orders!A404","v":"UV0685993"},{"$f":"VLOOKUP(A404,'Product-tool'!A:B,2,0)","v":"Tool 17"},{"$f":"Orders!B404/VLOOKUP(B404,Tools!A:C,3,0)","v":4.4117647058823532E-2},{"$f":"Orders!C404/VLOOKUP(B404,Tools!A:C,3,0)","v":3.6617647058823533E-2},{"$f":"Orders!D404/VLOOKUP(B404,Tools!A:C,3,0)","v":3.7941176470588235E-2}]
[{"$f":"Orders!A405","v":"UV0787788"},{"$f":"VLOOKUP(A405,'Product-tool'!A:B,2,0)","v":"Tool 2"},{"$f":"Orders!B405/VLOOKUP(B405,Tools!A:C,3,0)","v":1.115},{"$f":"Orders!C405/VLOOKUP(B405,Tools!A:C,3,0)","v":1.3111538461538461},{"$f":"Orders!D405/VLOOKUP(B405,Tools!A:C,3,0)","v":1.1276923076923078}]
[{"$f":"Orders!A406","v":"UV0787562"},{"$f":"VLOOKUP(A406,'Product-tool'!A:B,2,0)","v":"Tool 2"},{"$f":"Orders!B406/VLOOKUP(B406,Tools!A:C,3,0)","v":0.54038461538461535},{"$f":"Orders!C406/VLOOKUP(B406,Tools!A:C,3,0)","v":0.71807692307692306},{"$f":"Orders!D406/VLOOKUP(B406,Tools!A:C,3,0)","v":0.5823076923076923}]
[{"$f":"Orders!A407","v":"UV0831317"},{"$f":"VLOOKUP(A407,'Product-tool'!A:B,2,0)","v":"Tool 16"},{"$f":"Orders!B407/VLOOKUP(B407,Tools!A:C,3,0)","v":0.25117647058823528},{"$f":"Orders!C407/VLOOKUP(B407,Tools!A:C,3,0)","v":0.19544117647058823},{"$f":"Orders!D407/VLOOKUP(B407,Tools!A:C,3,0)","v":0.21058823529411766}]
[{"$f":"Orders!A408","v":"UV091154"},{"$f":"VLOOKUP(A408,'Product-tool'!A:B,2,0)","v":"Tool 15"},{"$f":"Orders!B408/VLOOKUP(B408,Tools!A:C,3,0)","v":0.4234090909090909},{"$f":"Orders!C408/VLOOKUP(B408,Tools!A:C,3,0)","v":0.30227272727272725},{"$f":"Orders!D408/VLOOKUP(B408,Tools!A:C,3,0)","v":0.3431818181818182}]
[{"$f":"Orders!A409","v":"UV0924680"},{"$f":"VLOOKUP(A409,'Product-tool'!A:B,2,0)","v":"Tool 16"},{"$f":"Orders!B409/VLOOKUP(B409,Tools!A:C,3,0)","v":1.0783823529411765},{"$f":"Orders!C409/VLOOKUP(B409,Tools!A:C,3,0)","v":1.5930882352941176},{"$f":"Orders!D409/VLOOKUP(B409,Tools!A:C,3,0)","v":1.2319117647058824}]
[{"$f":"Orders!A410","v":"UV1106642"},{"$f":"VLOOKUP(A410,'Product-tool'!A:B,2,0)","v":"Tool 2"},{"$f":"Orders!B410/VLOOKUP(B410,Tools!A:C,3,0)","v":8.1923076923076918E-2},{"$f":"Orders!C410/VLOOKUP(B410,Tools!A:C,3,0)","v":0.12923076923076923},{"$f":"Orders!D410/VLOOKUP(B410,Tools!A:C,3,0)","v":9.7307692307692303E-2}]
[{"$f":"Orders!A411","v":"UV1121941"},{"$f":"VLOOKUP(A411,'Product-tool'!A:B,2,0)","v":"Tool 16"},{"$f":"Orders!B411/VLOOKUP(B411,Tools!A:C,3,0)","v":3.3466176470588236},{"$f":"Orders!C411/VLOOKUP(B411,Tools!A:C,3,0)","v":5.1216176470588239},{"$f":"Orders!D411/VLOOKUP(B411,Tools!A:C,3,0)","v":3.9001470588235296}]
[{"$f":"Orders!A412","v":"UV1187156"},{"$f":"VLOOKUP(A412,'Product-tool'!A:B,2,0)","v":"Tool 15"},{"$f":"Orders!B412/VLOOKUP(B412,Tools!A:C,3,0)","v":0.11613636363636363},{"$f":"Orders!C412/VLOOKUP(B412,Tools!A:C,3,0)","v":0.11409090909090909},{"$f":"Orders!D412/VLOOKUP(B412,Tools!A:C,3,0)","v":0.10772727272727273}]
[{"$f":"Orders!A413","v":"UV120727"},{"$f":"VLOOKUP(A413,'Product-tool'!A:B,2,0)","v":"Tool 19"},{"$f":"Orders!B413/VLOOKUP(B413,Tools!A:C,3,0)","v":7.769472856018883E-2},{"$f":"Orders!C413/VLOOKUP(B413,Tools!A:C,3,0)","v":9.765932336742722E-2},{"$f":"Orders!D413/VLOOKUP(B413,Tools!A:C,3,0)","v":8.1333595594020452E-2}]
[{"$f":"Orders!A414","v":"UV133670"},{"$f":"VLOOKUP(A414,'Product-tool'!A:B,2,0)","v":"Tool 16"},{"$f":"Orders!B414/VLOOKUP(B414,Tools!A:C,3,0)","v":2.5097058823529412},{"$f":"Orders!C414/VLOOKUP(B414,Tools!A:C,3,0)","v":2.1622058823529411},{"$f":"Orders!D414/VLOOKUP(B414,Tools!A:C,3,0)","v":2.1949999999999998}]
[{"$f":"Orders!A415","v":"UV1394884"},{"$f":"VLOOKUP(A415,'Product-tool'!A:B,2,0)","v":"Tool 15"},{"$f":"Orders!B415/VLOOKUP(B415,Tools!A:C,3,0)","v":0.19681818181818181},{"$f":"Orders!C415/VLOOKUP(B415,Tools!A:C,3,0)","v":0.20431818181818182},{"$f":"Orders!D415/VLOOKUP(B415,Tools!A:C,3,0)","v":0.18727272727272729}]
[{"$f":"Orders!A416","v":"UV1585237"},{"$f":"VLOOKUP(A416,'Product-tool'!A:B,2,0)","v":"Tool 9"},{"$f":"Orders!B416/VLOOKUP(B416,Tools!A:C,3,0)","v":1.1625000000000001},{"$f":"Orders!C416/VLOOKUP(B416,Tools!A:C,3,0)","v":0.75416666666666665},{"$f":"Orders!D416/VLOOKUP(B416,Tools!A:C,3,0)","v":0.90833333333333333}]
[{"$f":"Orders!A417","v":"UV1723988"},{"$f":"VLOOKUP(A417,'Product-tool'!A:B,2,0)","v":"Tool 18"},{"$f":"Orders!B417/VLOOKUP(B417,Tools!A:C,3,0)","v":0.01},{"$f":"Orders!C417/VLOOKUP(B417,Tools!A:C,3,0)","v":5.7142857142857143E-3},{"$f":"Orders!D417/VLOOKUP(B417,Tools!A:C,3,0)","v":7.4999999999999997E-3}]
[{"$f":"Orders!A418","v":"UV2189115"},{"$f":"VLOOKUP(A418,'Product-tool'!A:B,2,0)","v":"Tool 2"},{"$f":"Orders!B418/VLOOKUP(B418,Tools!A:C,3,0)","v":7.1023076923076927},{"$f":"Orders!C418/VLOOKUP(B418,Tools!A:C,3,0)","v":9.2750000000000004},{"$f":"Orders!D418/VLOOKUP(B418,Tools!A:C,3,0)","v":7.5838461538461539}]
[{"$f":"Orders!A419","v":"UV2195087"},{"$f":"VLOOKUP(A419,'Product-tool'!A:B,2,0)","v":"Tool 7"},{"$f":"Orders!B419/VLOOKUP(B419,Tools!A:C,3,0)","v":1},{"$f":"Orders!C419/VLOOKUP(B419,Tools!A:C,3,0)","v":1.6912499999999999},{"$f":"Orders!D419/VLOOKUP(B419,Tools!A:C,3,0)","v":1.2353125}]
[{"$f":"Orders!A420","v":"UV2198207"},{"$f":"VLOOKUP(A420,'Product-tool'!A:B,2,0)","v":"Tool 9"},{"$f":"Orders!B420/VLOOKUP(B420,Tools!A:C,3,0)","v":2.95},{"$f":"Orders!C420/VLOOKUP(B420,Tools!A:C,3,0)","v":4.177083333333333},{"$f":"Orders!D420/VLOOKUP(B420,Tools!A:C,3,0)","v":3.2916666666666665}]
[{"$f":"Orders!A421","v":"UV2213161"},{"$f":"VLOOKUP(A421,'Product-tool'!A:B,2,0)","v":"Tool 2"},{"$f":"Orders!B421/VLOOKUP(B421,Tools!A:C,3,0)","v":1.2307692307692308},{"$f":"Orders!C421/VLOOKUP(B421,Tools!A:C,3,0)","v":0.92730769230769228},{"$f":"Orders!D421/VLOOKUP(B421,Tools!A:C,3,0)","v":1.0184615384615385}]
[{"$f":"Orders!A422","v":"UV2285856"},{"$f":"VLOOKUP(A422,'Product-tool'!A:B,2,0)","v":"Tool 9"},{"$f":"Orders!B422/VLOOKUP(B422,Tools!A:C,3,0)","v":0.69374999999999998},{"$f":"Orders!C422/VLOOKUP(B422,Tools!A:C,3,0)","v":0.49166666666666664},{"$f":"Orders!D422/VLOOKUP(B422,Tools!A:C,3,0)","v":0.56041666666666667}]
[{"$f":"Orders!A423","v":"UV2374219"},{"$f":"VLOOKUP(A423,'Product-tool'!A:B,2,0)","v":"Tool 18"},{"$f":"Orders!B423/VLOOKUP(B423,Tools!A:C,3,0)","v":2.3153571428571427},{"$f":"Orders!C423/VLOOKUP(B423,Tools!A:C,3,0)","v":1.8446428571428573},{"$f":"Orders!D423/VLOOKUP(B423,Tools!A:C,3,0)","v":1.9596428571428572}]
[{"$f":"Orders!A424","v":"UV2452537"},{"$f":"VLOOKUP(A424,'Product-tool'!A:B,2,0)","v":"Tool 2"},{"$f":"Orders!B424/VLOOKUP(B424,Tools!A:C,3,0)","v":1.2526923076923078},{"$f":"Orders!C424/VLOOKUP(B424,Tools!A:C,3,0)","v":1.0892307692307692},{"$f":"Orders!D424/VLOOKUP(B424,Tools!A:C,3,0)","v":1.1000000000000001}]
[{"$f":"Orders!A425","v":"UV250174"},{"$f":"VLOOKUP(A425,'Product-tool'!A:B,2,0)","v":"Tool 15"},{"$f":"Orders!B425/VLOOKUP(B425,Tools!A:C,3,0)","v":0.38431818181818184},{"$f":"Orders!C425/VLOOKUP(B425,Tools!A:C,3,0)","v":0.41613636363636364},{"$f":"Orders!D425/VLOOKUP(B425,Tools!A:C,3,0)","v":0.37318181818181817}]
[{"$f":"Orders!A426","v":"UV251396"},{"$f":"VLOOKUP(A426,'Product-tool'!A:B,2,0)","v":"Tool 9"},{"$f":"Orders!B426/VLOOKUP(B426,Tools!A:C,3,0)","v":3.1770833333333335},{"$f":"Orders!C426/VLOOKUP(B426,Tools!A:C,3,0)","v":4.510416666666667},{"$f":"Orders!D426/VLOOKUP(B426,Tools!A:C,3,0)","v":3.55}]
[{"$f":"Orders!A427","v":"UV252791"},{"$f":"VLOOKUP(A427,'Product-tool'!A:B,2,0)","v":"Tool 15"},{"$f":"Orders!B427/VLOOKUP(B427,Tools!A:C,3,0)","v":1.1022727272727273},{"$f":"Orders!C427/VLOOKUP(B427,Tools!A:C,3,0)","v":1.4881818181818183},{"$f":"Orders!D427/VLOOKUP(B427,Tools!A:C,3,0)","v":1.1981818181818182}]
[{"$f":"Orders!A428","v":"UV2535805"},{"$f":"VLOOKUP(A428,'Product-tool'!A:B,2,0)","v":"Tool 2"},{"$f":"Orders!B428/VLOOKUP(B428,Tools!A:C,3,0)","v":2.8203846153846155},{"$f":"Orders!C428/VLOOKUP(B428,Tools!A:C,3,0)","v":3.6603846153846153},{"$f":"Orders!D428/VLOOKUP(B428,Tools!A:C,3,0)","v":3.0019230769230769}]
[{"$f":"Orders!A429","v":"UV2636450"},{"$f":"VLOOKUP(A429,'Product-tool'!A:B,2,0)","v":"Tool 15"},{"$f":"Orders!B429/VLOOKUP(B429,Tools!A:C,3,0)","v":1.8636363636363635E-2},{"$f":"Orders!C429/VLOOKUP(B429,Tools!A:C,3,0)","v":3.2045454545454544E-2},{"$f":"Orders!D429/VLOOKUP(B429,Tools!A:C,3,0)","v":2.3409090909090911E-2}]
[{"$f":"Orders!A430","v":"UV2781330"},{"$f":"VLOOKUP(A430,'Product-tool'!A:B,2,0)","v":"Tool 17"},{"$f":"Orders!B430/VLOOKUP(B430,Tools!A:C,3,0)","v":0.10308823529411765},{"$f":"Orders!C430/VLOOKUP(B430,Tools!A:C,3,0)","v":0.12794117647058822},{"$f":"Orders!D430/VLOOKUP(B430,Tools!A:C,3,0)","v":0.10720588235294118}]
[{"$f":"Orders!A431","v":"UV2805946"},{"$f":"VLOOKUP(A431,'Product-tool'!A:B,2,0)","v":"Tool 3"},{"$f":"Orders!B431/VLOOKUP(B431,Tools!A:C,3,0)","v":0.11083333333333334},{"$f":"Orders!C431/VLOOKUP(B431,Tools!A:C,3,0)","v":0.17499999999999999},{"$f":"Orders!D431/VLOOKUP(B431,Tools!A:C,3,0)","v":0.13166666666666665}]
[{"$f":"Orders!A432","v":"UV2985514"},{"$f":"VLOOKUP(A432,'Product-tool'!A:B,2,0)","v":"Tool 2"},{"$f":"Orders!B432/VLOOKUP(B432,Tools!A:C,3,0)","v":0.20499999999999999},{"$f":"Orders!C432/VLOOKUP(B432,Tools!A:C,3,0)","v":0.16153846153846155},{"$f":"Orders!D432/VLOOKUP(B432,Tools!A:C,3,0)","v":0.17307692307692307}]
[{"$f":"Orders!A433","v":"UV3281153"},{"$f":"VLOOKUP(A433,'Product-tool'!A:B,2,0)","v":"Tool 11"},{"$f":"Orders!B433/VLOOKUP(B433,Tools!A:C,3,0)","v":9.5625},{"$f":"Orders!C433/VLOOKUP(B433,Tools!A:C,3,0)","v":9.8897637795275593},{"$f":"Orders!D433/VLOOKUP(B433,Tools!A:C,3,0)","v":9.0812007874015741}]
[{"$f":"Orders!A434","v":"UV3287428"},{"$f":"VLOOKUP(A434,'Product-tool'!A:B,2,0)","v":"Tool 9"},{"$f":"Orders!B434/VLOOKUP(B434,Tools!A:C,3,0)","v":2.2208333333333332},{"$f":"Orders!C434/VLOOKUP(B434,Tools!A:C,3,0)","v":3.5270833333333331},{"$f":"Orders!D434/VLOOKUP(B434,Tools!A:C,3,0)","v":2.6437499999999998}]
[{"$f":"Orders!A435","v":"UV3439245"},{"$f":"VLOOKUP(A435,'Product-tool'!A:B,2,0)","v":"Tool 18"},{"$f":"Orders!B435/VLOOKUP(B435,Tools!A:C,3,0)","v":0.5},{"$f":"Orders!C435/VLOOKUP(B435,Tools!A:C,3,0)","v":0.7092857142857143},{"$f":"Orders!D435/VLOOKUP(B435,Tools!A:C,3,0)","v":0.55821428571428566}]
[{"$f":"Orders!A436","v":"UV3533088"},{"$f":"VLOOKUP(A436,'Product-tool'!A:B,2,0)","v":"Tool 16"},{"$f":"Orders!B436/VLOOKUP(B436,Tools!A:C,3,0)","v":3.0882352941176472E-2},{"$f":"Orders!C436/VLOOKUP(B436,Tools!A:C,3,0)","v":2.2647058823529412E-2},{"$f":"Orders!D436/VLOOKUP(B436,Tools!A:C,3,0)","v":2.5294117647058825E-2}]
[{"$f":"Orders!A437","v":"UV3595016"},{"$f":"VLOOKUP(A437,'Product-tool'!A:B,2,0)","v":"Tool 2"},{"$f":"Orders!B437/VLOOKUP(B437,Tools!A:C,3,0)","v":0.74346153846153851},{"$f":"Orders!C437/VLOOKUP(B437,Tools!A:C,3,0)","v":1.1838461538461538},{"$f":"Orders!D437/VLOOKUP(B437,Tools!A:C,3,0)","v":0.8865384615384615}]
[{"$f":"Orders!A438","v":"UV3633599"},{"$f":"VLOOKUP(A438,'Product-tool'!A:B,2,0)","v":"Tool 2"},{"$f":"Orders!B438/VLOOKUP(B438,Tools!A:C,3,0)","v":2.5634615384615387},{"$f":"Orders!C438/VLOOKUP(B438,Tools!A:C,3,0)","v":2.5815384615384613},{"$f":"Orders!D438/VLOOKUP(B438,Tools!A:C,3,0)","v":2.4042307692307694}]
[{"$f":"Orders!A439","v":"UV3728968"},{"$f":"VLOOKUP(A439,'Product-tool'!A:B,2,0)","v":"Tool 15"},{"$f":"Orders!B439/VLOOKUP(B439,Tools!A:C,3,0)","v":0.14431818181818182},{"$f":"Orders!C439/VLOOKUP(B439,Tools!A:C,3,0)","v":0.19113636363636363},{"$f":"Orders!D439/VLOOKUP(B439,Tools!A:C,3,0)","v":0.15522727272727271}]
[{"$f":"Orders!A440","v":"UV385351"},{"$f":"VLOOKUP(A440,'Product-tool'!A:B,2,0)","v":"Tool 18"},{"$f":"Orders!B440/VLOOKUP(B440,Tools!A:C,3,0)","v":0.3075},{"$f":"Orders!C440/VLOOKUP(B440,Tools!A:C,3,0)","v":0.43964285714285717},{"$f":"Orders!D440/VLOOKUP(B440,Tools!A:C,3,0)","v":0.34499999999999997}]
[{"$f":"Orders!A441","v":"UV3942188"},{"$f":"VLOOKUP(A441,'Product-tool'!A:B,2,0)","v":"Tool 2"},{"$f":"Orders!B441/VLOOKUP(B441,Tools!A:C,3,0)","v":1.2611538461538461},{"$f":"Orders!C441/VLOOKUP(B441,Tools!A:C,3,0)","v":0.91153846153846152},{"$f":"Orders!D441/VLOOKUP(B441,Tools!A:C,3,0)","v":1.0269230769230768}]
[{"$f":"Orders!A442","v":"UV4094667"},{"$f":"VLOOKUP(A442,'Product-tool'!A:B,2,0)","v":"Tool 2"},{"$f":"Orders!B442/VLOOKUP(B442,Tools!A:C,3,0)","v":6.0273076923076925},{"$f":"Orders!C442/VLOOKUP(B442,Tools!A:C,3,0)","v":3.9226923076923077},{"$f":"Orders!D442/VLOOKUP(B442,Tools!A:C,3,0)","v":4.7192307692307693}]
[{"$f":"Orders!A443","v":"UV4105152"},{"$f":"VLOOKUP(A443,'Product-tool'!A:B,2,0)","v":"Tool 2"},{"$f":"Orders!B443/VLOOKUP(B443,Tools!A:C,3,0)","v":2.5384615384615384E-2},{"$f":"Orders!C443/VLOOKUP(B443,Tools!A:C,3,0)","v":2.8846153846153848E-2},{"$f":"Orders!D443/VLOOKUP(B443,Tools!A:C,3,0)","v":2.5384615384615384E-2}]
[{"$f":"Orders!A444","v":"UV4173990"},{"$f":"VLOOKUP(A444,'Product-tool'!A:B,2,0)","v":"Tool 18"},{"$f":"Orders!B444/VLOOKUP(B444,Tools!A:C,3,0)","v":0.60285714285714287},{"$f":"Orders!C444/VLOOKUP(B444,Tools!A:C,3,0)","v":0.47428571428571431},{"$f":"Orders!D444/VLOOKUP(B444,Tools!A:C,3,0)","v":0.50749999999999995}]
[{"$f":"Orders!A445","v":"UV4289343"},{"$f":"VLOOKUP(A445,'Product-tool'!A:B,2,0)","v":"Tool 16"},{"$f":"Orders!B445/VLOOKUP(B445,Tools!A:C,3,0)","v":3.558823529411765E-2},{"$f":"Orders!C445/VLOOKUP(B445,Tools!A:C,3,0)","v":3.8823529411764708E-2},{"$f":"Orders!D445/VLOOKUP(B445,Tools!A:C,3,0)","v":3.4705882352941177E-2}]
[{"$f":"Orders!A446","v":"UV4665563"},{"$f":"VLOOKUP(A446,'Product-tool'!A:B,2,0)","v":"Tool 7"},{"$f":"Orders!B446/VLOOKUP(B446,Tools!A:C,3,0)","v":0.47062500000000002},{"$f":"Orders!C446/VLOOKUP(B446,Tools!A:C,3,0)","v":0.80328124999999995},{"$f":"Orders!D446/VLOOKUP(B446,Tools!A:C,3,0)","v":0.58468750000000003}]
[{"$f":"Orders!A447","v":"UV4787798"},{"$f":"VLOOKUP(A447,'Product-tool'!A:B,2,0)","v":"Tool 2"},{"$f":"Orders!B447/VLOOKUP(B447,Tools!A:C,3,0)","v":9.6153846153846159E-2},{"$f":"Orders!C447/VLOOKUP(B447,Tools!A:C,3,0)","v":0.13961538461538461},{"$f":"Orders!D447/VLOOKUP(B447,Tools!A:C,3,0)","v":0.10884615384615384}]
[{"$f":"Orders!A448","v":"UV4917026"},{"$f":"VLOOKUP(A448,'Product-tool'!A:B,2,0)","v":"Tool 17"},{"$f":"Orders!B448/VLOOKUP(B448,Tools!A:C,3,0)","v":0.87411764705882355},{"$f":"Orders!C448/VLOOKUP(B448,Tools!A:C,3,0)","v":1.2392647058823529},{"$f":"Orders!D448/VLOOKUP(B448,Tools!A:C,3,0)","v":0.97588235294117642}]
[{"$f":"Orders!A449","v":"UV4926151"},{"$f":"VLOOKUP(A449,'Product-tool'!A:B,2,0)","v":"Tool 2"},{"$f":"Orders!B449/VLOOKUP(B449,Tools!A:C,3,0)","v":0.30769230769230771},{"$f":"Orders!C449/VLOOKUP(B449,Tools!A:C,3,0)","v":0.18076923076923077},{"$f":"Orders!D449/VLOOKUP(B449,Tools!A:C,3,0)","v":0.2323076923076923}]
[{"$f":"Orders!A450","v":"UV495822"},{"$f":"VLOOKUP(A450,'Product-tool'!A:B,2,0)","v":"Tool 17"},{"$f":"Orders!B450/VLOOKUP(B450,Tools!A:C,3,0)","v":6.852941176470588E-2},{"$f":"Orders!C450/VLOOKUP(B450,Tools!A:C,3,0)","v":8.7499999999999994E-2},{"$f":"Orders!D450/VLOOKUP(B450,Tools!A:C,3,0)","v":7.2352941176470592E-2}]
[{"$f":"Orders!A451","v":"UV5313868"},{"$f":"VLOOKUP(A451,'Product-tool'!A:B,2,0)","v":"Tool 15"},{"$f":"Orders!B451/VLOOKUP(B451,Tools!A:C,3,0)","v":2.2286363636363635},{"$f":"Orders!C451/VLOOKUP(B451,Tools!A:C,3,0)","v":2.9909090909090907},{"$f":"Orders!D451/VLOOKUP(B451,Tools!A:C,3,0)","v":2.4147727272727271}]
[{"$f":"Orders!A452","v":"UV5311573"},{"$f":"VLOOKUP(A452,'Product-tool'!A:B,2,0)","v":"Tool 9"},{"$f":"Orders!B452/VLOOKUP(B452,Tools!A:C,3,0)","v":0.27708333333333335},{"$f":"Orders!C452/VLOOKUP(B452,Tools!A:C,3,0)","v":0.4375},{"$f":"Orders!D452/VLOOKUP(B452,Tools!A:C,3,0)","v":0.32916666666666666}]
[{"$f":"Orders!A453","v":"UV5362907"},{"$f":"VLOOKUP(A453,'Product-tool'!A:B,2,0)","v":"Tool 3"},{"$f":"Orders!B453/VLOOKUP(B453,Tools!A:C,3,0)","v":0.51041666666666663},{"$f":"Orders!C453/VLOOKUP(B453,Tools!A:C,3,0)","v":0.30166666666666669},{"$f":"Orders!D453/VLOOKUP(B453,Tools!A:C,3,0)","v":0.38624999999999998}]
[{"$f":"Orders!A454","v":"UV5366748"},{"$f":"VLOOKUP(A454,'Product-tool'!A:B,2,0)","v":"Tool 17"},{"$f":"Orders!B454/VLOOKUP(B454,Tools!A:C,3,0)","v":0.10411764705882352},{"$f":"Orders!C454/VLOOKUP(B454,Tools!A:C,3,0)","v":8.5441176470588229E-2},{"$f":"Orders!D454/VLOOKUP(B454,Tools!A:C,3,0)","v":8.926470588235294E-2}]
[{"$f":"Orders!A455","v":"UV5379200"},{"$f":"VLOOKUP(A455,'Product-tool'!A:B,2,0)","v":"Tool 2"},{"$f":"Orders!B455/VLOOKUP(B455,Tools!A:C,3,0)","v":1.2788461538461537},{"$f":"Orders!C455/VLOOKUP(B455,Tools!A:C,3,0)","v":0.95192307692307687},{"$f":"Orders!D455/VLOOKUP(B455,Tools!A:C,3,0)","v":1.0534615384615384}]
[{"$f":"Orders!A456","v":"UV5416692"},{"$f":"VLOOKUP(A456,'Product-tool'!A:B,2,0)","v":"Tool 2"},{"$f":"Orders!B456/VLOOKUP(B456,Tools!A:C,3,0)","v":0.125},{"$f":"Orders!C456/VLOOKUP(B456,Tools!A:C,3,0)","v":0.19384615384615383},{"$f":"Orders!D456/VLOOKUP(B456,Tools!A:C,3,0)","v":0.14692307692307693}]
[{"$f":"Orders!A457","v":"UV5473062"},{"$f":"VLOOKUP(A457,'Product-tool'!A:B,2,0)","v":"Tool 2"},{"$f":"Orders!B457/VLOOKUP(B457,Tools!A:C,3,0)","v":0.22423076923076923},{"$f":"Orders!C457/VLOOKUP(B457,Tools!A:C,3,0)","v":0.25846153846153846},{"$f":"Orders!D457/VLOOKUP(B457,Tools!A:C,3,0)","v":0.22461538461538461}]
[{"$f":"Orders!A458","v":"UV5494145"},{"$f":"VLOOKUP(A458,'Product-tool'!A:B,2,0)","v":"Tool 4"},{"$f":"Orders!B458/VLOOKUP(B458,Tools!A:C,3,0)","v":0.19118308591992803},{"$f":"Orders!C458/VLOOKUP(B458,Tools!A:C,3,0)","v":0.1349527665317139},{"$f":"Orders!D458/VLOOKUP(B458,Tools!A:C,3,0)","v":0.15429599640125957}]
[{"$f":"Orders!A459","v":"UV5555407"},{"$f":"VLOOKUP(A459,'Product-tool'!A:B,2,0)","v":"Tool 7"},{"$f":"Orders!B459/VLOOKUP(B459,Tools!A:C,3,0)","v":0.2134375},{"$f":"Orders!C459/VLOOKUP(B459,Tools!A:C,3,0)","v":0.35171875000000002},{"$f":"Orders!D459/VLOOKUP(B459,Tools!A:C,3,0)","v":0.25968750000000002}]
[{"$f":"Orders!A460","v":"UV562824"},{"$f":"VLOOKUP(A460,'Product-tool'!A:B,2,0)","v":"Tool 3"},{"$f":"Orders!B460/VLOOKUP(B460,Tools!A:C,3,0)","v":0.88791666666666669},{"$f":"Orders!C460/VLOOKUP(B460,Tools!A:C,3,0)","v":1.2695833333333333},{"$f":"Orders!D460/VLOOKUP(B460,Tools!A:C,3,0)","v":0.99624999999999997}]
[{"$f":"Orders!A461","v":"UV5677822"},{"$f":"VLOOKUP(A461,'Product-tool'!A:B,2,0)","v":"Tool 2"},{"$f":"Orders!B461/VLOOKUP(B461,Tools!A:C,3,0)","v":0.15384615384615385},{"$f":"Orders!C461/VLOOKUP(B461,Tools!A:C,3,0)","v":0.11076923076923077},{"$f":"Orders!D461/VLOOKUP(B461,Tools!A:C,3,0)","v":0.125}]
[{"$f":"Orders!A462","v":"UV5685234"},{"$f":"VLOOKUP(A462,'Product-tool'!A:B,2,0)","v":"Tool 9"},{"$f":"Orders!B462/VLOOKUP(B462,Tools!A:C,3,0)","v":0.15},{"$f":"Orders!C462/VLOOKUP(B462,Tools!A:C,3,0)","v":0.13333333333333333},{"$f":"Orders!D462/VLOOKUP(B462,Tools!A:C,3,0)","v":0.13333333333333333}]
[{"$f":"Orders!A463","v":"UV5689814"},{"$f":"VLOOKUP(A463,'Product-tool'!A:B,2,0)","v":"Tool 3"},{"$f":"Orders!B463/VLOOKUP(B463,Tools!A:C,3,0)","v":3.3333333333333335E-3},{"$f":"Orders!C463/VLOOKUP(B463,Tools!A:C,3,0)","v":2.5000000000000001E-3},{"$f":"Orders!D463/VLOOKUP(B463,Tools!A:C,3,0)","v":2.9166666666666668E-3}]
[{"$f":"Orders!A464","v":"UV5762734"},{"$f":"VLOOKUP(A464,'Product-tool'!A:B,2,0)","v":"Tool 9"},{"$f":"Orders!B464/VLOOKUP(B464,Tools!A:C,3,0)","v":1.0854166666666667},{"$f":"Orders!C464/VLOOKUP(B464,Tools!A:C,3,0)","v":1.4416666666666667},{"$f":"Orders!D464/VLOOKUP(B464,Tools!A:C,3,0)","v":1.16875}]
[{"$f":"Orders!A465","v":"UV579433"},{"$f":"VLOOKUP(A465,'Product-tool'!A:B,2,0)","v":"Tool 2"},{"$f":"Orders!B465/VLOOKUP(B465,Tools!A:C,3,0)","v":0.15846153846153846},{"$f":"Orders!C465/VLOOKUP(B465,Tools!A:C,3,0)","v":0.16307692307692306},{"$f":"Orders!D465/VLOOKUP(B465,Tools!A:C,3,0)","v":0.15}]
[{"$f":"Orders!A466","v":"UV5815295"},{"$f":"VLOOKUP(A466,'Product-tool'!A:B,2,0)","v":"Tool 2"},{"$f":"Orders!B466/VLOOKUP(B466,Tools!A:C,3,0)","v":9.8076923076923075E-2},{"$f":"Orders!C466/VLOOKUP(B466,Tools!A:C,3,0)","v":6.9230769230769235E-2},{"$f":"Orders!D466/VLOOKUP(B466,Tools!A:C,3,0)","v":7.923076923076923E-2}]
[{"$f":"Orders!A467","v":"UV5813627"},{"$f":"VLOOKUP(A467,'Product-tool'!A:B,2,0)","v":"Tool 3"},{"$f":"Orders!B467/VLOOKUP(B467,Tools!A:C,3,0)","v":0.16541666666666666},{"$f":"Orders!C467/VLOOKUP(B467,Tools!A:C,3,0)","v":0.27666666666666667},{"$f":"Orders!D467/VLOOKUP(B467,Tools!A:C,3,0)","v":0.20291666666666666}]
[{"$f":"Orders!A468","v":"UV588115"},{"$f":"VLOOKUP(A468,'Product-tool'!A:B,2,0)","v":"Tool 19"},{"$f":"Orders!B468/VLOOKUP(B468,Tools!A:C,3,0)","v":7.8678206136900079E-4},{"$f":"Orders!C468/VLOOKUP(B468,Tools!A:C,3,0)","v":3.9339103068450039E-4},{"$f":"Orders!D468/VLOOKUP(B468,Tools!A:C,3,0)","v":5.9008654602675059E-4}]
[{"$f":"Orders!A469","v":"UV5924094"},{"$f":"VLOOKUP(A469,'Product-tool'!A:B,2,0)","v":"Tool 15"},{"$f":"Orders!B469/VLOOKUP(B469,Tools!A:C,3,0)","v":0.55795454545454548},{"$f":"Orders!C469/VLOOKUP(B469,Tools!A:C,3,0)","v":0.54431818181818181},{"$f":"Orders!D469/VLOOKUP(B469,Tools!A:C,3,0)","v":0.51568181818181813}]
[{"$f":"Orders!A470","v":"UV5928329"},{"$f":"VLOOKUP(A470,'Product-tool'!A:B,2,0)","v":"Tool 15"},{"$f":"Orders!B470/VLOOKUP(B470,Tools!A:C,3,0)","v":7.0000000000000007E-2},{"$f":"Orders!C470/VLOOKUP(B470,Tools!A:C,3,0)","v":0.10840909090909091},{"$f":"Orders!D470/VLOOKUP(B470,Tools!A:C,3,0)","v":8.2272727272727275E-2}]
[{"$f":"Orders!A471","v":"UV5947578"},{"$f":"VLOOKUP(A471,'Product-tool'!A:B,2,0)","v":"Tool 3"},{"$f":"Orders!B471/VLOOKUP(B471,Tools!A:C,3,0)","v":0.64083333333333337},{"$f":"Orders!C471/VLOOKUP(B471,Tools!A:C,3,0)","v":0.82958333333333334},{"$f":"Orders!D471/VLOOKUP(B471,Tools!A:C,3,0)","v":0.68125000000000002}]
[{"$f":"Orders!A472","v":"UV5956413"},{"$f":"VLOOKUP(A472,'Product-tool'!A:B,2,0)","v":"Tool 3"},{"$f":"Orders!B472/VLOOKUP(B472,Tools!A:C,3,0)","v":0.66083333333333338},{"$f":"Orders!C472/VLOOKUP(B472,Tools!A:C,3,0)","v":0.95},{"$f":"Orders!D472/VLOOKUP(B472,Tools!A:C,3,0)","v":0.74333333333333329}]
[{"$f":"Orders!A473","v":"UV5951712"},{"$f":"VLOOKUP(A473,'Product-tool'!A:B,2,0)","v":"Tool 16"},{"$f":"Orders!B473/VLOOKUP(B473,Tools!A:C,3,0)","v":9.794117647058824E-2},{"$f":"Orders!C473/VLOOKUP(B473,Tools!A:C,3,0)","v":0.14294117647058824},{"$f":"Orders!D473/VLOOKUP(B473,Tools!A:C,3,0)","v":0.11117647058823529}]
[{"$f":"Orders!A474","v":"UV6238373"},{"$f":"VLOOKUP(A474,'Product-tool'!A:B,2,0)","v":"Tool 16"},{"$f":"Orders!B474/VLOOKUP(B474,Tools!A:C,3,0)","v":7.9411764705882345E-3},{"$f":"Orders!C474/VLOOKUP(B474,Tools!A:C,3,0)","v":1.088235294117647E-2},{"$f":"Orders!D474/VLOOKUP(B474,Tools!A:C,3,0)","v":8.6764705882352942E-3}]
[{"$f":"Orders!A475","v":"UV6241191"},{"$f":"VLOOKUP(A475,'Product-tool'!A:B,2,0)","v":"Tool 2"},{"$f":"Orders!B475/VLOOKUP(B475,Tools!A:C,3,0)","v":2.1538461538461537},{"$f":"Orders!C475/VLOOKUP(B475,Tools!A:C,3,0)","v":3.473846153846154},{"$f":"Orders!D475/VLOOKUP(B475,Tools!A:C,3,0)","v":2.5873076923076921}]
[{"$f":"Orders!A476","v":"UV6252256"},{"$f":"VLOOKUP(A476,'Product-tool'!A:B,2,0)","v":"Tool 7"},{"$f":"Orders!B476/VLOOKUP(B476,Tools!A:C,3,0)","v":5.1562500000000002E-3},{"$f":"Orders!C476/VLOOKUP(B476,Tools!A:C,3,0)","v":4.5312499999999997E-3},{"$f":"Orders!D476/VLOOKUP(B476,Tools!A:C,3,0)","v":4.5312499999999997E-3}]
[{"$f":"Orders!A477","v":"UV631601"},{"$f":"VLOOKUP(A477,'Product-tool'!A:B,2,0)","v":"Tool 17"},{"$f":"Orders!B477/VLOOKUP(B477,Tools!A:C,3,0)","v":0.15676470588235294},{"$f":"Orders!C477/VLOOKUP(B477,Tools!A:C,3,0)","v":0.21720588235294117},{"$f":"Orders!D477/VLOOKUP(B477,Tools!A:C,3,0)","v":0.17279411764705882}]
[{"$f":"Orders!A478","v":"UV6411805"},{"$f":"VLOOKUP(A478,'Product-tool'!A:B,2,0)","v":"Tool 2"},{"$f":"Orders!B478/VLOOKUP(B478,Tools!A:C,3,0)","v":6.4261538461538459},{"$f":"Orders!C478/VLOOKUP(B478,Tools!A:C,3,0)","v":6.5949999999999998},{"$f":"Orders!D478/VLOOKUP(B478,Tools!A:C,3,0)","v":6.0803846153846157}]
[{"$f":"Orders!A479","v":"UV6937295"},{"$f":"VLOOKUP(A479,'Product-tool'!A:B,2,0)","v":"Tool 2"},{"$f":"Orders!B479/VLOOKUP(B479,Tools!A:C,3,0)","v":2.1538461538461538E-2},{"$f":"Orders!C479/VLOOKUP(B479,Tools!A:C,3,0)","v":3.307692307692308E-2},{"$f":"Orders!D479/VLOOKUP(B479,Tools!A:C,3,0)","v":2.5384615384615384E-2}]
[{"$f":"Orders!A480","v":"UV8505006"},{"$f":"VLOOKUP(A480,'Product-tool'!A:B,2,0)","v":"Tool 2"},{"$f":"Orders!B480/VLOOKUP(B480,Tools!A:C,3,0)","v":1.9307692307692308},{"$f":"Orders!C480/VLOOKUP(B480,Tools!A:C,3,0)","v":2.6665384615384617},{"$f":"Orders!D480/VLOOKUP(B480,Tools!A:C,3,0)","v":2.1246153846153848}]
[{"$f":"Orders!A481","v":"UV8538779"},{"$f":"VLOOKUP(A481,'Product-tool'!A:B,2,0)","v":"Tool 2"},{"$f":"Orders!B481/VLOOKUP(B481,Tools!A:C,3,0)","v":0.62346153846153851},{"$f":"Orders!C481/VLOOKUP(B481,Tools!A:C,3,0)","v":0.75384615384615383},{"$f":"Orders!D481/VLOOKUP(B481,Tools!A:C,3,0)","v":0.63961538461538459}]
[{"$f":"Orders!A482","v":"VE8008533"},{"$f":"VLOOKUP(A482,'Product-tool'!A:B,2,0)","v":"Tool 2"},{"$f":"Orders!B482/VLOOKUP(B482,Tools!A:C,3,0)","v":6.1538461538461538E-3},{"$f":"Orders!C482/VLOOKUP(B482,Tools!A:C,3,0)","v":7.3076923076923076E-3},{"$f":"Orders!D482/VLOOKUP(B482,Tools!A:C,3,0)","v":6.5384615384615381E-3}]
[{"$f":"Orders!A483","v":"VE8096041"},{"$f":"VLOOKUP(A483,'Product-tool'!A:B,2,0)","v":"Tool 2"},{"$f":"Orders!B483/VLOOKUP(B483,Tools!A:C,3,0)","v":0.32038461538461538},{"$f":"Orders!C483/VLOOKUP(B483,Tools!A:C,3,0)","v":0.20692307692307693},{"$f":"Orders!D483/VLOOKUP(B483,Tools!A:C,3,0)","v":0.25}]
[{"$f":"Orders!A484","v":"VE8166035"},{"$f":"VLOOKUP(A484,'Product-tool'!A:B,2,0)","v":"Tool 2"},{"$f":"Orders!B484/VLOOKUP(B484,Tools!A:C,3,0)","v":1.7946153846153847},{"$f":"Orders!C484/VLOOKUP(B484,Tools!A:C,3,0)","v":2.1446153846153848},{"$f":"Orders!D484/VLOOKUP(B484,Tools!A:C,3,0)","v":1.83}]
[{"$f":"Orders!A485","v":"VE8168353"},{"$f":"VLOOKUP(A485,'Product-tool'!A:B,2,0)","v":"Tool 2"},{"$f":"Orders!B485/VLOOKUP(B485,Tools!A:C,3,0)","v":2.4357692307692309},{"$f":"Orders!C485/VLOOKUP(B485,Tools!A:C,3,0)","v":3.0776923076923075},{"$f":"Orders!D485/VLOOKUP(B485,Tools!A:C,3,0)","v":2.5561538461538462}]
[{"$f":"Orders!A486","v":"VE8207633"},{"$f":"VLOOKUP(A486,'Product-tool'!A:B,2,0)","v":"Tool 17"},{"$f":"Orders!B486/VLOOKUP(B486,Tools!A:C,3,0)","v":0.1225},{"$f":"Orders!C486/VLOOKUP(B486,Tools!A:C,3,0)","v":0.1075},{"$f":"Orders!D486/VLOOKUP(B486,Tools!A:C,3,0)","v":0.10794117647058823}]
[{"$f":"Orders!A487","v":"Z00307730"},{"$f":"VLOOKUP(A487,'Product-tool'!A:B,2,0)","v":"Tool 19"},{"$f":"Orders!B487/VLOOKUP(B487,Tools!A:C,3,0)","v":4.4256490952006296E-2},{"$f":"Orders!C487/VLOOKUP(B487,Tools!A:C,3,0)","v":4.8288749016522421E-2},{"$f":"Orders!D487/VLOOKUP(B487,Tools!A:C,3,0)","v":4.3076317859952792E-2}]
[{"$f":"Orders!A488","v":"ZD1446821"},{"$f":"VLOOKUP(A488,'Product-tool'!A:B,2,0)","v":"Tool 5"},{"$f":"Orders!B488/VLOOKUP(B488,Tools!A:C,3,0)","v":0.65083333333333337},{"$f":"Orders!C488/VLOOKUP(B488,Tools!A:C,3,0)","v":0.5591666666666667},{"$f":"Orders!D488/VLOOKUP(B488,Tools!A:C,3,0)","v":0.56916666666666671}]
[{"$f":"Orders!A489","v":"ZD1471989"},{"$f":"VLOOKUP(A489,'Product-tool'!A:B,2,0)","v":"Tool 5"},{"$f":"Orders!B489/VLOOKUP(B489,Tools!A:C,3,0)","v":1.125},{"$f":"Orders!C489/VLOOKUP(B489,Tools!A:C,3,0)","v":1.7775000000000001},{"$f":"Orders!D489/VLOOKUP(B489,Tools!A:C,3,0)","v":1.335}]
[{"$f":"Orders!A490","v":"ZD173254"},{"$f":"VLOOKUP(A490,'Product-tool'!A:B,2,0)","v":"Tool 5"},{"$f":"Orders!B490/VLOOKUP(B490,Tools!A:C,3,0)","v":5.833333333333333},{"$f":"Orders!C490/VLOOKUP(B490,Tools!A:C,3,0)","v":9.2650000000000006},{"$f":"Orders!D490/VLOOKUP(B490,Tools!A:C,3,0)","v":6.9450000000000003}]
[{"$f":"Orders!A491","v":"ZD2443045"},{"$f":"VLOOKUP(A491,'Product-tool'!A:B,2,0)","v":"Tool 2"},{"$f":"Orders!B491/VLOOKUP(B491,Tools!A:C,3,0)","v":6.5384615384615383},{"$f":"Orders!C491/VLOOKUP(B491,Tools!A:C,3,0)","v":9.68576923076923},{"$f":"Orders!D491/VLOOKUP(B491,Tools!A:C,3,0)","v":7.4803846153846152}]
[{"$f":"Orders!A492","v":"VE8109961"},{"$f":"VLOOKUP(A492,'Product-tool'!A:B,2,0)","v":"Tool 10"},{"$f":"Orders!B492/VLOOKUP(B492,Tools!A:C,3,0)","v":2.8922580645161289},{"$f":"Orders!C492/VLOOKUP(B492,Tools!A:C,3,0)","v":3.1877419354838707},{"$f":"Orders!D492/VLOOKUP(B492,Tools!A:C,3,0)","v":2.8322580645161288}]
[{"$f":"Orders!A493","v":"VE5219409"},{"$f":"VLOOKUP(A493,'Product-tool'!A:B,2,0)","v":"Tool 3"},{"$f":"Orders!B493/VLOOKUP(B493,Tools!A:C,3,0)","v":0.15375},{"$f":"Orders!C493/VLOOKUP(B493,Tools!A:C,3,0)","v":0.17458333333333334},{"$f":"Orders!D493/VLOOKUP(B493,Tools!A:C,3,0)","v":0.15291666666666667}]
[{"$f":"Orders!A494","v":0},{"$f":"VLOOKUP(A494,'Product-tool'!A:B,2,0)","v":{"$error":"#N/A"}},{"$f":"Orders!B494/VLOOKUP(B494,Tools!A:C,3,0)","v":{"$error":"#N/A"}},{"$f":"Orders!C494/VLOOKUP(B494,Tools!A:C,3,0)","v":{"$error":"#N/A"}},{"$f":"Orders!D494/VLOOKUP(B494,Tools!A:C,3,0)","v":{"$error":"#N/A"}}]
[{"$f":"Orders!A495","v":0},{"$f":"VLOOKUP(A495,'Product-tool'!A:B,2,0)","v":{"$error":"#N/A"}},{"$f":"Orders!B495/VLOOKUP(B495,Tools!A:C,3,0)","v":{"$error":"#N/A"}},{"$f":"Orders!C495/VLOOKUP(B495,Tools!A:C,3,0)","v":{"$error":"#N/A"}},{"$f":"Orders!D495/VLOOKUP(B495,Tools!A:C,3,0)","v":{"$error":"#N/A"}}]
[{"$f":"Orders!A496","v":0},{"$f":"VLOOKUP(A496,'Product-tool'!A:B,2,0)","v":{"$error":"#N/A"}},{"$f":"Orders!B496/VLOOKUP(B496,Tools!A:C,3,0)","v":{"$error":"#N/A"}},{"$f":"Orders!C496/VLOOKUP(B496,Tools!A:C,3,0)","v":{"$error":"#N/A"}},{"$f":"Orders!D496/VLOOKUP(B496,Tools!A:C,3,0)","v":{"$error":"#N/A"}}]
[{"$f":"Orders!A497","v":0},{"$f":"VLOOKUP(A497,'Product-tool'!A:B,2,0)","v":{"$error":"#N/A"}},{"$f":"Orders!B497/VLOOKUP(B497,Tools!A:C,3,0)","v":{"$error":"#N/A"}},{"$f":"Orders!C497/VLOOKUP(B497,Tools!A:C,3,0)","v":{"$error":"#N/A"}},{"$f":"Orders!D497/VLOOKUP(B497,Tools!A:C,3,0)","v":{"$error":"#N/A"}}]
[{"$f":"Orders!A498","v":0},{"$f":"VLOOKUP(A498,'Product-tool'!A:B,2,0)","v":{"$error":"#N/A"}},{"$f":"Orders!B498/VLOOKUP(B498,Tools!A:C,3,0)","v":{"$error":"#N/A"}},{"$f":"Orders!C498/VLOOKUP(B498,Tools!A:C,3,0)","v":{"$error":"#N/A"}},{"$f":"Orders!D498/VLOOKUP(B498,Tools!A:C,3,0)","v":{"$error":"#N/A"}}]
[{"$f":"Orders!A499","v":0},{"$f":"VLOOKUP(A499,'Product-tool'!A:B,2,0)","v":{"$error":"#N/A"}},{"$f":"Orders!B499/VLOOKUP(B499,Tools!A:C,3,0)","v":{"$error":"#N/A"}},{"$f":"Orders!C499/VLOOKUP(B499,Tools!A:C,3,0)","v":{"$error":"#N/A"}},{"$f":"Orders!D499/VLOOKUP(B499,Tools!A:C,3,0)","v":{"$error":"#N/A"}}]
[{"$f":"Orders!A500","v":0},{"$f":"VLOOKUP(A500,'Product-tool'!A:B,2,0)","v":{"$error":"#N/A"}},{"$f":"Orders!B500/VLOOKUP(B500,Tools!A:C,3,0)","v":{"$error":"#N/A"}},{"$f":"Orders!C500/VLOOKUP(B500,Tools!A:C,3,0)","v":{"$error":"#N/A"}},{"$f":"Orders!D500/VLOOKUP(B500,Tools!A:C,3,0)","v":{"$error":"#N/A"}}]
[{"$f":"Orders!A501","v":0},{"$f":"VLOOKUP(A501,'Product-tool'!A:B,2,0)","v":{"$error":"#N/A"}},{"$f":"Orders!B501/VLOOKUP(B501,Tools!A:C,3,0)","v":{"$error":"#N/A"}},{"$f":"Orders!C501/VLOOKUP(B501,Tools!A:C,3,0)","v":{"$error":"#N/A"}},{"$f":"Orders!D501/VLOOKUP(B501,Tools!A:C,3,0)","v":{"$error":"#N/A"}}]
[{"$f":"Orders!A502","v":0},{"$f":"VLOOKUP(A502,'Product-tool'!A:B,2,0)","v":{"$error":"#N/A"}},{"$f":"Orders!B502/VLOOKUP(B502,Tools!A:C,3,0)","v":{"$error":"#N/A"}},{"$f":"Orders!C502/VLOOKUP(B502,Tools!A:C,3,0)","v":{"$error":"#N/A"}},{"$f":"Orders!D502/VLOOKUP(B502,Tools!A:C,3,0)","v":{"$error":"#N/A"}}]
[{"$f":"Orders!A503","v":0},{"$f":"VLOOKUP(A503,'Product-tool'!A:B,2,0)","v":{"$error":"#N/A"}},{"$f":"Orders!B503/VLOOKUP(B503,Tools!A:C,3,0)","v":{"$error":"#N/A"}},{"$f":"Orders!C503/VLOOKUP(B503,Tools!A:C,3,0)","v":{"$error":"#N/A"}},{"$f":"Orders!D503/VLOOKUP(B503,Tools!A:C,3,0)","v":{"$error":"#N/A"}}]
[{"$f":"Orders!A504","v":0},{"$f":"VLOOKUP(A504,'Product-tool'!A:B,2,0)","v":{"$error":"#N/A"}},{"$f":"Orders!B504/VLOOKUP(B504,Tools!A:C,3,0)","v":{"$error":"#N/A"}},{"$f":"Orders!C504/VLOOKUP(B504,Tools!A:C,3,0)","v":{"$error":"#N/A"}},{"$f":"Orders!D504/VLOOKUP(B504,Tools!A:C,3,0)","v":{"$error":"#N/A"}}]
[{"$f":"Orders!A505","v":0},{"$f":"VLOOKUP(A505,'Product-tool'!A:B,2,0)","v":{"$error":"#N/A"}},{"$f":"Orders!B505/VLOOKUP(B505,Tools!A:C,3,0)","v":{"$error":"#N/A"}},{"$f":"Orders!C505/VLOOKUP(B505,Tools!A:C,3,0)","v":{"$error":"#N/A"}},{"$f":"Orders!D505/VLOOKUP(B505,Tools!A:C,3,0)","v":{"$error":"#N/A"}}]
[{"$f":"Orders!A506","v":0},{"$f":"VLOOKUP(A506,'Product-tool'!A:B,2,0)","v":{"$error":"#N/A"}},{"$f":"Orders!B506/VLOOKUP(B506,Tools!A:C,3,0)","v":{"$error":"#N/A"}},{"$f":"Orders!C506/VLOOKUP(B506,Tools!A:C,3,0)","v":{"$error":"#N/A"}},{"$f":"Orders!D506/VLOOKUP(B506,Tools!A:C,3,0)","v":{"$error":"#N/A"}}]
[{"$f":"Orders!A507","v":0},{"$f":"VLOOKUP(A507,'Product-tool'!A:B,2,0)","v":{"$error":"#N/A"}},{"$f":"Orders!B507/VLOOKUP(B507,Tools!A:C,3,0)","v":{"$error":"#N/A"}},{"$f":"Orders!C507/VLOOKUP(B507,Tools!A:C,3,0)","v":{"$error":"#N/A"}},{"$f":"Orders!D507/VLOOKUP(B507,Tools!A:C,3,0)","v":{"$error":"#N/A"}}]
[{"$f":"Orders!A508","v":0},{"$f":"VLOOKUP(A508,'Product-tool'!A:B,2,0)","v":{"$error":"#N/A"}},{"$f":"Orders!B508/VLOOKUP(B508,Tools!A:C,3,0)","v":{"$error":"#N/A"}},{"$f":"Orders!C508/VLOOKUP(B508,Tools!A:C,3,0)","v":{"$error":"#N/A"}},{"$f":"Orders!D508/VLOOKUP(B508,Tools!A:C,3,0)","v":{"$error":"#N/A"}}]
[{"$f":"Orders!A509","v":0},{"$f":"VLOOKUP(A509,'Product-tool'!A:B,2,0)","v":{"$error":"#N/A"}},{"$f":"Orders!B509/VLOOKUP(B509,Tools!A:C,3,0)","v":{"$error":"#N/A"}},{"$f":"Orders!C509/VLOOKUP(B509,Tools!A:C,3,0)","v":{"$error":"#N/A"}},{"$f":"Orders!D509/VLOOKUP(B509,Tools!A:C,3,0)","v":{"$error":"#N/A"}}]
[{"$f":"Orders!A510","v":0},{"$f":"VLOOKUP(A510,'Product-tool'!A:B,2,0)","v":{"$error":"#N/A"}},{"$f":"Orders!B510/VLOOKUP(B510,Tools!A:C,3,0)","v":{"$error":"#N/A"}},{"$f":"Orders!C510/VLOOKUP(B510,Tools!A:C,3,0)","v":{"$error":"#N/A"}},{"$f":"Orders!D510/VLOOKUP(B510,Tools!A:C,3,0)","v":{"$error":"#N/A"}}]
[{"$f":"Orders!A511","v":0},{"$f":"VLOOKUP(A511,'Product-tool'!A:B,2,0)","v":{"$error":"#N/A"}},{"$f":"Orders!B511/VLOOKUP(B511,Tools!A:C,3,0)","v":{"$error":"#N/A"}},{"$f":"Orders!C511/VLOOKUP(B511,Tools!A:C,3,0)","v":{"$error":"#N/A"}},{"$f":"Orders!D511/VLOOKUP(B511,Tools!A:C,3,0)","v":{"$error":"#N/A"}}]
[{"$f":"Orders!A512","v":0},{"$f":"VLOOKUP(A512,'Product-tool'!A:B,2,0)","v":{"$error":"#N/A"}},{"$f":"Orders!B512/VLOOKUP(B512,Tools!A:C,3,0)","v":{"$error":"#N/A"}},{"$f":"Orders!C512/VLOOKUP(B512,Tools!A:C,3,0)","v":{"$error":"#N/A"}},{"$f":"Orders!D512/VLOOKUP(B512,Tools!A:C,3,0)","v":{"$error":"#N/A"}}]
[{"$f":"Orders!A513","v":0},{"$f":"VLOOKUP(A513,'Product-tool'!A:B,2,0)","v":{"$error":"#N/A"}},{"$f":"Orders!B513/VLOOKUP(B513,Tools!A:C,3,0)","v":{"$error":"#N/A"}},{"$f":"Orders!C513/VLOOKUP(B513,Tools!A:C,3,0)","v":{"$error":"#N/A"}},{"$f":"Orders!D513/VLOOKUP(B513,Tools!A:C,3,0)","v":{"$error":"#N/A"}}]
[{"$f":"Orders!A514","v":0},{"$f":"VLOOKUP(A514,'Product-tool'!A:B,2,0)","v":{"$error":"#N/A"}},{"$f":"Orders!B514/VLOOKUP(B514,Tools!A:C,3,0)","v":{"$error":"#N/A"}},{"$f":"Orders!C514/VLOOKUP(B514,Tools!A:C,3,0)","v":{"$error":"#N/A"}},{"$f":"Orders!D514/VLOOKUP(B514,Tools!A:C,3,0)","v":{"$error":"#N/A"}}]
[{"$f":"Orders!A515","v":0},{"$f":"VLOOKUP(A515,'Product-tool'!A:B,2,0)","v":{"$error":"#N/A"}},{"$f":"Orders!B515/VLOOKUP(B515,Tools!A:C,3,0)","v":{"$error":"#N/A"}},{"$f":"Orders!C515/VLOOKUP(B515,Tools!A:C,3,0)","v":{"$error":"#N/A"}},{"$f":"Orders!D515/VLOOKUP(B515,Tools!A:C,3,0)","v":{"$error":"#N/A"}}]
[{"$f":"Orders!A516","v":0},{"$f":"VLOOKUP(A516,'Product-tool'!A:B,2,0)","v":{"$error":"#N/A"}},{"$f":"Orders!B516/VLOOKUP(B516,Tools!A:C,3,0)","v":{"$error":"#N/A"}},{"$f":"Orders!C516/VLOOKUP(B516,Tools!A:C,3,0)","v":{"$error":"#N/A"}},{"$f":"Orders!D516/VLOOKUP(B516,Tools!A:C,3,0)","v":{"$error":"#N/A"}}]
[{"$f":"Orders!A517","v":0},{"$f":"VLOOKUP(A517,'Product-tool'!A:B,2,0)","v":{"$error":"#N/A"}},{"$f":"Orders!B517/VLOOKUP(B517,Tools!A:C,3,0)","v":{"$error":"#N/A"}},{"$f":"Orders!C517/VLOOKUP(B517,Tools!A:C,3,0)","v":{"$error":"#N/A"}},{"$f":"Orders!D517/VLOOKUP(B517,Tools!A:C,3,0)","v":{"$error":"#N/A"}}]
[{"$f":"Orders!A518","v":0},{"$f":"VLOOKUP(A518,'Product-tool'!A:B,2,0)","v":{"$error":"#N/A"}},{"$f":"Orders!B518/VLOOKUP(B518,Tools!A:C,3,0)","v":{"$error":"#N/A"}},{"$f":"Orders!C518/VLOOKUP(B518,Tools!A:C,3,0)","v":{"$error":"#N/A"}},{"$f":"Orders!D518/VLOOKUP(B518,Tools!A:C,3,0)","v":{"$error":"#N/A"}}]
[{"$f":"Orders!A519","v":0},{"$f":"VLOOKUP(A519,'Product-tool'!A:B,2,0)","v":{"$error":"#N/A"}},{"$f":"Orders!B519/VLOOKUP(B519,Tools!A:C,3,0)","v":{"$error":"#N/A"}},{"$f":"Orders!C519/VLOOKUP(B519,Tools!A:C,3,0)","v":{"$error":"#N/A"}},{"$f":"Orders!D519/VLOOKUP(B519,Tools!A:C,3,0)","v":{"$error":"#N/A"}}]
[{"$f":"Orders!A520","v":0},{"$f":"VLOOKUP(A520,'Product-tool'!A:B,2,0)","v":{"$error":"#N/A"}},{"$f":"Orders!B520/VLOOKUP(B520,Tools!A:C,3,0)","v":{"$error":"#N/A"}},{"$f":"Orders!C520/VLOOKUP(B520,Tools!A:C,3,0)","v":{"$error":"#N/A"}},{"$f":"Orders!D520/VLOOKUP(B520,Tools!A:C,3,0)","v":{"$error":"#N/A"}}]
[{"$f":"Orders!A521","v":0},{"$f":"VLOOKUP(A521,'Product-tool'!A:B,2,0)","v":{"$error":"#N/A"}},{"$f":"Orders!B521/VLOOKUP(B521,Tools!A:C,3,0)","v":{"$error":"#N/A"}},{"$f":"Orders!C521/VLOOKUP(B521,Tools!A:C,3,0)","v":{"$error":"#N/A"}},{"$f":"Orders!D521/VLOOKUP(B521,Tools!A:C,3,0)","v":{"$error":"#N/A"}}]
[{"$f":"Orders!A522","v":0},{"$f":"VLOOKUP(A522,'Product-tool'!A:B,2,0)","v":{"$error":"#N/A"}},{"$f":"Orders!B522/VLOOKUP(B522,Tools!A:C,3,0)","v":{"$error":"#N/A"}},{"$f":"Orders!C522/VLOOKUP(B522,Tools!A:C,3,0)","v":{"$error":"#N/A"}},{"$f":"Orders!D522/VLOOKUP(B522,Tools!A:C,3,0)","v":{"$error":"#N/A"}}]
[{"$f":"Orders!A523","v":0},{"$f":"VLOOKUP(A523,'Product-tool'!A:B,2,0)","v":{"$error":"#N/A"}},{"$f":"Orders!B523/VLOOKUP(B523,Tools!A:C,3,0)","v":{"$error":"#N/A"}},{"$f":"Orders!C523/VLOOKUP(B523,Tools!A:C,3,0)","v":{"$error":"#N/A"}},{"$f":"Orders!D523/VLOOKUP(B523,Tools!A:C,3,0)","v":{"$error":"#N/A"}}]
[{"$f":"Orders!A524","v":0},{"$f":"VLOOKUP(A524,'Product-tool'!A:B,2,0)","v":{"$error":"#N/A"}},{"$f":"Orders!B524/VLOOKUP(B524,Tools!A:C,3,0)","v":{"$error":"#N/A"}},{"$f":"Orders!C524/VLOOKUP(B524,Tools!A:C,3,0)","v":{"$error":"#N/A"}},{"$f":"Orders!D524/VLOOKUP(B524,Tools!A:C,3,0)","v":{"$error":"#N/A"}}]
[{"$f":"Orders!A525","v":0},{"$f":"VLOOKUP(A525,'Product-tool'!A:B,2,0)","v":{"$error":"#N/A"}},{"$f":"Orders!B525/VLOOKUP(B525,Tools!A:C,3,0)","v":{"$error":"#N/A"}},{"$f":"Orders!C525/VLOOKUP(B525,Tools!A:C,3,0)","v":{"$error":"#N/A"}},{"$f":"Orders!D525/VLOOKUP(B525,Tools!A:C,3,0)","v":{"$error":"#N/A"}}]
[{"$f":"Orders!A526","v":0},{"$f":"VLOOKUP(A526,'Product-tool'!A:B,2,0)","v":{"$error":"#N/A"}},{"$f":"Orders!B526/VLOOKUP(B526,Tools!A:C,3,0)","v":{"$error":"#N/A"}},{"$f":"Orders!C526/VLOOKUP(B526,Tools!A:C,3,0)","v":{"$error":"#N/A"}},{"$f":"Orders!D526/VLOOKUP(B526,Tools!A:C,3,0)","v":{"$error":"#N/A"}}]
[{"$f":"Orders!A527","v":0},{"$f":"VLOOKUP(A527,'Product-tool'!A:B,2,0)","v":{"$error":"#N/A"}},{"$f":"Orders!B527/VLOOKUP(B527,Tools!A:C,3,0)","v":{"$error":"#N/A"}},{"$f":"Orders!C527/VLOOKUP(B527,Tools!A:C,3,0)","v":{"$error":"#N/A"}},{"$f":"Orders!D527/VLOOKUP(B527,Tools!A:C,3,0)","v":{"$error":"#N/A"}}]
[{"$f":"Orders!A528","v":0},{"$f":"VLOOKUP(A528,'Product-tool'!A:B,2,0)","v":{"$error":"#N/A"}},{"$f":"Orders!B528/VLOOKUP(B528,Tools!A:C,3,0)","v":{"$error":"#N/A"}},{"$f":"Orders!C528/VLOOKUP(B528,Tools!A:C,3,0)","v":{"$error":"#N/A"}},{"$f":"Orders!D528/VLOOKUP(B528,Tools!A:C,3,0)","v":{"$error":"#N/A"}}]
[{"$f":"Orders!A529","v":0},{"$f":"VLOOKUP(A529,'Product-tool'!A:B,2,0)","v":{"$error":"#N/A"}},{"$f":"Orders!B529/VLOOKUP(B529,Tools!A:C,3,0)","v":{"$error":"#N/A"}},{"$f":"Orders!C529/VLOOKUP(B529,Tools!A:C,3,0)","v":{"$error":"#N/A"}},{"$f":"Orders!D529/VLOOKUP(B529,Tools!A:C,3,0)","v":{"$error":"#N/A"}}]
[{"$f":"Orders!A530","v":0},{"$f":"VLOOKUP(A530,'Product-tool'!A:B,2,0)","v":{"$error":"#N/A"}},{"$f":"Orders!B530/VLOOKUP(B530,Tools!A:C,3,0)","v":{"$error":"#N/A"}},{"$f":"Orders!C530/VLOOKUP(B530,Tools!A:C,3,0)","v":{"$error":"#N/A"}},{"$f":"Orders!D530/VLOOKUP(B530,Tools!A:C,3,0)","v":{"$error":"#N/A"}}]
[{"$f":"Orders!A531","v":0},{"$f":"VLOOKUP(A531,'Product-tool'!A:B,2,0)","v":{"$error":"#N/A"}},{"$f":"Orders!B531/VLOOKUP(B531,Tools!A:C,3,0)","v":{"$error":"#N/A"}},{"$f":"Orders!C531/VLOOKUP(B531,Tools!A:C,3,0)","v":{"$error":"#N/A"}},{"$f":"Orders!D531/VLOOKUP(B531,Tools!A:C,3,0)","v":{"$error":"#N/A"}}]
[{"$f":"Orders!A532","v":0},{"$f":"VLOOKUP(A532,'Product-tool'!A:B,2,0)","v":{"$error":"#N/A"}},{"$f":"Orders!B532/VLOOKUP(B532,Tools!A:C,3,0)","v":{"$error":"#N/A"}},{"$f":"Orders!C532/VLOOKUP(B532,Tools!A:C,3,0)","v":{"$error":"#N/A"}},{"$f":"Orders!D532/VLOOKUP(B532,Tools!A:C,3,0)","v":{"$error":"#N/A"}}]
[{"$f":"Orders!A533","v":0},{"$f":"VLOOKUP(A533,'Product-tool'!A:B,2,0)","v":{"$error":"#N/A"}},{"$f":"Orders!B533/VLOOKUP(B533,Tools!A:C,3,0)","v":{"$error":"#N/A"}},{"$f":"Orders!C533/VLOOKUP(B533,Tools!A:C,3,0)","v":{"$error":"#N/A"}},{"$f":"Orders!D533/VLOOKUP(B533,Tools!A:C,3,0)","v":{"$error":"#N/A"}}]
[{"$f":"Orders!A534","v":0},{"$f":"VLOOKUP(A534,'Product-tool'!A:B,2,0)","v":{"$error":"#N/A"}},{"$f":"Orders!B534/VLOOKUP(B534,Tools!A:C,3,0)","v":{"$error":"#N/A"}},{"$f":"Orders!C534/VLOOKUP(B534,Tools!A:C,3,0)","v":{"$error":"#N/A"}},{"$f":"Orders!D534/VLOOKUP(B534,Tools!A:C,3,0)","v":{"$error":"#N/A"}}]
[{"$f":"Orders!A535","v":0},{"$f":"VLOOKUP(A535,'Product-tool'!A:B,2,0)","v":{"$error":"#N/A"}},{"$f":"Orders!B535/VLOOKUP(B535,Tools!A:C,3,0)","v":{"$error":"#N/A"}},{"$f":"Orders!C535/VLOOKUP(B535,Tools!A:C,3,0)","v":{"$error":"#N/A"}},{"$f":"Orders!D535/VLOOKUP(B535,Tools!A:C,3,0)","v":{"$error":"#N/A"}}]
[{"$f":"Orders!A536","v":0},{"$f":"VLOOKUP(A536,'Product-tool'!A:B,2,0)","v":{"$error":"#N/A"}},{"$f":"Orders!B536/VLOOKUP(B536,Tools!A:C,3,0)","v":{"$error":"#N/A"}},{"$f":"Orders!C536/VLOOKUP(B536,Tools!A:C,3,0)","v":{"$error":"#N/A"}},{"$f":"Orders!D536/VLOOKUP(B536,Tools!A:C,3,0)","v":{"$error":"#N/A"}}]
[{"$f":"Orders!A537","v":0},{"$f":"VLOOKUP(A537,'Product-tool'!A:B,2,0)","v":{"$error":"#N/A"}},{"$f":"Orders!B537/VLOOKUP(B537,Tools!A:C,3,0)","v":{"$error":"#N/A"}},{"$f":"Orders!C537/VLOOKUP(B537,Tools!A:C,3,0)","v":{"$error":"#N/A"}},{"$f":"Orders!D537/VLOOKUP(B537,Tools!A:C,3,0)","v":{"$error":"#N/A"}}]
[{"$f":"Orders!A538","v":0},{"$f":"VLOOKUP(A538,'Product-tool'!A:B,2,0)","v":{"$error":"#N/A"}},{"$f":"Orders!B538/VLOOKUP(B538,Tools!A:C,3,0)","v":{"$error":"#N/A"}},{"$f":"Orders!C538/VLOOKUP(B538,Tools!A:C,3,0)","v":{"$error":"#N/A"}},{"$f":"Orders!D538/VLOOKUP(B538,Tools!A:C,3,0)","v":{"$error":"#N/A"}}]
[{"$f":"Orders!A539","v":0},{"$f":"VLOOKUP(A539,'Product-tool'!A:B,2,0)","v":{"$error":"#N/A"}},{"$f":"Orders!B539/VLOOKUP(B539,Tools!A:C,3,0)","v":{"$error":"#N/A"}},{"$f":"Orders!C539/VLOOKUP(B539,Tools!A:C,3,0)","v":{"$error":"#N/A"}},{"$f":"Orders!D539/VLOOKUP(B539,Tools!A:C,3,0)","v":{"$error":"#N/A"}}]
[{"$f":"Orders!A540","v":0},{"$f":"VLOOKUP(A540,'Product-tool'!A:B,2,0)","v":{"$error":"#N/A"}},{"$f":"Orders!B540/VLOOKUP(B540,Tools!A:C,3,0)","v":{"$error":"#N/A"}},{"$f":"Orders!C540/VLOOKUP(B540,Tools!A:C,3,0)","v":{"$error":"#N/A"}},{"$f":"Orders!D540/VLOOKUP(B540,Tools!A:C,3,0)","v":{"$error":"#N/A"}}]
[{"$f":"Orders!A541","v":0},{"$f":"VLOOKUP(A541,'Product-tool'!A:B,2,0)","v":{"$error":"#N/A"}},{"$f":"Orders!B541/VLOOKUP(B541,Tools!A:C,3,0)","v":{"$error":"#N/A"}},{"$f":"Orders!C541/VLOOKUP(B541,Tools!A:C,3,0)","v":{"$error":"#N/A"}},{"$f":"Orders!D541/VLOOKUP(B541,Tools!A:C,3,0)","v":{"$error":"#N/A"}}]
[{"$f":"Orders!A542","v":0},{"$f":"VLOOKUP(A542,'Product-tool'!A:B,2,0)","v":{"$error":"#N/A"}},{"$f":"Orders!B542/VLOOKUP(B542,Tools!A:C,3,0)","v":{"$error":"#N/A"}},{"$f":"Orders!C542/VLOOKUP(B542,Tools!A:C,3,0)","v":{"$error":"#N/A"}},{"$f":"Orders!D542/VLOOKUP(B542,Tools!A:C,3,0)","v":{"$error":"#N/A"}}]
[{"$f":"Orders!A543","v":0},{"$f":"VLOOKUP(A543,'Product-tool'!A:B,2,0)","v":{"$error":"#N/A"}},{"$f":"Orders!B543/VLOOKUP(B543,Tools!A:C,3,0)","v":{"$error":"#N/A"}},{"$f":"Orders!C543/VLOOKUP(B543,Tools!A:C,3,0)","v":{"$error":"#N/A"}},{"$f":"Orders!D543/VLOOKUP(B543,Tools!A:C,3,0)","v":{"$error":"#N/A"}}]
[{"$f":"Orders!A544","v":0},{"$f":"VLOOKUP(A544,'Product-tool'!A:B,2,0)","v":{"$error":"#N/A"}},{"$f":"Orders!B544/VLOOKUP(B544,Tools!A:C,3,0)","v":{"$error":"#N/A"}},{"$f":"Orders!C544/VLOOKUP(B544,Tools!A:C,3,0)","v":{"$error":"#N/A"}},{"$f":"Orders!D544/VLOOKUP(B544,Tools!A:C,3,0)","v":{"$error":"#N/A"}}]
[{"$f":"Orders!A545","v":0},{"$f":"VLOOKUP(A545,'Product-tool'!A:B,2,0)","v":{"$error":"#N/A"}},{"$f":"Orders!B545/VLOOKUP(B545,Tools!A:C,3,0)","v":{"$error":"#N/A"}},{"$f":"Orders!C545/VLOOKUP(B545,Tools!A:C,3,0)","v":{"$error":"#N/A"}},{"$f":"Orders!D545/VLOOKUP(B545,Tools!A:C,3,0)","v":{"$error":"#N/A"}}]
[{"$f":"Orders!A546","v":0},{"$f":"VLOOKUP(A546,'Product-tool'!A:B,2,0)","v":{"$error":"#N/A"}},{"$f":"Orders!B546/VLOOKUP(B546,Tools!A:C,3,0)","v":{"$error":"#N/A"}},{"$f":"Orders!C546/VLOOKUP(B546,Tools!A:C,3,0)","v":{"$error":"#N/A"}},{"$f":"Orders!D546/VLOOKUP(B546,Tools!A:C,3,0)","v":{"$error":"#N/A"}}]
[{"$f":"Orders!A547","v":0},{"$f":"VLOOKUP(A547,'Product-tool'!A:B,2,0)","v":{"$error":"#N/A"}},{"$f":"Orders!B547/VLOOKUP(B547,Tools!A:C,3,0)","v":{"$error":"#N/A"}},{"$f":"Orders!C547/VLOOKUP(B547,Tools!A:C,3,0)","v":{"$error":"#N/A"}},{"$f":"Orders!D547/VLOOKUP(B547,Tools!A:C,3,0)","v":{"$error":"#N/A"}}]
[{"$f":"Orders!A548","v":0},{"$f":"VLOOKUP(A548,'Product-tool'!A:B,2,0)","v":{"$error":"#N/A"}},{"$f":"Orders!B548/VLOOKUP(B548,Tools!A:C,3,0)","v":{"$error":"#N/A"}},{"$f":"Orders!C548/VLOOKUP(B548,Tools!A:C,3,0)","v":{"$error":"#N/A"}},{"$f":"Orders!D548/VLOOKUP(B548,Tools!A:C,3,0)","v":{"$error":"#N/A"}}]
[{"$f":"Orders!A549","v":0},{"$f":"VLOOKUP(A549,'Product-tool'!A:B,2,0)","v":{"$error":"#N/A"}},{"$f":"Orders!B549/VLOOKUP(B549,Tools!A:C,3,0)","v":{"$error":"#N/A"}},{"$f":"Orders!C549/VLOOKUP(B549,Tools!A:C,3,0)","v":{"$error":"#N/A"}},{"$f":"Orders!D549/VLOOKUP(B549,Tools!A:C,3,0)","v":{"$error":"#N/A"}}]
[{"$f":"Orders!A550","v":0},{"$f":"VLOOKUP(A550,'Product-tool'!A:B,2,0)","v":{"$error":"#N/A"}},{"$f":"Orders!B550/VLOOKUP(B550,Tools!A:C,3,0)","v":{"$error":"#N/A"}},{"$f":"Orders!C550/VLOOKUP(B550,Tools!A:C,3,0)","v":{"$error":"#N/A"}},{"$f":"Orders!D550/VLOOKUP(B550,Tools!A:C,3,0)","v":{"$error":"#N/A"}}]
[{"$f":"Orders!A551","v":0},{"$f":"VLOOKUP(A551,'Product-tool'!A:B,2,0)","v":{"$error":"#N/A"}},{"$f":"Orders!B551/VLOOKUP(B551,Tools!A:C,3,0)","v":{"$error":"#N/A"}},{"$f":"Orders!C551/VLOOKUP(B551,Tools!A:C,3,0)","v":{"$error":"#N/A"}},{"$f":"Orders!D551/VLOOKUP(B551,Tools!A:C,3,0)","v":{"$error":"#N/A"}}]
[{"$f":"Orders!A552","v":0},{"$f":"VLOOKUP(A552,'Product-tool'!A:B,2,0)","v":{"$error":"#N/A"}},{"$f":"Orders!B552/VLOOKUP(B552,Tools!A:C,3,0)","v":{"$error":"#N/A"}},{"$f":"Orders!C552/VLOOKUP(B552,Tools!A:C,3,0)","v":{"$error":"#N/A"}},{"$f":"Orders!D552/VLOOKUP(B552,Tools!A:C,3,0)","v":{"$error":"#N/A"}}]
[{"$f":"Orders!A553","v":0},{"$f":"VLOOKUP(A553,'Product-tool'!A:B,2,0)","v":{"$error":"#N/A"}},{"$f":"Orders!B553/VLOOKUP(B553,Tools!A:C,3,0)","v":{"$error":"#N/A"}},{"$f":"Orders!C553/VLOOKUP(B553,Tools!A:C,3,0)","v":{"$error":"#N/A"}},{"$f":"Orders!D553/VLOOKUP(B553,Tools!A:C,3,0)","v":{"$error":"#N/A"}}]
[{"$f":"Orders!A554","v":0},{"$f":"VLOOKUP(A554,'Product-tool'!A:B,2,0)","v":{"$error":"#N/A"}},{"$f":"Orders!B554/VLOOKUP(B554,Tools!A:C,3,0)","v":{"$error":"#N/A"}},{"$f":"Orders!C554/VLOOKUP(B554,Tools!A:C,3,0)","v":{"$error":"#N/A"}},{"$f":"Orders!D554/VLOOKUP(B554,Tools!A:C,3,0)","v":{"$error":"#N/A"}}]
[{"$f":"Orders!A555","v":0},{"$f":"VLOOKUP(A555,'Product-tool'!A:B,2,0)","v":{"$error":"#N/A"}},{"$f":"Orders!B555/VLOOKUP(B555,Tools!A:C,3,0)","v":{"$error":"#N/A"}},{"$f":"Orders!C555/VLOOKUP(B555,Tools!A:C,3,0)","v":{"$error":"#N/A"}},{"$f":"Orders!D555/VLOOKUP(B555,Tools!A:C,3,0)","v":{"$error":"#N/A"}}]
[{"$f":"Orders!A556","v":0},{"$f":"VLOOKUP(A556,'Product-tool'!A:B,2,0)","v":{"$error":"#N/A"}},{"$f":"Orders!B556/VLOOKUP(B556,Tools!A:C,3,0)","v":{"$error":"#N/A"}},{"$f":"Orders!C556/VLOOKUP(B556,Tools!A:C,3,0)","v":{"$error":"#N/A"}},{"$f":"Orders!D556/VLOOKUP(B556,Tools!A:C,3,0)","v":{"$error":"#N/A"}}]
[{"$f":"Orders!A557","v":0},{"$f":"VLOOKUP(A557,'Product-tool'!A:B,2,0)","v":{"$error":"#N/A"}},{"$f":"Orders!B557/VLOOKUP(B557,Tools!A:C,3,0)","v":{"$error":"#N/A"}},{"$f":"Orders!C557/VLOOKUP(B557,Tools!A:C,3,0)","v":{"$error":"#N/A"}},{"$f":"Orders!D557/VLOOKUP(B557,Tools!A:C,3,0)","v":{"$error":"#N/A"}}]
[{"$f":"Orders!A558","v":0},{"$f":"VLOOKUP(A558,'Product-tool'!A:B,2,0)","v":{"$error":"#N/A"}},{"$f":"Orders!B558/VLOOKUP(B558,Tools!A:C,3,0)","v":{"$error":"#N/A"}},{"$f":"Orders!C558/VLOOKUP(B558,Tools!A:C,3,0)","v":{"$error":"#N/A"}},{"$f":"Orders!D558/VLOOKUP(B558,Tools!A:C,3,0)","v":{"$error":"#N/A"}}]
[{"$f":"Orders!A559","v":0},{"$f":"VLOOKUP(A559,'Product-tool'!A:B,2,0)","v":{"$error":"#N/A"}},{"$f":"Orders!B559/VLOOKUP(B559,Tools!A:C,3,0)","v":{"$error":"#N/A"}},{"$f":"Orders!C559/VLOOKUP(B559,Tools!A:C,3,0)","v":{"$error":"#N/A"}},{"$f":"Orders!D559/VLOOKUP(B559,Tools!A:C,3,0)","v":{"$error":"#N/A"}}]
[{"$f":"Orders!A560","v":0},{"$f":"VLOOKUP(A560,'Product-tool'!A:B,2,0)","v":{"$error":"#N/A"}},{"$f":"Orders!B560/VLOOKUP(B560,Tools!A:C,3,0)","v":{"$error":"#N/A"}},{"$f":"Orders!C560/VLOOKUP(B560,Tools!A:C,3,0)","v":{"$error":"#N/A"}},{"$f":"Orders!D560/VLOOKUP(B560,Tools!A:C,3,0)","v":{"$error":"#N/A"}}]
[{"$f":"Orders!A561","v":0},{"$f":"VLOOKUP(A561,'Product-tool'!A:B,2,0)","v":{"$error":"#N/A"}},{"$f":"Orders!B561/VLOOKUP(B561,Tools!A:C,3,0)","v":{"$error":"#N/A"}},{"$f":"Orders!C561/VLOOKUP(B561,Tools!A:C,3,0)","v":{"$error":"#N/A"}},{"$f":"Orders!D561/VLOOKUP(B561,Tools!A:C,3,0)","v":{"$error":"#N/A"}}]
[{"$f":"Orders!A562","v":0},{"$f":"VLOOKUP(A562,'Product-tool'!A:B,2,0)","v":{"$error":"#N/A"}},{"$f":"Orders!B562/VLOOKUP(B562,Tools!A:C,3,0)","v":{"$error":"#N/A"}},{"$f":"Orders!C562/VLOOKUP(B562,Tools!A:C,3,0)","v":{"$error":"#N/A"}},{"$f":"Orders!D562/VLOOKUP(B562,Tools!A:C,3,0)","v":{"$error":"#N/A"}}]
[{"$f":"Orders!A563","v":0},{"$f":"VLOOKUP(A563,'Product-tool'!A:B,2,0)","v":{"$error":"#N/A"}},{"$f":"Orders!B563/VLOOKUP(B563,Tools!A:C,3,0)","v":{"$error":"#N/A"}},{"$f":"Orders!C563/VLOOKUP(B563,Tools!A:C,3,0)","v":{"$error":"#N/A"}},{"$f":"Orders!D563/VLOOKUP(B563,Tools!A:C,3,0)","v":{"$error":"#N/A"}}]
[{"$f":"Orders!A564","v":0},{"$f":"VLOOKUP(A564,'Product-tool'!A:B,2,0)","v":{"$error":"#N/A"}},{"$f":"Orders!B564/VLOOKUP(B564,Tools!A:C,3,0)","v":{"$error":"#N/A"}},{"$f":"Orders!C564/VLOOKUP(B564,Tools!A:C,3,0)","v":{"$error":"#N/A"}},{"$f":"Orders!D564/VLOOKUP(B564,Tools!A:C,3,0)","v":{"$error":"#N/A"}}]
[{"$f":"Orders!A565","v":0},{"$f":"VLOOKUP(A565,'Product-tool'!A:B,2,0)","v":{"$error":"#N/A"}},{"$f":"Orders!B565/VLOOKUP(B565,Tools!A:C,3,0)","v":{"$error":"#N/A"}},{"$f":"Orders!C565/VLOOKUP(B565,Tools!A:C,3,0)","v":{"$error":"#N/A"}},{"$f":"Orders!D565/VLOOKUP(B565,Tools!A:C,3,0)","v":{"$error":"#N/A"}}]
[{"$f":"Orders!A566","v":0},{"$f":"VLOOKUP(A566,'Product-tool'!A:B,2,0)","v":{"$error":"#N/A"}},{"$f":"Orders!B566/VLOOKUP(B566,Tools!A:C,3,0)","v":{"$error":"#N/A"}},{"$f":"Orders!C566/VLOOKUP(B566,Tools!A:C,3,0)","v":{"$error":"#N/A"}},{"$f":"Orders!D566/VLOOKUP(B566,Tools!A:C,3,0)","v":{"$error":"#N/A"}}]
[{"$f":"Orders!A567","v":0},{"$f":"VLOOKUP(A567,'Product-tool'!A:B,2,0)","v":{"$error":"#N/A"}},{"$f":"Orders!B567/VLOOKUP(B567,Tools!A:C,3,0)","v":{"$error":"#N/A"}},{"$f":"Orders!C567/VLOOKUP(B567,Tools!A:C,3,0)","v":{"$error":"#N/A"}},{"$f":"Orders!D567/VLOOKUP(B567,Tools!A:C,3,0)","v":{"$error":"#N/A"}}]
[{"$f":"Orders!A568","v":0},{"$f":"VLOOKUP(A568,'Product-tool'!A:B,2,0)","v":{"$error":"#N/A"}},{"$f":"Orders!B568/VLOOKUP(B568,Tools!A:C,3,0)","v":{"$error":"#N/A"}},{"$f":"Orders!C568/VLOOKUP(B568,Tools!A:C,3,0)","v":{"$error":"#N/A"}},{"$f":"Orders!D568/VLOOKUP(B568,Tools!A:C,3,0)","v":{"$error":"#N/A"}}]
[{"$f":"Orders!A569","v":0},{"$f":"VLOOKUP(A569,'Product-tool'!A:B,2,0)","v":{"$error":"#N/A"}},{"$f":"Orders!B569/VLOOKUP(B569,Tools!A:C,3,0)","v":{"$error":"#N/A"}},{"$f":"Orders!C569/VLOOKUP(B569,Tools!A:C,3,0)","v":{"$error":"#N/A"}},{"$f":"Orders!D569/VLOOKUP(B569,Tools!A:C,3,0)","v":{"$error":"#N/A"}}]
[{"$f":"Orders!A570","v":0},{"$f":"VLOOKUP(A570,'Product-tool'!A:B,2,0)","v":{"$error":"#N/A"}},{"$f":"Orders!B570/VLOOKUP(B570,Tools!A:C,3,0)","v":{"$error":"#N/A"}},{"$f":"Orders!C570/VLOOKUP(B570,Tools!A:C,3,0)","v":{"$error":"#N/A"}},{"$f":"Orders!D570/VLOOKUP(B570,Tools!A:C,3,0)","v":{"$error":"#N/A"}}]
[{"$f":"Orders!A571","v":0},{"$f":"VLOOKUP(A571,'Product-tool'!A:B,2,0)","v":{"$error":"#N/A"}},{"$f":"Orders!B571/VLOOKUP(B571,Tools!A:C,3,0)","v":{"$error":"#N/A"}},{"$f":"Orders!C571/VLOOKUP(B571,Tools!A:C,3,0)","v":{"$error":"#N/A"}},{"$f":"Orders!D571/VLOOKUP(B571,Tools!A:C,3,0)","v":{"$error":"#N/A"}}]
[{"$f":"Orders!A572","v":0},{"$f":"VLOOKUP(A572,'Product-tool'!A:B,2,0)","v":{"$error":"#N/A"}},{"$f":"Orders!B572/VLOOKUP(B572,Tools!A:C,3,0)","v":{"$error":"#N/A"}},{"$f":"Orders!C572/VLOOKUP(B572,Tools!A:C,3,0)","v":{"$error":"#N/A"}},{"$f":"Orders!D572/VLOOKUP(B572,Tools!A:C,3,0)","v":{"$error":"#N/A"}}]
[{"$f":"Orders!A573","v":0},{"$f":"VLOOKUP(A573,'Product-tool'!A:B,2,0)","v":{"$error":"#N/A"}},{"$f":"Orders!B573/VLOOKUP(B573,Tools!A:C,3,0)","v":{"$error":"#N/A"}},{"$f":"Orders!C573/VLOOKUP(B573,Tools!A:C,3,0)","v":{"$error":"#N/A"}},{"$f":"Orders!D573/VLOOKUP(B573,Tools!A:C,3,0)","v":{"$error":"#N/A"}}]
[{"$f":"Orders!A574","v":0},{"$f":"VLOOKUP(A574,'Product-tool'!A:B,2,0)","v":{"$error":"#N/A"}},{"$f":"Orders!B574/VLOOKUP(B574,Tools!A:C,3,0)","v":{"$error":"#N/A"}},{"$f":"Orders!C574/VLOOKUP(B574,Tools!A:C,3,0)","v":{"$error":"#N/A"}},{"$f":"Orders!D574/VLOOKUP(B574,Tools!A:C,3,0)","v":{"$error":"#N/A"}}]
[{"$f":"Orders!A575","v":0},{"$f":"VLOOKUP(A575,'Product-tool'!A:B,2,0)","v":{"$error":"#N/A"}},{"$f":"Orders!B575/VLOOKUP(B575,Tools!A:C,3,0)","v":{"$error":"#N/A"}},{"$f":"Orders!C575/VLOOKUP(B575,Tools!A:C,3,0)","v":{"$error":"#N/A"}},{"$f":"Orders!D575/VLOOKUP(B575,Tools!A:C,3,0)","v":{"$error":"#N/A"}}]
[{"$f":"Orders!A576","v":0},{"$f":"VLOOKUP(A576,'Product-tool'!A:B,2,0)","v":{"$error":"#N/A"}},{"$f":"Orders!B576/VLOOKUP(B576,Tools!A:C,3,0)","v":{"$error":"#N/A"}},{"$f":"Orders!C576/VLOOKUP(B576,Tools!A:C,3,0)","v":{"$error":"#N/A"}},{"$f":"Orders!D576/VLOOKUP(B576,Tools!A:C,3,0)","v":{"$error":"#N/A"}}]
[{"$f":"Orders!A577","v":0},{"$f":"VLOOKUP(A577,'Product-tool'!A:B,2,0)","v":{"$error":"#N/A"}},{"$f":"Orders!B577/VLOOKUP(B577,Tools!A:C,3,0)","v":{"$error":"#N/A"}},{"$f":"Orders!C577/VLOOKUP(B577,Tools!A:C,3,0)","v":{"$error":"#N/A"}},{"$f":"Orders!D577/VLOOKUP(B577,Tools!A:C,3,0)","v":{"$error":"#N/A"}}]
[{"$f":"Orders!A578","v":0},{"$f":"VLOOKUP(A578,'Product-tool'!A:B,2,0)","v":{"$error":"#N/A"}},{"$f":"Orders!B578/VLOOKUP(B578,Tools!A:C,3,0)","v":{"$error":"#N/A"}},{"$f":"Orders!C578/VLOOKUP(B578,Tools!A:C,3,0)","v":{"$error":"#N/A"}},{"$f":"Orders!D578/VLOOKUP(B578,Tools!A:C,3,0)","v":{"$error":"#N/A"}}]
[{"$f":"Orders!A579","v":0},{"$f":"VLOOKUP(A579,'Product-tool'!A:B,2,0)","v":{"$error":"#N/A"}},{"$f":"Orders!B579/VLOOKUP(B579,Tools!A:C,3,0)","v":{"$error":"#N/A"}},{"$f":"Orders!C579/VLOOKUP(B579,Tools!A:C,3,0)","v":{"$error":"#N/A"}},{"$f":"Orders!D579/VLOOKUP(B579,Tools!A:C,3,0)","v":{"$error":"#N/A"}}]
[{"$f":"Orders!A580","v":0},{"$f":"VLOOKUP(A580,'Product-tool'!A:B,2,0)","v":{"$error":"#N/A"}},{"$f":"Orders!B580/VLOOKUP(B580,Tools!A:C,3,0)","v":{"$error":"#N/A"}},{"$f":"Orders!C580/VLOOKUP(B580,Tools!A:C,3,0)","v":{"$error":"#N/A"}},{"$f":"Orders!D580/VLOOKUP(B580,Tools!A:C,3,0)","v":{"$error":"#N/A"}}]
[{"$f":"Orders!A581","v":0},{"$f":"VLOOKUP(A581,'Product-tool'!A:B,2,0)","v":{"$error":"#N/A"}},{"$f":"Orders!B581/VLOOKUP(B581,Tools!A:C,3,0)","v":{"$error":"#N/A"}},{"$f":"Orders!C581/VLOOKUP(B581,Tools!A:C,3,0)","v":{"$error":"#N/A"}},{"$f":"Orders!D581/VLOOKUP(B581,Tools!A:C,3,0)","v":{"$error":"#N/A"}}]
[{"$f":"Orders!A582","v":0},{"$f":"VLOOKUP(A582,'Product-tool'!A:B,2,0)","v":{"$error":"#N/A"}},{"$f":"Orders!B582/VLOOKUP(B582,Tools!A:C,3,0)","v":{"$error":"#N/A"}},{"$f":"Orders!C582/VLOOKUP(B582,Tools!A:C,3,0)","v":{"$error":"#N/A"}},{"$f":"Orders!D582/VLOOKUP(B582,Tools!A:C,3,0)","v":{"$error":"#N/A"}}]
[{"$f":"Orders!A583","v":0},{"$f":"VLOOKUP(A583,'Product-tool'!A:B,2,0)","v":{"$error":"#N/A"}},{"$f":"Orders!B583/VLOOKUP(B583,Tools!A:C,3,0)","v":{"$error":"#N/A"}},{"$f":"Orders!C583/VLOOKUP(B583,Tools!A:C,3,0)","v":{"$error":"#N/A"}},{"$f":"Orders!D583/VLOOKUP(B583,Tools!A:C,3,0)","v":{"$error":"#N/A"}}]
[{"$f":"Orders!A584","v":0},{"$f":"VLOOKUP(A584,'Product-tool'!A:B,2,0)","v":{"$error":"#N/A"}},{"$f":"Orders!B584/VLOOKUP(B584,Tools!A:C,3,0)","v":{"$error":"#N/A"}},{"$f":"Orders!C584/VLOOKUP(B584,Tools!A:C,3,0)","v":{"$error":"#N/A"}},{"$f":"Orders!D584/VLOOKUP(B584,Tools!A:C,3,0)","v":{"$error":"#N/A"}}]
[{"$f":"Orders!A585","v":0},{"$f":"VLOOKUP(A585,'Product-tool'!A:B,2,0)","v":{"$error":"#N/A"}},{"$f":"Orders!B585/VLOOKUP(B585,Tools!A:C,3,0)","v":{"$error":"#N/A"}},{"$f":"Orders!C585/VLOOKUP(B585,Tools!A:C,3,0)","v":{"$error":"#N/A"}},{"$f":"Orders!D585/VLOOKUP(B585,Tools!A:C,3,0)","v":{"$error":"#N/A"}}]
[{"$f":"Orders!A586","v":0},{"$f":"VLOOKUP(A586,'Product-tool'!A:B,2,0)","v":{"$error":"#N/A"}},{"$f":"Orders!B586/VLOOKUP(B586,Tools!A:C,3,0)","v":{"$error":"#N/A"}},{"$f":"Orders!C586/VLOOKUP(B586,Tools!A:C,3,0)","v":{"$error":"#N/A"}},{"$f":"Orders!D586/VLOOKUP(B586,Tools!A:C,3,0)","v":{"$error":"#N/A"}}]
[{"$f":"Orders!A587","v":0},{"$f":"VLOOKUP(A587,'Product-tool'!A:B,2,0)","v":{"$error":"#N/A"}},{"$f":"Orders!B587/VLOOKUP(B587,Tools!A:C,3,0)","v":{"$error":"#N/A"}},{"$f":"Orders!C587/VLOOKUP(B587,Tools!A:C,3,0)","v":{"$error":"#N/A"}},{"$f":"Orders!D587/VLOOKUP(B587,Tools!A:C,3,0)","v":{"$error":"#N/A"}}]
[{"$f":"Orders!A588","v":0},{"$f":"VLOOKUP(A588,'Product-tool'!A:B,2,0)","v":{"$error":"#N/A"}},{"$f":"Orders!B588/VLOOKUP(B588,Tools!A:C,3,0)","v":{"$error":"#N/A"}},{"$f":"Orders!C588/VLOOKUP(B588,Tools!A:C,3,0)","v":{"$error":"#N/A"}},{"$f":"Orders!D588/VLOOKUP(B588,Tools!A:C,3,0)","v":{"$error":"#N/A"}}]
[{"$f":"Orders!A589","v":0},{"$f":"VLOOKUP(A589,'Product-tool'!A:B,2,0)","v":{"$error":"#N/A"}},{"$f":"Orders!B589/VLOOKUP(B589,Tools!A:C,3,0)","v":{"$error":"#N/A"}},{"$f":"Orders!C589/VLOOKUP(B589,Tools!A:C,3,0)","v":{"$error":"#N/A"}},{"$f":"Orders!D589/VLOOKUP(B589,Tools!A:C,3,0)","v":{"$error":"#N/A"}}]
[{"$f":"Orders!A590","v":0},{"$f":"VLOOKUP(A590,'Product-tool'!A:B,2,0)","v":{"$error":"#N/A"}},{"$f":"Orders!B590/VLOOKUP(B590,Tools!A:C,3,0)","v":{"$error":"#N/A"}},{"$f":"Orders!C590/VLOOKUP(B590,Tools!A:C,3,0)","v":{"$error":"#N/A"}},{"$f":"Orders!D590/VLOOKUP(B590,Tools!A:C,3,0)","v":{"$error":"#N/A"}}]
[{"$f":"Orders!A591","v":0},{"$f":"VLOOKUP(A591,'Product-tool'!A:B,2,0)","v":{"$error":"#N/A"}},{"$f":"Orders!B591/VLOOKUP(B591,Tools!A:C,3,0)","v":{"$error":"#N/A"}},{"$f":"Orders!C591/VLOOKUP(B591,Tools!A:C,3,0)","v":{"$error":"#N/A"}},{"$f":"Orders!D591/VLOOKUP(B591,Tools!A:C,3,0)","v":{"$error":"#N/A"}}]
[{"$f":"Orders!A592","v":0},{"$f":"VLOOKUP(A592,'Product-tool'!A:B,2,0)","v":{"$error":"#N/A"}},{"$f":"Orders!B592/VLOOKUP(B592,Tools!A:C,3,0)","v":{"$error":"#N/A"}},{"$f":"Orders!C592/VLOOKUP(B592,Tools!A:C,3,0)","v":{"$error":"#N/A"}},{"$f":"Orders!D592/VLOOKUP(B592,Tools!A:C,3,0)","v":{"$error":"#N/A"}}]
[{"$f":"Orders!A593","v":0},{"$f":"VLOOKUP(A593,'Product-tool'!A:B,2,0)","v":{"$error":"#N/A"}},{"$f":"Orders!B593/VLOOKUP(B593,Tools!A:C,3,0)","v":{"$error":"#N/A"}},{"$f":"Orders!C593/VLOOKUP(B593,Tools!A:C,3,0)","v":{"$error":"#N/A"}},{"$f":"Orders!D593/VLOOKUP(B593,Tools!A:C,3,0)","v":{"$error":"#N/A"}}]
[{"$f":"Orders!A594","v":0},{"$f":"VLOOKUP(A594,'Product-tool'!A:B,2,0)","v":{"$error":"#N/A"}},{"$f":"Orders!B594/VLOOKUP(B594,Tools!A:C,3,0)","v":{"$error":"#N/A"}},{"$f":"Orders!C594/VLOOKUP(B594,Tools!A:C,3,0)","v":{"$error":"#N/A"}},{"$f":"Orders!D594/VLOOKUP(B594,Tools!A:C,3,0)","v":{"$error":"#N/A"}}]
[{"$f":"Orders!A595","v":0},{"$f":"VLOOKUP(A595,'Product-tool'!A:B,2,0)","v":{"$error":"#N/A"}},{"$f":"Orders!B595/VLOOKUP(B595,Tools!A:C,3,0)","v":{"$error":"#N/A"}},{"$f":"Orders!C595/VLOOKUP(B595,Tools!A:C,3,0)","v":{"$error":"#N/A"}},{"$f":"Orders!D595/VLOOKUP(B595,Tools!A:C,3,0)","v":{"$error":"#N/A"}}]
[{"$f":"Orders!A596","v":0},{"$f":"VLOOKUP(A596,'Product-tool'!A:B,2,0)","v":{"$error":"#N/A"}},{"$f":"Orders!B596/VLOOKUP(B596,Tools!A:C,3,0)","v":{"$error":"#N/A"}},{"$f":"Orders!C596/VLOOKUP(B596,Tools!A:C,3,0)","v":{"$error":"#N/A"}},{"$f":"Orders!D596/VLOOKUP(B596,Tools!A:C,3,0)","v":{"$error":"#N/A"}}]
[{"$f":"Orders!A597","v":0},{"$f":"VLOOKUP(A597,'Product-tool'!A:B,2,0)","v":{"$error":"#N/A"}},{"$f":"Orders!B597/VLOOKUP(B597,Tools!A:C,3,0)","v":{"$error":"#N/A"}},{"$f":"Orders!C597/VLOOKUP(B597,Tools!A:C,3,0)","v":{"$error":"#N/A"}},{"$f":"Orders!D597/VLOOKUP(B597,Tools!A:C,3,0)","v":{"$error":"#N/A"}}]
[{"$f":"Orders!A598","v":0},{"$f":"VLOOKUP(A598,'Product-tool'!A:B,2,0)","v":{"$error":"#N/A"}},{"$f":"Orders!B598/VLOOKUP(B598,Tools!A:C,3,0)","v":{"$error":"#N/A"}},{"$f":"Orders!C598/VLOOKUP(B598,Tools!A:C,3,0)","v":{"$error":"#N/A"}},{"$f":"Orders!D598/VLOOKUP(B598,Tools!A:C,3,0)","v":{"$error":"#N/A"}}]
[{"$f":"Orders!A599","v":0},{"$f":"VLOOKUP(A599,'Product-tool'!A:B,2,0)","v":{"$error":"#N/A"}},{"$f":"Orders!B599/VLOOKUP(B599,Tools!A:C,3,0)","v":{"$error":"#N/A"}},{"$f":"Orders!C599/VLOOKUP(B599,Tools!A:C,3,0)","v":{"$error":"#N/A"}},{"$f":"Orders!D599/VLOOKUP(B599,Tools!A:C,3,0)","v":{"$error":"#N/A"}}]
[{"$f":"Orders!A600","v":0},{"$f":"VLOOKUP(A600,'Product-tool'!A:B,2,0)","v":{"$error":"#N/A"}},{"$f":"Orders!B600/VLOOKUP(B600,Tools!A:C,3,0)","v":{"$error":"#N/A"}},{"$f":"Orders!C600/VLOOKUP(B600,Tools!A:C,3,0)","v":{"$error":"#N/A"}},{"$f":"Orders!D600/VLOOKUP(B600,Tools!A:C,3,0)","v":{"$error":"#N/A"}}]
[{"$f":"Orders!A601","v":0},{"$f":"VLOOKUP(A601,'Product-tool'!A:B,2,0)","v":{"$error":"#N/A"}},{"$f":"Orders!B601/VLOOKUP(B601,Tools!A:C,3,0)","v":{"$error":"#N/A"}},{"$f":"Orders!C601/VLOOKUP(B601,Tools!A:C,3,0)","v":{"$error":"#N/A"}},{"$f":"Orders!D601/VLOOKUP(B601,Tools!A:C,3,0)","v":{"$error":"#N/A"}}]
[{"$f":"Orders!A602","v":0},{"$f":"VLOOKUP(A602,'Product-tool'!A:B,2,0)","v":{"$error":"#N/A"}},{"$f":"Orders!B602/VLOOKUP(B602,Tools!A:C,3,0)","v":{"$error":"#N/A"}},{"$f":"Orders!C602/VLOOKUP(B602,Tools!A:C,3,0)","v":{"$error":"#N/A"}},{"$f":"Orders!D602/VLOOKUP(B602,Tools!A:C,3,0)","v":{"$error":"#N/A"}}]
[{"$f":"Orders!A603","v":0},{"$f":"VLOOKUP(A603,'Product-tool'!A:B,2,0)","v":{"$error":"#N/A"}},{"$f":"Orders!B603/VLOOKUP(B603,Tools!A:C,3,0)","v":{"$error":"#N/A"}},{"$f":"Orders!C603/VLOOKUP(B603,Tools!A:C,3,0)","v":{"$error":"#N/A"}},{"$f":"Orders!D603/VLOOKUP(B603,Tools!A:C,3,0)","v":{"$error":"#N/A"}}]
[{"$f":"Orders!A604","v":0},{"$f":"VLOOKUP(A604,'Product-tool'!A:B,2,0)","v":{"$error":"#N/A"}},{"$f":"Orders!B604/VLOOKUP(B604,Tools!A:C,3,0)","v":{"$error":"#N/A"}},{"$f":"Orders!C604/VLOOKUP(B604,Tools!A:C,3,0)","v":{"$error":"#N/A"}},{"$f":"Orders!D604/VLOOKUP(B604,Tools!A:C,3,0)","v":{"$error":"#N/A"}}]
[{"$f":"Orders!A605","v":0},{"$f":"VLOOKUP(A605,'Product-tool'!A:B,2,0)","v":{"$error":"#N/A"}},{"$f":"Orders!B605/VLOOKUP(B605,Tools!A:C,3,0)","v":{"$error":"#N/A"}},{"$f":"Orders!C605/VLOOKUP(B605,Tools!A:C,3,0)","v":{"$error":"#N/A"}},{"$f":"Orders!D605/VLOOKUP(B605,Tools!A:C,3,0)","v":{"$error":"#N/A"}}]
[{"$f":"Orders!A606","v":0},{"$f":"VLOOKUP(A606,'Product-tool'!A:B,2,0)","v":{"$error":"#N/A"}},{"$f":"Orders!B606/VLOOKUP(B606,Tools!A:C,3,0)","v":{"$error":"#N/A"}},{"$f":"Orders!C606/VLOOKUP(B606,Tools!A:C,3,0)","v":{"$error":"#N/A"}},{"$f":"Orders!D606/VLOOKUP(B606,Tools!A:C,3,0)","v":{"$error":"#N/A"}}]
[{"$f":"Orders!A607","v":0},{"$f":"VLOOKUP(A607,'Product-tool'!A:B,2,0)","v":{"$error":"#N/A"}},{"$f":"Orders!B607/VLOOKUP(B607,Tools!A:C,3,0)","v":{"$error":"#N/A"}},{"$f":"Orders!C607/VLOOKUP(B607,Tools!A:C,3,0)","v":{"$error":"#N/A"}},{"$f":"Orders!D607/VLOOKUP(B607,Tools!A:C,3,0)","v":{"$error":"#N/A"}}]
[{"$f":"Orders!A608","v":0},{"$f":"VLOOKUP(A608,'Product-tool'!A:B,2,0)","v":{"$error":"#N/A"}},{"$f":"Orders!B608/VLOOKUP(B608,Tools!A:C,3,0)","v":{"$error":"#N/A"}},{"$f":"Orders!C608/VLOOKUP(B608,Tools!A:C,3,0)","v":{"$error":"#N/A"}},{"$f":"Orders!D608/VLOOKUP(B608,Tools!A:C,3,0)","v":{"$error":"#N/A"}}]
[{"$f":"Orders!A609","v":0},{"$f":"VLOOKUP(A609,'Product-tool'!A:B,2,0)","v":{"$error":"#N/A"}},{"$f":"Orders!B609/VLOOKUP(B609,Tools!A:C,3,0)","v":{"$error":"#N/A"}},{"$f":"Orders!C609/VLOOKUP(B609,Tools!A:C,3,0)","v":{"$error":"#N/A"}},{"$f":"Orders!D609/VLOOKUP(B609,Tools!A:C,3,0)","v":{"$error":"#N/A"}}]
[{"$f":"Orders!A610","v":0},{"$f":"VLOOKUP(A610,'Product-tool'!A:B,2,0)","v":{"$error":"#N/A"}},{"$f":"Orders!B610/VLOOKUP(B610,Tools!A:C,3,0)","v":{"$error":"#N/A"}},{"$f":"Orders!C610/VLOOKUP(B610,Tools!A:C,3,0)","v":{"$error":"#N/A"}},{"$f":"Orders!D610/VLOOKUP(B610,Tools!A:C,3,0)","v":{"$error":"#N/A"}}]
[{"$f":"Orders!A611","v":0},{"$f":"VLOOKUP(A611,'Product-tool'!A:B,2,0)","v":{"$error":"#N/A"}},{"$f":"Orders!B611/VLOOKUP(B611,Tools!A:C,3,0)","v":{"$error":"#N/A"}},{"$f":"Orders!C611/VLOOKUP(B611,Tools!A:C,3,0)","v":{"$error":"#N/A"}},{"$f":"Orders!D611/VLOOKUP(B611,Tools!A:C,3,0)","v":{"$error":"#N/A"}}]
[{"$f":"Orders!A612","v":0},{"$f":"VLOOKUP(A612,'Product-tool'!A:B,2,0)","v":{"$error":"#N/A"}},{"$f":"Orders!B612/VLOOKUP(B612,Tools!A:C,3,0)","v":{"$error":"#N/A"}},{"$f":"Orders!C612/VLOOKUP(B612,Tools!A:C,3,0)","v":{"$error":"#N/A"}},{"$f":"Orders!D612/VLOOKUP(B612,Tools!A:C,3,0)","v":{"$error":"#N/A"}}]
[{"$f":"Orders!A613","v":0},{"$f":"VLOOKUP(A613,'Product-tool'!A:B,2,0)","v":{"$error":"#N/A"}},{"$f":"Orders!B613/VLOOKUP(B613,Tools!A:C,3,0)","v":{"$error":"#N/A"}},{"$f":"Orders!C613/VLOOKUP(B613,Tools!A:C,3,0)","v":{"$error":"#N/A"}},{"$f":"Orders!D613/VLOOKUP(B613,Tools!A:C,3,0)","v":{"$error":"#N/A"}}]
[{"$f":"Orders!A614","v":0},{"$f":"VLOOKUP(A614,'Product-tool'!A:B,2,0)","v":{"$error":"#N/A"}},{"$f":"Orders!B614/VLOOKUP(B614,Tools!A:C,3,0)","v":{"$error":"#N/A"}},{"$f":"Orders!C614/VLOOKUP(B614,Tools!A:C,3,0)","v":{"$error":"#N/A"}},{"$f":"Orders!D614/VLOOKUP(B614,Tools!A:C,3,0)","v":{"$error":"#N/A"}}]
[{"$f":"Orders!A615","v":0},{"$f":"VLOOKUP(A615,'Product-tool'!A:B,2,0)","v":{"$error":"#N/A"}},{"$f":"Orders!B615/VLOOKUP(B615,Tools!A:C,3,0)","v":{"$error":"#N/A"}},{"$f":"Orders!C615/VLOOKUP(B615,Tools!A:C,3,0)","v":{"$error":"#N/A"}},{"$f":"Orders!D615/VLOOKUP(B615,Tools!A:C,3,0)","v":{"$error":"#N/A"}}]
[{"$f":"Orders!A616","v":0},{"$f":"VLOOKUP(A616,'Product-tool'!A:B,2,0)","v":{"$error":"#N/A"}},{"$f":"Orders!B616/VLOOKUP(B616,Tools!A:C,3,0)","v":{"$error":"#N/A"}},{"$f":"Orders!C616/VLOOKUP(B616,Tools!A:C,3,0)","v":{"$error":"#N/A"}},{"$f":"Orders!D616/VLOOKUP(B616,Tools!A:C,3,0)","v":{"$error":"#N/A"}}]
[{"$f":"Orders!A617","v":0},{"$f":"VLOOKUP(A617,'Product-tool'!A:B,2,0)","v":{"$error":"#N/A"}},{"$f":"Orders!B617/VLOOKUP(B617,Tools!A:C,3,0)","v":{"$error":"#N/A"}},{"$f":"Orders!C617/VLOOKUP(B617,Tools!A:C,3,0)","v":{"$error":"#N/A"}},{"$f":"Orders!D617/VLOOKUP(B617,Tools!A:C,3,0)","v":{"$error":"#N/A"}}]
[{"$f":"Orders!A618","v":0},{"$f":"VLOOKUP(A618,'Product-tool'!A:B,2,0)","v":{"$error":"#N/A"}},{"$f":"Orders!B618/VLOOKUP(B618,Tools!A:C,3,0)","v":{"$error":"#N/A"}},{"$f":"Orders!C618/VLOOKUP(B618,Tools!A:C,3,0)","v":{"$error":"#N/A"}},{"$f":"Orders!D618/VLOOKUP(B618,Tools!A:C,3,0)","v":{"$error":"#N/A"}}]
[{"$f":"Orders!A619","v":0},{"$f":"VLOOKUP(A619,'Product-tool'!A:B,2,0)","v":{"$error":"#N/A"}},{"$f":"Orders!B619/VLOOKUP(B619,Tools!A:C,3,0)","v":{"$error":"#N/A"}},{"$f":"Orders!C619/VLOOKUP(B619,Tools!A:C,3,0)","v":{"$error":"#N/A"}},{"$f":"Orders!D619/VLOOKUP(B619,Tools!A:C,3,0)","v":{"$error":"#N/A"}}]
[{"$f":"Orders!A620","v":0},{"$f":"VLOOKUP(A620,'Product-tool'!A:B,2,0)","v":{"$error":"#N/A"}},{"$f":"Orders!B620/VLOOKUP(B620,Tools!A:C,3,0)","v":{"$error":"#N/A"}},{"$f":"Orders!C620/VLOOKUP(B620,Tools!A:C,3,0)","v":{"$error":"#N/A"}},{"$f":"Orders!D620/VLOOKUP(B620,Tools!A:C,3,0)","v":{"$error":"#N/A"}}]
[{"$f":"Orders!A621","v":0},{"$f":"VLOOKUP(A621,'Product-tool'!A:B,2,0)","v":{"$error":"#N/A"}},{"$f":"Orders!B621/VLOOKUP(B621,Tools!A:C,3,0)","v":{"$error":"#N/A"}},{"$f":"Orders!C621/VLOOKUP(B621,Tools!A:C,3,0)","v":{"$error":"#N/A"}},{"$f":"Orders!D621/VLOOKUP(B621,Tools!A:C,3,0)","v":{"$error":"#N/A"}}]
[{"$f":"Orders!A622","v":0},{"$f":"VLOOKUP(A622,'Product-tool'!A:B,2,0)","v":{"$error":"#N/A"}},{"$f":"Orders!B622/VLOOKUP(B622,Tools!A:C,3,0)","v":{"$error":"#N/A"}},{"$f":"Orders!C622/VLOOKUP(B622,Tools!A:C,3,0)","v":{"$error":"#N/A"}},{"$f":"Orders!D622/VLOOKUP(B622,Tools!A:C,3,0)","v":{"$error":"#N/A"}}]
[{"$f":"Orders!A623","v":0},{"$f":"VLOOKUP(A623,'Product-tool'!A:B,2,0)","v":{"$error":"#N/A"}},{"$f":"Orders!B623/VLOOKUP(B623,Tools!A:C,3,0)","v":{"$error":"#N/A"}},{"$f":"Orders!C623/VLOOKUP(B623,Tools!A:C,3,0)","v":{"$error":"#N/A"}},{"$f":"Orders!D623/VLOOKUP(B623,Tools!A:C,3,0)","v":{"$error":"#N/A"}}]
[{"$f":"Orders!A624","v":0},{"$f":"VLOOKUP(A624,'Product-tool'!A:B,2,0)","v":{"$error":"#N/A"}},{"$f":"Orders!B624/VLOOKUP(B624,Tools!A:C,3,0)","v":{"$error":"#N/A"}},{"$f":"Orders!C624/VLOOKUP(B624,Tools!A:C,3,0)","v":{"$error":"#N/A"}},{"$f":"Orders!D624/VLOOKUP(B624,Tools!A:C,3,0)","v":{"$error":"#N/A"}}]
[{"$f":"Orders!A625","v":0},{"$f":"VLOOKUP(A625,'Product-tool'!A:B,2,0)","v":{"$error":"#N/A"}},{"$f":"Orders!B625/VLOOKUP(B625,Tools!A:C,3,0)","v":{"$error":"#N/A"}},{"$f":"Orders!C625/VLOOKUP(B625,Tools!A:C,3,0)","v":{"$error":"#N/A"}},{"$f":"Orders!D625/VLOOKUP(B625,Tools!A:C,3,0)","v":{"$error":"#N/A"}}]
[{"$f":"Orders!A626","v":0},{"$f":"VLOOKUP(A626,'Product-tool'!A:B,2,0)","v":{"$error":"#N/A"}},{"$f":"Orders!B626/VLOOKUP(B626,Tools!A:C,3,0)","v":{"$error":"#N/A"}},{"$f":"Orders!C626/VLOOKUP(B626,Tools!A:C,3,0)","v":{"$error":"#N/A"}},{"$f":"Orders!D626/VLOOKUP(B626,Tools!A:C,3,0)","v":{"$error":"#N/A"}}]
[{"$f":"Orders!A627","v":0},{"$f":"VLOOKUP(A627,'Product-tool'!A:B,2,0)","v":{"$error":"#N/A"}},{"$f":"Orders!B627/VLOOKUP(B627,Tools!A:C,3,0)","v":{"$error":"#N/A"}},{"$f":"Orders!C627/VLOOKUP(B627,Tools!A:C,3,0)","v":{"$error":"#N/A"}},{"$f":"Orders!D627/VLOOKUP(B627,Tools!A:C,3,0)","v":{"$error":"#N/A"}}]
[{"$f":"Orders!A628","v":0},{"$f":"VLOOKUP(A628,'Product-tool'!A:B,2,0)","v":{"$error":"#N/A"}},{"$f":"Orders!B628/VLOOKUP(B628,Tools!A:C,3,0)","v":{"$error":"#N/A"}},{"$f":"Orders!C628/VLOOKUP(B628,Tools!A:C,3,0)","v":{"$error":"#N/A"}},{"$f":"Orders!D628/VLOOKUP(B628,Tools!A:C,3,0)","v":{"$error":"#N/A"}}]
[{"$f":"Orders!A629","v":0},{"$f":"VLOOKUP(A629,'Product-tool'!A:B,2,0)","v":{"$error":"#N/A"}},{"$f":"Orders!B629/VLOOKUP(B629,Tools!A:C,3,0)","v":{"$error":"#N/A"}},{"$f":"Orders!C629/VLOOKUP(B629,Tools!A:C,3,0)","v":{"$error":"#N/A"}},{"$f":"Orders!D629/VLOOKUP(B629,Tools!A:C,3,0)","v":{"$error":"#N/A"}}]
[{"$f":"Orders!A630","v":0},{"$f":"VLOOKUP(A630,'Product-tool'!A:B,2,0)","v":{"$error":"#N/A"}},{"$f":"Orders!B630/VLOOKUP(B630,Tools!A:C,3,0)","v":{"$error":"#N/A"}},{"$f":"Orders!C630/VLOOKUP(B630,Tools!A:C,3,0)","v":{"$error":"#N/A"}},{"$f":"Orders!D630/VLOOKUP(B630,Tools!A:C,3,0)","v":{"$error":"#N/A"}}]
[{"$f":"Orders!A631","v":0},{"$f":"VLOOKUP(A631,'Product-tool'!A:B,2,0)","v":{"$error":"#N/A"}},{"$f":"Orders!B631/VLOOKUP(B631,Tools!A:C,3,0)","v":{"$error":"#N/A"}},{"$f":"Orders!C631/VLOOKUP(B631,Tools!A:C,3,0)","v":{"$error":"#N/A"}},{"$f":"Orders!D631/VLOOKUP(B631,Tools!A:C,3,0)","v":{"$error":"#N/A"}}]
[{"$f":"Orders!A632","v":0},{"$f":"VLOOKUP(A632,'Product-tool'!A:B,2,0)","v":{"$error":"#N/A"}},{"$f":"Orders!B632/VLOOKUP(B632,Tools!A:C,3,0)","v":{"$error":"#N/A"}},{"$f":"Orders!C632/VLOOKUP(B632,Tools!A:C,3,0)","v":{"$error":"#N/A"}},{"$f":"Orders!D632/VLOOKUP(B632,Tools!A:C,3,0)","v":{"$error":"#N/A"}}]
[{"$f":"Orders!A633","v":0},{"$f":"VLOOKUP(A633,'Product-tool'!A:B,2,0)","v":{"$error":"#N/A"}},{"$f":"Orders!B633/VLOOKUP(B633,Tools!A:C,3,0)","v":{"$error":"#N/A"}},{"$f":"Orders!C633/VLOOKUP(B633,Tools!A:C,3,0)","v":{"$error":"#N/A"}},{"$f":"Orders!D633/VLOOKUP(B633,Tools!A:C,3,0)","v":{"$error":"#N/A"}}]
[{"$f":"Orders!A634","v":0},{"$f":"VLOOKUP(A634,'Product-tool'!A:B,2,0)","v":{"$error":"#N/A"}},{"$f":"Orders!B634/VLOOKUP(B634,Tools!A:C,3,0)","v":{"$error":"#N/A"}},{"$f":"Orders!C634/VLOOKUP(B634,Tools!A:C,3,0)","v":{"$error":"#N/A"}},{"$f":"Orders!D634/VLOOKUP(B634,Tools!A:C,3,0)","v":{"$error":"#N/A"}}]
[{"$f":"Orders!A635","v":0},{"$f":"VLOOKUP(A635,'Product-tool'!A:B,2,0)","v":{"$error":"#N/A"}},{"$f":"Orders!B635/VLOOKUP(B635,Tools!A:C,3,0)","v":{"$error":"#N/A"}},{"$f":"Orders!C635/VLOOKUP(B635,Tools!A:C,3,0)","v":{"$error":"#N/A"}},{"$f":"Orders!D635/VLOOKUP(B635,Tools!A:C,3,0)","v":{"$error":"#N/A"}}]
[{"$f":"Orders!A636","v":0},{"$f":"VLOOKUP(A636,'Product-tool'!A:B,2,0)","v":{"$error":"#N/A"}},{"$f":"Orders!B636/VLOOKUP(B636,Tools!A:C,3,0)","v":{"$error":"#N/A"}},{"$f":"Orders!C636/VLOOKUP(B636,Tools!A:C,3,0)","v":{"$error":"#N/A"}},{"$f":"Orders!D636/VLOOKUP(B636,Tools!A:C,3,0)","v":{"$error":"#N/A"}}]
[{"$f":"Orders!A637","v":0},{"$f":"VLOOKUP(A637,'Product-tool'!A:B,2,0)","v":{"$error":"#N/A"}},{"$f":"Orders!B637/VLOOKUP(B637,Tools!A:C,3,0)","v":{"$error":"#N/A"}},{"$f":"Orders!C637/VLOOKUP(B637,Tools!A:C,3,0)","v":{"$error":"#N/A"}},{"$f":"Orders!D637/VLOOKUP(B637,Tools!A:C,3,0)","v":{"$error":"#N/A"}}]
[{"$f":"Orders!A638","v":0},{"$f":"VLOOKUP(A638,'Product-tool'!A:B,2,0)","v":{"$error":"#N/A"}},{"$f":"Orders!B638/VLOOKUP(B638,Tools!A:C,3,0)","v":{"$error":"#N/A"}},{"$f":"Orders!C638/VLOOKUP(B638,Tools!A:C,3,0)","v":{"$error":"#N/A"}},{"$f":"Orders!D638/VLOOKUP(B638,Tools!A:C,3,0)","v":{"$error":"#N/A"}}]
[{"$f":"Orders!A639","v":0},{"$f":"VLOOKUP(A639,'Product-tool'!A:B,2,0)","v":{"$error":"#N/A"}},{"$f":"Orders!B639/VLOOKUP(B639,Tools!A:C,3,0)","v":{"$error":"#N/A"}},{"$f":"Orders!C639/VLOOKUP(B639,Tools!A:C,3,0)","v":{"$error":"#N/A"}},{"$f":"Orders!D639/VLOOKUP(B639,Tools!A:C,3,0)","v":{"$error":"#N/A"}}]
[{"$f":"Orders!A640","v":0},{"$f":"VLOOKUP(A640,'Product-tool'!A:B,2,0)","v":{"$error":"#N/A"}},{"$f":"Orders!B640/VLOOKUP(B640,Tools!A:C,3,0)","v":{"$error":"#N/A"}},{"$f":"Orders!C640/VLOOKUP(B640,Tools!A:C,3,0)","v":{"$error":"#N/A"}},{"$f":"Orders!D640/VLOOKUP(B640,Tools!A:C,3,0)","v":{"$error":"#N/A"}}]
[{"$f":"Orders!A641","v":0},{"$f":"VLOOKUP(A641,'Product-tool'!A:B,2,0)","v":{"$error":"#N/A"}},{"$f":"Orders!B641/VLOOKUP(B641,Tools!A:C,3,0)","v":{"$error":"#N/A"}},{"$f":"Orders!C641/VLOOKUP(B641,Tools!A:C,3,0)","v":{"$error":"#N/A"}},{"$f":"Orders!D641/VLOOKUP(B641,Tools!A:C,3,0)","v":{"$error":"#N/A"}}]
[{"$f":"Orders!A642","v":0},{"$f":"VLOOKUP(A642,'Product-tool'!A:B,2,0)","v":{"$error":"#N/A"}},{"$f":"Orders!B642/VLOOKUP(B642,Tools!A:C,3,0)","v":{"$error":"#N/A"}},{"$f":"Orders!C642/VLOOKUP(B642,Tools!A:C,3,0)","v":{"$error":"#N/A"}},{"$f":"Orders!D642/VLOOKUP(B642,Tools!A:C,3,0)","v":{"$error":"#N/A"}}]
[{"$f":"Orders!A643","v":0},{"$f":"VLOOKUP(A643,'Product-tool'!A:B,2,0)","v":{"$error":"#N/A"}},{"$f":"Orders!B643/VLOOKUP(B643,Tools!A:C,3,0)","v":{"$error":"#N/A"}},{"$f":"Orders!C643/VLOOKUP(B643,Tools!A:C,3,0)","v":{"$error":"#N/A"}},{"$f":"Orders!D643/VLOOKUP(B643,Tools!A:C,3,0)","v":{"$error":"#N/A"}}]
[{"$f":"Orders!A644","v":0},{"$f":"VLOOKUP(A644,'Product-tool'!A:B,2,0)","v":{"$error":"#N/A"}},{"$f":"Orders!B644/VLOOKUP(B644,Tools!A:C,3,0)","v":{"$error":"#N/A"}},{"$f":"Orders!C644/VLOOKUP(B644,Tools!A:C,3,0)","v":{"$error":"#N/A"}},{"$f":"Orders!D644/VLOOKUP(B644,Tools!A:C,3,0)","v":{"$error":"#N/A"}}]
[{"$f":"Orders!A645","v":0},{"$f":"VLOOKUP(A645,'Product-tool'!A:B,2,0)","v":{"$error":"#N/A"}},{"$f":"Orders!B645/VLOOKUP(B645,Tools!A:C,3,0)","v":{"$error":"#N/A"}},{"$f":"Orders!C645/VLOOKUP(B645,Tools!A:C,3,0)","v":{"$error":"#N/A"}},{"$f":"Orders!D645/VLOOKUP(B645,Tools!A:C,3,0)","v":{"$error":"#N/A"}}]
[{"$f":"Orders!A646","v":0},{"$f":"VLOOKUP(A646,'Product-tool'!A:B,2,0)","v":{"$error":"#N/A"}},{"$f":"Orders!B646/VLOOKUP(B646,Tools!A:C,3,0)","v":{"$error":"#N/A"}},{"$f":"Orders!C646/VLOOKUP(B646,Tools!A:C,3,0)","v":{"$error":"#N/A"}},{"$f":"Orders!D646/VLOOKUP(B646,Tools!A:C,3,0)","v":{"$error":"#N/A"}}]
[{"$f":"Orders!A647","v":0},{"$f":"VLOOKUP(A647,'Product-tool'!A:B,2,0)","v":{"$error":"#N/A"}},{"$f":"Orders!B647/VLOOKUP(B647,Tools!A:C,3,0)","v":{"$error":"#N/A"}},{"$f":"Orders!C647/VLOOKUP(B647,Tools!A:C,3,0)","v":{"$error":"#N/A"}},{"$f":"Orders!D647/VLOOKUP(B647,Tools!A:C,3,0)","v":{"$error":"#N/A"}}]
[{"$f":"Orders!A648","v":0},{"$f":"VLOOKUP(A648,'Product-tool'!A:B,2,0)","v":{"$error":"#N/A"}},{"$f":"Orders!B648/VLOOKUP(B648,Tools!A:C,3,0)","v":{"$error":"#N/A"}},{"$f":"Orders!C648/VLOOKUP(B648,Tools!A:C,3,0)","v":{"$error":"#N/A"}},{"$f":"Orders!D648/VLOOKUP(B648,Tools!A:C,3,0)","v":{"$error":"#N/A"}}]
[{"$f":"Orders!A649","v":0},{"$f":"VLOOKUP(A649,'Product-tool'!A:B,2,0)","v":{"$error":"#N/A"}},{"$f":"Orders!B649/VLOOKUP(B649,Tools!A:C,3,0)","v":{"$error":"#N/A"}},{"$f":"Orders!C649/VLOOKUP(B649,Tools!A:C,3,0)","v":{"$error":"#N/A"}},{"$f":"Orders!D649/VLOOKUP(B649,Tools!A:C,3,0)","v":{"$error":"#N/A"}}]
[{"$f":"Orders!A650","v":0},{"$f":"VLOOKUP(A650,'Product-tool'!A:B,2,0)","v":{"$error":"#N/A"}},{"$f":"Orders!B650/VLOOKUP(B650,Tools!A:C,3,0)","v":{"$error":"#N/A"}},{"$f":"Orders!C650/VLOOKUP(B650,Tools!A:C,3,0)","v":{"$error":"#N/A"}},{"$f":"Orders!D650/VLOOKUP(B650,Tools!A:C,3,0)","v":{"$error":"#N/A"}}]
[{"$f":"Orders!A651","v":0},{"$f":"VLOOKUP(A651,'Product-tool'!A:B,2,0)","v":{"$error":"#N/A"}},{"$f":"Orders!B651/VLOOKUP(B651,Tools!A:C,3,0)","v":{"$error":"#N/A"}},{"$f":"Orders!C651/VLOOKUP(B651,Tools!A:C,3,0)","v":{"$error":"#N/A"}},{"$f":"Orders!D651/VLOOKUP(B651,Tools!A:C,3,0)","v":{"$error":"#N/A"}}]
[{"$f":"Orders!A652","v":0},{"$f":"VLOOKUP(A652,'Product-tool'!A:B,2,0)","v":{"$error":"#N/A"}},{"$f":"Orders!B652/VLOOKUP(B652,Tools!A:C,3,0)","v":{"$error":"#N/A"}},{"$f":"Orders!C652/VLOOKUP(B652,Tools!A:C,3,0)","v":{"$error":"#N/A"}},{"$f":"Orders!D652/VLOOKUP(B652,Tools!A:C,3,0)","v":{"$error":"#N/A"}}]
[{"$f":"Orders!A653","v":0},{"$f":"VLOOKUP(A653,'Product-tool'!A:B,2,0)","v":{"$error":"#N/A"}},{"$f":"Orders!B653/VLOOKUP(B653,Tools!A:C,3,0)","v":{"$error":"#N/A"}},{"$f":"Orders!C653/VLOOKUP(B653,Tools!A:C,3,0)","v":{"$error":"#N/A"}},{"$f":"Orders!D653/VLOOKUP(B653,Tools!A:C,3,0)","v":{"$error":"#N/A"}}]
[{"$f":"Orders!A654","v":0},{"$f":"VLOOKUP(A654,'Product-tool'!A:B,2,0)","v":{"$error":"#N/A"}},{"$f":"Orders!B654/VLOOKUP(B654,Tools!A:C,3,0)","v":{"$error":"#N/A"}},{"$f":"Orders!C654/VLOOKUP(B654,Tools!A:C,3,0)","v":{"$error":"#N/A"}},{"$f":"Orders!D654/VLOOKUP(B654,Tools!A:C,3,0)","v":{"$error":"#N/A"}}]
[{"$f":"Orders!A655","v":0},{"$f":"VLOOKUP(A655,'Product-tool'!A:B,2,0)","v":{"$error":"#N/A"}},{"$f":"Orders!B655/VLOOKUP(B655,Tools!A:C,3,0)","v":{"$error":"#N/A"}},{"$f":"Orders!C655/VLOOKUP(B655,Tools!A:C,3,0)","v":{"$error":"#N/A"}},{"$f":"Orders!D655/VLOOKUP(B655,Tools!A:C,3,0)","v":{"$error":"#N/A"}}]
[{"$f":"Orders!A656","v":0},{"$f":"VLOOKUP(A656,'Product-tool'!A:B,2,0)","v":{"$error":"#N/A"}},{"$f":"Orders!B656/VLOOKUP(B656,Tools!A:C,3,0)","v":{"$error":"#N/A"}},{"$f":"Orders!C656/VLOOKUP(B656,Tools!A:C,3,0)","v":{"$error":"#N/A"}},{"$f":"Orders!D656/VLOOKUP(B656,Tools!A:C,3,0)","v":{"$error":"#N/A"}}]
[{"$f":"Orders!A657","v":0},{"$f":"VLOOKUP(A657,'Product-tool'!A:B,2,0)","v":{"$error":"#N/A"}},{"$f":"Orders!B657/VLOOKUP(B657,Tools!A:C,3,0)","v":{"$error":"#N/A"}},{"$f":"Orders!C657/VLOOKUP(B657,Tools!A:C,3,0)","v":{"$error":"#N/A"}},{"$f":"Orders!D657/VLOOKUP(B657,Tools!A:C,3,0)","v":{"$error":"#N/A"}}]
[{"$f":"Orders!A658","v":0},{"$f":"VLOOKUP(A658,'Product-tool'!A:B,2,0)","v":{"$error":"#N/A"}},{"$f":"Orders!B658/VLOOKUP(B658,Tools!A:C,3,0)","v":{"$error":"#N/A"}},{"$f":"Orders!C658/VLOOKUP(B658,Tools!A:C,3,0)","v":{"$error":"#N/A"}},{"$f":"Orders!D658/VLOOKUP(B658,Tools!A:C,3,0)","v":{"$error":"#N/A"}}]
[{"$f":"Orders!A659","v":0},{"$f":"VLOOKUP(A659,'Product-tool'!A:B,2,0)","v":{"$error":"#N/A"}},{"$f":"Orders!B659/VLOOKUP(B659,Tools!A:C,3,0)","v":{"$error":"#N/A"}},{"$f":"Orders!C659/VLOOKUP(B659,Tools!A:C,3,0)","v":{"$error":"#N/A"}},{"$f":"Orders!D659/VLOOKUP(B659,Tools!A:C,3,0)","v":{"$error":"#N/A"}}]
[{"$f":"Orders!A660","v":0},{"$f":"VLOOKUP(A660,'Product-tool'!A:B,2,0)","v":{"$error":"#N/A"}},{"$f":"Orders!B660/VLOOKUP(B660,Tools!A:C,3,0)","v":{"$error":"#N/A"}},{"$f":"Orders!C660/VLOOKUP(B660,Tools!A:C,3,0)","v":{"$error":"#N/A"}},{"$f":"Orders!D660/VLOOKUP(B660,Tools!A:C,3,0)","v":{"$error":"#N/A"}}]
[{"$f":"Orders!A661","v":0},{"$f":"VLOOKUP(A661,'Product-tool'!A:B,2,0)","v":{"$error":"#N/A"}},{"$f":"Orders!B661/VLOOKUP(B661,Tools!A:C,3,0)","v":{"$error":"#N/A"}},{"$f":"Orders!C661/VLOOKUP(B661,Tools!A:C,3,0)","v":{"$error":"#N/A"}},{"$f":"Orders!D661/VLOOKUP(B661,Tools!A:C,3,0)","v":{"$error":"#N/A"}}]
[{"$f":"Orders!A662","v":0},{"$f":"VLOOKUP(A662,'Product-tool'!A:B,2,0)","v":{"$error":"#N/A"}},{"$f":"Orders!B662/VLOOKUP(B662,Tools!A:C,3,0)","v":{"$error":"#N/A"}},{"$f":"Orders!C662/VLOOKUP(B662,Tools!A:C,3,0)","v":{"$error":"#N/A"}},{"$f":"Orders!D662/VLOOKUP(B662,Tools!A:C,3,0)","v":{"$error":"#N/A"}}]
[{"$f":"Orders!A663","v":0},{"$f":"VLOOKUP(A663,'Product-tool'!A:B,2,0)","v":{"$error":"#N/A"}},{"$f":"Orders!B663/VLOOKUP(B663,Tools!A:C,3,0)","v":{"$error":"#N/A"}},{"$f":"Orders!C663/VLOOKUP(B663,Tools!A:C,3,0)","v":{"$error":"#N/A"}},{"$f":"Orders!D663/VLOOKUP(B663,Tools!A:C,3,0)","v":{"$error":"#N/A"}}]
[{"$f":"Orders!A664","v":0},{"$f":"VLOOKUP(A664,'Product-tool'!A:B,2,0)","v":{"$error":"#N/A"}},{"$f":"Orders!B664/VLOOKUP(B664,Tools!A:C,3,0)","v":{"$error":"#N/A"}},{"$f":"Orders!C664/VLOOKUP(B664,Tools!A:C,3,0)","v":{"$error":"#N/A"}},{"$f":"Orders!D664/VLOOKUP(B664,Tools!A:C,3,0)","v":{"$error":"#N/A"}}]
[{"$f":"Orders!A665","v":0},{"$f":"VLOOKUP(A665,'Product-tool'!A:B,2,0)","v":{"$error":"#N/A"}},{"$f":"Orders!B665/VLOOKUP(B665,Tools!A:C,3,0)","v":{"$error":"#N/A"}},{"$f":"Orders!C665/VLOOKUP(B665,Tools!A:C,3,0)","v":{"$error":"#N/A"}},{"$f":"Orders!D665/VLOOKUP(B665,Tools!A:C,3,0)","v":{"$error":"#N/A"}}]
[{"$f":"Orders!A666","v":0},{"$f":"VLOOKUP(A666,'Product-tool'!A:B,2,0)","v":{"$error":"#N/A"}},{"$f":"Orders!B666/VLOOKUP(B666,Tools!A:C,3,0)","v":{"$error":"#N/A"}},{"$f":"Orders!C666/VLOOKUP(B666,Tools!A:C,3,0)","v":{"$error":"#N/A"}},{"$f":"Orders!D666/VLOOKUP(B666,Tools!A:C,3,0)","v":{"$error":"#N/A"}}]
[{"$f":"Orders!A667","v":0},{"$f":"VLOOKUP(A667,'Product-tool'!A:B,2,0)","v":{"$error":"#N/A"}},{"$f":"Orders!B667/VLOOKUP(B667,Tools!A:C,3,0)","v":{"$error":"#N/A"}},{"$f":"Orders!C667/VLOOKUP(B667,Tools!A:C,3,0)","v":{"$error":"#N/A"}},{"$f":"Orders!D667/VLOOKUP(B667,Tools!A:C,3,0)","v":{"$error":"#N/A"}}]
[{"$f":"Orders!A668","v":0},{"$f":"VLOOKUP(A668,'Product-tool'!A:B,2,0)","v":{"$error":"#N/A"}},{"$f":"Orders!B668/VLOOKUP(B668,Tools!A:C,3,0)","v":{"$error":"#N/A"}},{"$f":"Orders!C668/VLOOKUP(B668,Tools!A:C,3,0)","v":{"$error":"#N/A"}},{"$f":"Orders!D668/VLOOKUP(B668,Tools!A:C,3,0)","v":{"$error":"#N/A"}}]
[{"$f":"Orders!A669","v":0},{"$f":"VLOOKUP(A669,'Product-tool'!A:B,2,0)","v":{"$error":"#N/A"}},{"$f":"Orders!B669/VLOOKUP(B669,Tools!A:C,3,0)","v":{"$error":"#N/A"}},{"$f":"Orders!C669/VLOOKUP(B669,Tools!A:C,3,0)","v":{"$error":"#N/A"}},{"$f":"Orders!D669/VLOOKUP(B669,Tools!A:C,3,0)","v":{"$error":"#N/A"}}]
[{"$f":"Orders!A670","v":0},{"$f":"VLOOKUP(A670,'Product-tool'!A:B,2,0)","v":{"$error":"#N/A"}},{"$f":"Orders!B670/VLOOKUP(B670,Tools!A:C,3,0)","v":{"$error":"#N/A"}},{"$f":"Orders!C670/VLOOKUP(B670,Tools!A:C,3,0)","v":{"$error":"#N/A"}},{"$f":"Orders!D670/VLOOKUP(B670,Tools!A:C,3,0)","v":{"$error":"#N/A"}}]
[{"$f":"Orders!A671","v":0},{"$f":"VLOOKUP(A671,'Product-tool'!A:B,2,0)","v":{"$error":"#N/A"}},{"$f":"Orders!B671/VLOOKUP(B671,Tools!A:C,3,0)","v":{"$error":"#N/A"}},{"$f":"Orders!C671/VLOOKUP(B671,Tools!A:C,3,0)","v":{"$error":"#N/A"}},{"$f":"Orders!D671/VLOOKUP(B671,Tools!A:C,3,0)","v":{"$error":"#N/A"}}]
[{"$f":"Orders!A672","v":0},{"$f":"VLOOKUP(A672,'Product-tool'!A:B,2,0)","v":{"$error":"#N/A"}},{"$f":"Orders!B672/VLOOKUP(B672,Tools!A:C,3,0)","v":{"$error":"#N/A"}},{"$f":"Orders!C672/VLOOKUP(B672,Tools!A:C,3,0)","v":{"$error":"#N/A"}},{"$f":"Orders!D672/VLOOKUP(B672,Tools!A:C,3,0)","v":{"$error":"#N/A"}}]
[{"$f":"Orders!A673","v":0},{"$f":"VLOOKUP(A673,'Product-tool'!A:B,2,0)","v":{"$error":"#N/A"}},{"$f":"Orders!B673/VLOOKUP(B673,Tools!A:C,3,0)","v":{"$error":"#N/A"}},{"$f":"Orders!C673/VLOOKUP(B673,Tools!A:C,3,0)","v":{"$error":"#N/A"}},{"$f":"Orders!D673/VLOOKUP(B673,Tools!A:C,3,0)","v":{"$error":"#N/A"}}]
[{"$f":"Orders!A674","v":0},{"$f":"VLOOKUP(A674,'Product-tool'!A:B,2,0)","v":{"$error":"#N/A"}},{"$f":"Orders!B674/VLOOKUP(B674,Tools!A:C,3,0)","v":{"$error":"#N/A"}},{"$f":"Orders!C674/VLOOKUP(B674,Tools!A:C,3,0)","v":{"$error":"#N/A"}},{"$f":"Orders!D674/VLOOKUP(B674,Tools!A:C,3,0)","v":{"$error":"#N/A"}}]
[{"$f":"Orders!A675","v":0},{"$f":"VLOOKUP(A675,'Product-tool'!A:B,2,0)","v":{"$error":"#N/A"}},{"$f":"Orders!B675/VLOOKUP(B675,Tools!A:C,3,0)","v":{"$error":"#N/A"}},{"$f":"Orders!C675/VLOOKUP(B675,Tools!A:C,3,0)","v":{"$error":"#N/A"}},{"$f":"Orders!D675/VLOOKUP(B675,Tools!A:C,3,0)","v":{"$error":"#N/A"}}]
[{"$f":"Orders!A676","v":0},{"$f":"VLOOKUP(A676,'Product-tool'!A:B,2,0)","v":{"$error":"#N/A"}},{"$f":"Orders!B676/VLOOKUP(B676,Tools!A:C,3,0)","v":{"$error":"#N/A"}},{"$f":"Orders!C676/VLOOKUP(B676,Tools!A:C,3,0)","v":{"$error":"#N/A"}},{"$f":"Orders!D676/VLOOKUP(B676,Tools!A:C,3,0)","v":{"$error":"#N/A"}}]
[{"$f":"Orders!A677","v":0},{"$f":"VLOOKUP(A677,'Product-tool'!A:B,2,0)","v":{"$error":"#N/A"}},{"$f":"Orders!B677/VLOOKUP(B677,Tools!A:C,3,0)","v":{"$error":"#N/A"}},{"$f":"Orders!C677/VLOOKUP(B677,Tools!A:C,3,0)","v":{"$error":"#N/A"}},{"$f":"Orders!D677/VLOOKUP(B677,Tools!A:C,3,0)","v":{"$error":"#N/A"}}]
[{"$f":"Orders!A678","v":0},{"$f":"VLOOKUP(A678,'Product-tool'!A:B,2,0)","v":{"$error":"#N/A"}},{"$f":"Orders!B678/VLOOKUP(B678,Tools!A:C,3,0)","v":{"$error":"#N/A"}},{"$f":"Orders!C678/VLOOKUP(B678,Tools!A:C,3,0)","v":{"$error":"#N/A"}},{"$f":"Orders!D678/VLOOKUP(B678,Tools!A:C,3,0)","v":{"$error":"#N/A"}}]
[{"$f":"Orders!A679","v":0},{"$f":"VLOOKUP(A679,'Product-tool'!A:B,2,0)","v":{"$error":"#N/A"}},{"$f":"Orders!B679/VLOOKUP(B679,Tools!A:C,3,0)","v":{"$error":"#N/A"}},{"$f":"Orders!C679/VLOOKUP(B679,Tools!A:C,3,0)","v":{"$error":"#N/A"}},{"$f":"Orders!D679/VLOOKUP(B679,Tools!A:C,3,0)","v":{"$error":"#N/A"}}]
[{"$f":"Orders!A680","v":0},{"$f":"VLOOKUP(A680,'Product-tool'!A:B,2,0)","v":{"$error":"#N/A"}},{"$f":"Orders!B680/VLOOKUP(B680,Tools!A:C,3,0)","v":{"$error":"#N/A"}},{"$f":"Orders!C680/VLOOKUP(B680,Tools!A:C,3,0)","v":{"$error":"#N/A"}},{"$f":"Orders!D680/VLOOKUP(B680,Tools!A:C,3,0)","v":{"$error":"#N/A"}}]
[{"$f":"Orders!A681","v":0},{"$f":"VLOOKUP(A681,'Product-tool'!A:B,2,0)","v":{"$error":"#N/A"}},{"$f":"Orders!B681/VLOOKUP(B681,Tools!A:C,3,0)","v":{"$error":"#N/A"}},{"$f":"Orders!C681/VLOOKUP(B681,Tools!A:C,3,0)","v":{"$error":"#N/A"}},{"$f":"Orders!D681/VLOOKUP(B681,Tools!A:C,3,0)","v":{"$error":"#N/A"}}]
[{"$f":"Orders!A682","v":0},{"$f":"VLOOKUP(A682,'Product-tool'!A:B,2,0)","v":{"$error":"#N/A"}},{"$f":"Orders!B682/VLOOKUP(B682,Tools!A:C,3,0)","v":{"$error":"#N/A"}},{"$f":"Orders!C682/VLOOKUP(B682,Tools!A:C,3,0)","v":{"$error":"#N/A"}},{"$f":"Orders!D682/VLOOKUP(B682,Tools!A:C,3,0)","v":{"$error":"#N/A"}}]
[{"$f":"Orders!A683","v":0},{"$f":"VLOOKUP(A683,'Product-tool'!A:B,2,0)","v":{"$error":"#N/A"}},{"$f":"Orders!B683/VLOOKUP(B683,Tools!A:C,3,0)","v":{"$error":"#N/A"}},{"$f":"Orders!C683/VLOOKUP(B683,Tools!A:C,3,0)","v":{"$error":"#N/A"}},{"$f":"Orders!D683/VLOOKUP(B683,Tools!A:C,3,0)","v":{"$error":"#N/A"}}]
[{"$f":"Orders!A684","v":0},{"$f":"VLOOKUP(A684,'Product-tool'!A:B,2,0)","v":{"$error":"#N/A"}},{"$f":"Orders!B684/VLOOKUP(B684,Tools!A:C,3,0)","v":{"$error":"#N/A"}},{"$f":"Orders!C684/VLOOKUP(B684,Tools!A:C,3,0)","v":{"$error":"#N/A"}},{"$f":"Orders!D684/VLOOKUP(B684,Tools!A:C,3,0)","v":{"$error":"#N/A"}}]
[{"$f":"Orders!A685","v":0},{"$f":"VLOOKUP(A685,'Product-tool'!A:B,2,0)","v":{"$error":"#N/A"}},{"$f":"Orders!B685/VLOOKUP(B685,Tools!A:C,3,0)","v":{"$error":"#N/A"}},{"$f":"Orders!C685/VLOOKUP(B685,Tools!A:C,3,0)","v":{"$error":"#N/A"}},{"$f":"Orders!D685/VLOOKUP(B685,Tools!A:C,3,0)","v":{"$error":"#N/A"}}]
[{"$f":"Orders!A686","v":0},{"$f":"VLOOKUP(A686,'Product-tool'!A:B,2,0)","v":{"$error":"#N/A"}},{"$f":"Orders!B686/VLOOKUP(B686,Tools!A:C,3,0)","v":{"$error":"#N/A"}},{"$f":"Orders!C686/VLOOKUP(B686,Tools!A:C,3,0)","v":{"$error":"#N/A"}},{"$f":"Orders!D686/VLOOKUP(B686,Tools!A:C,3,0)","v":{"$error":"#N/A"}}]
[{"$f":"Orders!A687","v":0},{"$f":"VLOOKUP(A687,'Product-tool'!A:B,2,0)","v":{"$error":"#N/A"}},{"$f":"Orders!B687/VLOOKUP(B687,Tools!A:C,3,0)","v":{"$error":"#N/A"}},{"$f":"Orders!C687/VLOOKUP(B687,Tools!A:C,3,0)","v":{"$error":"#N/A"}},{"$f":"Orders!D687/VLOOKUP(B687,Tools!A:C,3,0)","v":{"$error":"#N/A"}}]
[{"$f":"Orders!A688","v":0},{"$f":"VLOOKUP(A688,'Product-tool'!A:B,2,0)","v":{"$error":"#N/A"}},{"$f":"Orders!B688/VLOOKUP(B688,Tools!A:C,3,0)","v":{"$error":"#N/A"}},{"$f":"Orders!C688/VLOOKUP(B688,Tools!A:C,3,0)","v":{"$error":"#N/A"}},{"$f":"Orders!D688/VLOOKUP(B688,Tools!A:C,3,0)","v":{"$error":"#N/A"}}]
[{"$f":"Orders!A689","v":0},{"$f":"VLOOKUP(A689,'Product-tool'!A:B,2,0)","v":{"$error":"#N/A"}},{"$f":"Orders!B689/VLOOKUP(B689,Tools!A:C,3,0)","v":{"$error":"#N/A"}},{"$f":"Orders!C689/VLOOKUP(B689,Tools!A:C,3,0)","v":{"$error":"#N/A"}},{"$f":"Orders!D689/VLOOKUP(B689,Tools!A:C,3,0)","v":{"$error":"#N/A"}}]
[{"$f":"Orders!A690","v":0},{"$f":"VLOOKUP(A690,'Product-tool'!A:B,2,0)","v":{"$error":"#N/A"}},{"$f":"Orders!B690/VLOOKUP(B690,Tools!A:C,3,0)","v":{"$error":"#N/A"}},{"$f":"Orders!C690/VLOOKUP(B690,Tools!A:C,3,0)","v":{"$error":"#N/A"}},{"$f":"Orders!D690/VLOOKUP(B690,Tools!A:C,3,0)","v":{"$error":"#N/A"}}]
[{"$f":"Orders!A691","v":0},{"$f":"VLOOKUP(A691,'Product-tool'!A:B,2,0)","v":{"$error":"#N/A"}},{"$f":"Orders!B691/VLOOKUP(B691,Tools!A:C,3,0)","v":{"$error":"#N/A"}},{"$f":"Orders!C691/VLOOKUP(B691,Tools!A:C,3,0)","v":{"$error":"#N/A"}},{"$f":"Orders!D691/VLOOKUP(B691,Tools!A:C,3,0)","v":{"$error":"#N/A"}}]
[{"$f":"Orders!A692","v":0},{"$f":"VLOOKUP(A692,'Product-tool'!A:B,2,0)","v":{"$error":"#N/A"}},{"$f":"Orders!B692/VLOOKUP(B692,Tools!A:C,3,0)","v":{"$error":"#N/A"}},{"$f":"Orders!C692/VLOOKUP(B692,Tools!A:C,3,0)","v":{"$error":"#N/A"}},{"$f":"Orders!D692/VLOOKUP(B692,Tools!A:C,3,0)","v":{"$error":"#N/A"}}]
[{"$f":"Orders!A693","v":0},{"$f":"VLOOKUP(A693,'Product-tool'!A:B,2,0)","v":{"$error":"#N/A"}},{"$f":"Orders!B693/VLOOKUP(B693,Tools!A:C,3,0)","v":{"$error":"#N/A"}},{"$f":"Orders!C693/VLOOKUP(B693,Tools!A:C,3,0)","v":{"$error":"#N/A"}},{"$f":"Orders!D693/VLOOKUP(B693,Tools!A:C,3,0)","v":{"$error":"#N/A"}}]
[{"$f":"Orders!A694","v":0},{"$f":"VLOOKUP(A694,'Product-tool'!A:B,2,0)","v":{"$error":"#N/A"}},{"$f":"Orders!B694/VLOOKUP(B694,Tools!A:C,3,0)","v":{"$error":"#N/A"}},{"$f":"Orders!C694/VLOOKUP(B694,Tools!A:C,3,0)","v":{"$error":"#N/A"}},{"$f":"Orders!D694/VLOOKUP(B694,Tools!A:C,3,0)","v":{"$error":"#N/A"}}]
[{"$f":"Orders!A695","v":0},{"$f":"VLOOKUP(A695,'Product-tool'!A:B,2,0)","v":{"$error":"#N/A"}},{"$f":"Orders!B695/VLOOKUP(B695,Tools!A:C,3,0)","v":{"$error":"#N/A"}},{"$f":"Orders!C695/VLOOKUP(B695,Tools!A:C,3,0)","v":{"$error":"#N/A"}},{"$f":"Orders!D695/VLOOKUP(B695,Tools!A:C,3,0)","v":{"$error":"#N/A"}}]
[{"$f":"Orders!A696","v":0},{"$f":"VLOOKUP(A696,'Product-tool'!A:B,2,0)","v":{"$error":"#N/A"}},{"$f":"Orders!B696/VLOOKUP(B696,Tools!A:C,3,0)","v":{"$error":"#N/A"}},{"$f":"Orders!C696/VLOOKUP(B696,Tools!A:C,3,0)","v":{"$error":"#N/A"}},{"$f":"Orders!D696/VLOOKUP(B696,Tools!A:C,3,0)","v":{"$error":"#N/A"}}]
[{"$f":"Orders!A697","v":0},{"$f":"VLOOKUP(A697,'Product-tool'!A:B,2,0)","v":{"$error":"#N/A"}},{"$f":"Orders!B697/VLOOKUP(B697,Tools!A:C,3,0)","v":{"$error":"#N/A"}},{"$f":"Orders!C697/VLOOKUP(B697,Tools!A:C,3,0)","v":{"$error":"#N/A"}},{"$f":"Orders!D697/VLOOKUP(B697,Tools!A:C,3,0)","v":{"$error":"#N/A"}}]
[{"$f":"Orders!A698","v":0},{"$f":"VLOOKUP(A698,'Product-tool'!A:B,2,0)","v":{"$error":"#N/A"}},{"$f":"Orders!B698/VLOOKUP(B698,Tools!A:C,3,0)","v":{"$error":"#N/A"}},{"$f":"Orders!C698/VLOOKUP(B698,Tools!A:C,3,0)","v":{"$error":"#N/A"}},{"$f":"Orders!D698/VLOOKUP(B698,Tools!A:C,3,0)","v":{"$error":"#N/A"}}]
[{"$f":"Orders!A699","v":0},{"$f":"VLOOKUP(A699,'Product-tool'!A:B,2,0)","v":{"$error":"#N/A"}},{"$f":"Orders!B699/VLOOKUP(B699,Tools!A:C,3,0)","v":{"$error":"#N/A"}},{"$f":"Orders!C699/VLOOKUP(B699,Tools!A:C,3,0)","v":{"$error":"#N/A"}},{"$f":"Orders!D699/VLOOKUP(B699,Tools!A:C,3,0)","v":{"$error":"#N/A"}}]
[{"$f":"Orders!A700","v":0},{"$f":"VLOOKUP(A700,'Product-tool'!A:B,2,0)","v":{"$error":"#N/A"}},{"$f":"Orders!B700/VLOOKUP(B700,Tools!A:C,3,0)","v":{"$error":"#N/A"}},{"$f":"Orders!C700/VLOOKUP(B700,Tools!A:C,3,0)","v":{"$error":"#N/A"}},{"$f":"Orders!D700/VLOOKUP(B700,Tools!A:C,3,0)","v":{"$error":"#N/A"}}]
[{"$f":"Orders!A701","v":0},{"$f":"VLOOKUP(A701,'Product-tool'!A:B,2,0)","v":{"$error":"#N/A"}},{"$f":"Orders!B701/VLOOKUP(B701,Tools!A:C,3,0)","v":{"$error":"#N/A"}},{"$f":"Orders!C701/VLOOKUP(B701,Tools!A:C,3,0)","v":{"$error":"#N/A"}},{"$f":"Orders!D701/VLOOKUP(B701,Tools!A:C,3,0)","v":{"$error":"#N/A"}}]
[{"$f":"Orders!A702","v":0},{"$f":"VLOOKUP(A702,'Product-tool'!A:B,2,0)","v":{"$error":"#N/A"}},{"$f":"Orders!B702/VLOOKUP(B702,Tools!A:C,3,0)","v":{"$error":"#N/A"}},{"$f":"Orders!C702/VLOOKUP(B702,Tools!A:C,3,0)","v":{"$error":"#N/A"}},{"$f":"Orders!D702/VLOOKUP(B702,Tools!A:C,3,0)","v":{"$error":"#N/A"}}]
[{"$f":"Orders!A703","v":0},{"$f":"VLOOKUP(A703,'Product-tool'!A:B,2,0)","v":{"$error":"#N/A"}},{"$f":"Orders!B703/VLOOKUP(B703,Tools!A:C,3,0)","v":{"$error":"#N/A"}},{"$f":"Orders!C703/VLOOKUP(B703,Tools!A:C,3,0)","v":{"$error":"#N/A"}},{"$f":"Orders!D703/VLOOKUP(B703,Tools!A:C,3,0)","v":{"$error":"#N/A"}}]
[{"$f":"Orders!A704","v":0},{"$f":"VLOOKUP(A704,'Product-tool'!A:B,2,0)","v":{"$error":"#N/A"}},{"$f":"Orders!B704/VLOOKUP(B704,Tools!A:C,3,0)","v":{"$error":"#N/A"}},{"$f":"Orders!C704/VLOOKUP(B704,Tools!A:C,3,0)","v":{"$error":"#N/A"}},{"$f":"Orders!D704/VLOOKUP(B704,Tools!A:C,3,0)","v":{"$error":"#N/A"}}]
[{"$f":"Orders!A705","v":0},{"$f":"VLOOKUP(A705,'Product-tool'!A:B,2,0)","v":{"$error":"#N/A"}},{"$f":"Orders!B705/VLOOKUP(B705,Tools!A:C,3,0)","v":{"$error":"#N/A"}},{"$f":"Orders!C705/VLOOKUP(B705,Tools!A:C,3,0)","v":{"$error":"#N/A"}},{"$f":"Orders!D705/VLOOKUP(B705,Tools!A:C,3,0)","v":{"$error":"#N/A"}}]
[{"$f":"Orders!A706","v":0},{"$f":"VLOOKUP(A706,'Product-tool'!A:B,2,0)","v":{"$error":"#N/A"}},{"$f":"Orders!B706/VLOOKUP(B706,Tools!A:C,3,0)","v":{"$error":"#N/A"}},{"$f":"Orders!C706/VLOOKUP(B706,Tools!A:C,3,0)","v":{"$error":"#N/A"}},{"$f":"Orders!D706/VLOOKUP(B706,Tools!A:C,3,0)","v":{"$error":"#N/A"}}]
[{"$f":"Orders!A707","v":0},{"$f":"VLOOKUP(A707,'Product-tool'!A:B,2,0)","v":{"$error":"#N/A"}},{"$f":"Orders!B707/VLOOKUP(B707,Tools!A:C,3,0)","v":{"$error":"#N/A"}},{"$f":"Orders!C707/VLOOKUP(B707,Tools!A:C,3,0)","v":{"$error":"#N/A"}},{"$f":"Orders!D707/VLOOKUP(B707,Tools!A:C,3,0)","v":{"$error":"#N/A"}}]
[{"$f":"Orders!A708","v":0},{"$f":"VLOOKUP(A708,'Product-tool'!A:B,2,0)","v":{"$error":"#N/A"}},{"$f":"Orders!B708/VLOOKUP(B708,Tools!A:C,3,0)","v":{"$error":"#N/A"}},{"$f":"Orders!C708/VLOOKUP(B708,Tools!A:C,3,0)","v":{"$error":"#N/A"}},{"$f":"Orders!D708/VLOOKUP(B708,Tools!A:C,3,0)","v":{"$error":"#N/A"}}]
[{"$f":"Orders!A709","v":0},{"$f":"VLOOKUP(A709,'Product-tool'!A:B,2,0)","v":{"$error":"#N/A"}},{"$f":"Orders!B709/VLOOKUP(B709,Tools!A:C,3,0)","v":{"$error":"#N/A"}},{"$f":"Orders!C709/VLOOKUP(B709,Tools!A:C,3,0)","v":{"$error":"#N/A"}},{"$f":"Orders!D709/VLOOKUP(B709,Tools!A:C,3,0)","v":{"$error":"#N/A"}}]
[{"$f":"Orders!A710","v":0},{"$f":"VLOOKUP(A710,'Product-tool'!A:B,2,0)","v":{"$error":"#N/A"}},{"$f":"Orders!B710/VLOOKUP(B710,Tools!A:C,3,0)","v":{"$error":"#N/A"}},{"$f":"Orders!C710/VLOOKUP(B710,Tools!A:C,3,0)","v":{"$error":"#N/A"}},{"$f":"Orders!D710/VLOOKUP(B710,Tools!A:C,3,0)","v":{"$error":"#N/A"}}]
[{"$f":"Orders!A711","v":0},{"$f":"VLOOKUP(A711,'Product-tool'!A:B,2,0)","v":{"$error":"#N/A"}},{"$f":"Orders!B711/VLOOKUP(B711,Tools!A:C,3,0)","v":{"$error":"#N/A"}},{"$f":"Orders!C711/VLOOKUP(B711,Tools!A:C,3,0)","v":{"$error":"#N/A"}},{"$f":"Orders!D711/VLOOKUP(B711,Tools!A:C,3,0)","v":{"$error":"#N/A"}}]
[{"$f":"Orders!A712","v":0},{"$f":"VLOOKUP(A712,'Product-tool'!A:B,2,0)","v":{"$error":"#N/A"}},{"$f":"Orders!B712/VLOOKUP(B712,Tools!A:C,3,0)","v":{"$error":"#N/A"}},{"$f":"Orders!C712/VLOOKUP(B712,Tools!A:C,3,0)","v":{"$error":"#N/A"}},{"$f":"Orders!D712/VLOOKUP(B712,Tools!A:C,3,0)","v":{"$error":"#N/A"}}]
[{"$f":"Orders!A713","v":0},{"$f":"VLOOKUP(A713,'Product-tool'!A:B,2,0)","v":{"$error":"#N/A"}},{"$f":"Orders!B713/VLOOKUP(B713,Tools!A:C,3,0)","v":{"$error":"#N/A"}},{"$f":"Orders!C713/VLOOKUP(B713,Tools!A:C,3,0)","v":{"$error":"#N/A"}},{"$f":"Orders!D713/VLOOKUP(B713,Tools!A:C,3,0)","v":{"$error":"#N/A"}}]
[{"$f":"Orders!A714","v":0},{"$f":"VLOOKUP(A714,'Product-tool'!A:B,2,0)","v":{"$error":"#N/A"}},{"$f":"Orders!B714/VLOOKUP(B714,Tools!A:C,3,0)","v":{"$error":"#N/A"}},{"$f":"Orders!C714/VLOOKUP(B714,Tools!A:C,3,0)","v":{"$error":"#N/A"}},{"$f":"Orders!D714/VLOOKUP(B714,Tools!A:C,3,0)","v":{"$error":"#N/A"}}]
[{"$f":"Orders!A715","v":0},{"$f":"VLOOKUP(A715,'Product-tool'!A:B,2,0)","v":{"$error":"#N/A"}},{"$f":"Orders!B715/VLOOKUP(B715,Tools!A:C,3,0)","v":{"$error":"#N/A"}},{"$f":"Orders!C715/VLOOKUP(B715,Tools!A:C,3,0)","v":{"$error":"#N/A"}},{"$f":"Orders!D715/VLOOKUP(B715,Tools!A:C,3,0)","v":{"$error":"#N/A"}}]
[{"$f":"Orders!A716","v":0},{"$f":"VLOOKUP(A716,'Product-tool'!A:B,2,0)","v":{"$error":"#N/A"}},{"$f":"Orders!B716/VLOOKUP(B716,Tools!A:C,3,0)","v":{"$error":"#N/A"}},{"$f":"Orders!C716/VLOOKUP(B716,Tools!A:C,3,0)","v":{"$error":"#N/A"}},{"$f":"Orders!D716/VLOOKUP(B716,Tools!A:C,3,0)","v":{"$error":"#N/A"}}]
[{"$f":"Orders!A717","v":0},{"$f":"VLOOKUP(A717,'Product-tool'!A:B,2,0)","v":{"$error":"#N/A"}},{"$f":"Orders!B717/VLOOKUP(B717,Tools!A:C,3,0)","v":{"$error":"#N/A"}},{"$f":"Orders!C717/VLOOKUP(B717,Tools!A:C,3,0)","v":{"$error":"#N/A"}},{"$f":"Orders!D717/VLOOKUP(B717,Tools!A:C,3,0)","v":{"$error":"#N/A"}}]
[{"$f":"Orders!A718","v":0},{"$f":"VLOOKUP(A718,'Product-tool'!A:B,2,0)","v":{"$error":"#N/A"}},{"$f":"Orders!B718/VLOOKUP(B718,Tools!A:C,3,0)","v":{"$error":"#N/A"}},{"$f":"Orders!C718/VLOOKUP(B718,Tools!A:C,3,0)","v":{"$error":"#N/A"}},{"$f":"Orders!D718/VLOOKUP(B718,Tools!A:C,3,0)","v":{"$error":"#N/A"}}]
[{"$f":"Orders!A719","v":0},{"$f":"VLOOKUP(A719,'Product-tool'!A:B,2,0)","v":{"$error":"#N/A"}},{"$f":"Orders!B719/VLOOKUP(B719,Tools!A:C,3,0)","v":{"$error":"#N/A"}},{"$f":"Orders!C719/VLOOKUP(B719,Tools!A:C,3,0)","v":{"$error":"#N/A"}},{"$f":"Orders!D719/VLOOKUP(B719,Tools!A:C,3,0)","v":{"$error":"#N/A"}}]
[{"$f":"Orders!A720","v":0},{"$f":"VLOOKUP(A720,'Product-tool'!A:B,2,0)","v":{"$error":"#N/A"}},{"$f":"Orders!B720/VLOOKUP(B720,Tools!A:C,3,0)","v":{"$error":"#N/A"}},{"$f":"Orders!C720/VLOOKUP(B720,Tools!A:C,3,0)","v":{"$error":"#N/A"}},{"$f":"Orders!D720/VLOOKUP(B720,Tools!A:C,3,0)","v":{"$error":"#N/A"}}]
[{"$f":"Orders!A721","v":0},{"$f":"VLOOKUP(A721,'Product-tool'!A:B,2,0)","v":{"$error":"#N/A"}},{"$f":"Orders!B721/VLOOKUP(B721,Tools!A:C,3,0)","v":{"$error":"#N/A"}},{"$f":"Orders!C721/VLOOKUP(B721,Tools!A:C,3,0)","v":{"$error":"#N/A"}},{"$f":"Orders!D721/VLOOKUP(B721,Tools!A:C,3,0)","v":{"$error":"#N/A"}}]
[{"$f":"Orders!A722","v":0},{"$f":"VLOOKUP(A722,'Product-tool'!A:B,2,0)","v":{"$error":"#N/A"}},{"$f":"Orders!B722/VLOOKUP(B722,Tools!A:C,3,0)","v":{"$error":"#N/A"}},{"$f":"Orders!C722/VLOOKUP(B722,Tools!A:C,3,0)","v":{"$error":"#N/A"}},{"$f":"Orders!D722/VLOOKUP(B722,Tools!A:C,3,0)","v":{"$error":"#N/A"}}]
[{"$f":"Orders!A723","v":0},{"$f":"VLOOKUP(A723,'Product-tool'!A:B,2,0)","v":{"$error":"#N/A"}},{"$f":"Orders!B723/VLOOKUP(B723,Tools!A:C,3,0)","v":{"$error":"#N/A"}},{"$f":"Orders!C723/VLOOKUP(B723,Tools!A:C,3,0)","v":{"$error":"#N/A"}},{"$f":"Orders!D723/VLOOKUP(B723,Tools!A:C,3,0)","v":{"$error":"#N/A"}}]
[{"$f":"Orders!A724","v":0},{"$f":"VLOOKUP(A724,'Product-tool'!A:B,2,0)","v":{"$error":"#N/A"}},{"$f":"Orders!B724/VLOOKUP(B724,Tools!A:C,3,0)","v":{"$error":"#N/A"}},{"$f":"Orders!C724/VLOOKUP(B724,Tools!A:C,3,0)","v":{"$error":"#N/A"}},{"$f":"Orders!D724/VLOOKUP(B724,Tools!A:C,3,0)","v":{"$error":"#N/A"}}]
[{"$f":"Orders!A725","v":0},{"$f":"VLOOKUP(A725,'Product-tool'!A:B,2,0)","v":{"$error":"#N/A"}},{"$f":"Orders!B725/VLOOKUP(B725,Tools!A:C,3,0)","v":{"$error":"#N/A"}},{"$f":"Orders!C725/VLOOKUP(B725,Tools!A:C,3,0)","v":{"$error":"#N/A"}},{"$f":"Orders!D725/VLOOKUP(B725,Tools!A:C,3,0)","v":{"$error":"#N/A"}}]
[{"$f":"Orders!A726","v":0},{"$f":"VLOOKUP(A726,'Product-tool'!A:B,2,0)","v":{"$error":"#N/A"}},{"$f":"Orders!B726/VLOOKUP(B726,Tools!A:C,3,0)","v":{"$error":"#N/A"}},{"$f":"Orders!C726/VLOOKUP(B726,Tools!A:C,3,0)","v":{"$error":"#N/A"}},{"$f":"Orders!D726/VLOOKUP(B726,Tools!A:C,3,0)","v":{"$error":"#N/A"}}]
[{"$f":"Orders!A727","v":0},{"$f":"VLOOKUP(A727,'Product-tool'!A:B,2,0)","v":{"$error":"#N/A"}},{"$f":"Orders!B727/VLOOKUP(B727,Tools!A:C,3,0)","v":{"$error":"#N/A"}},{"$f":"Orders!C727/VLOOKUP(B727,Tools!A:C,3,0)","v":{"$error":"#N/A"}},{"$f":"Orders!D727/VLOOKUP(B727,Tools!A:C,3,0)","v":{"$error":"#N/A"}}]
[{"$f":"Orders!A728","v":0},{"$f":"VLOOKUP(A728,'Product-tool'!A:B,2,0)","v":{"$error":"#N/A"}},{"$f":"Orders!B728/VLOOKUP(B728,Tools!A:C,3,0)","v":{"$error":"#N/A"}},{"$f":"Orders!C728/VLOOKUP(B728,Tools!A:C,3,0)","v":{"$error":"#N/A"}},{"$f":"Orders!D728/VLOOKUP(B728,Tools!A:C,3,0)","v":{"$error":"#N/A"}}]
[{"$f":"Orders!A729","v":0},{"$f":"VLOOKUP(A729,'Product-tool'!A:B,2,0)","v":{"$error":"#N/A"}},{"$f":"Orders!B729/VLOOKUP(B729,Tools!A:C,3,0)","v":{"$error":"#N/A"}},{"$f":"Orders!C729/VLOOKUP(B729,Tools!A:C,3,0)","v":{"$error":"#N/A"}},{"$f":"Orders!D729/VLOOKUP(B729,Tools!A:C,3,0)","v":{"$error":"#N/A"}}]
[{"$f":"Orders!A730","v":0},{"$f":"VLOOKUP(A730,'Product-tool'!A:B,2,0)","v":{"$error":"#N/A"}},{"$f":"Orders!B730/VLOOKUP(B730,Tools!A:C,3,0)","v":{"$error":"#N/A"}},{"$f":"Orders!C730/VLOOKUP(B730,Tools!A:C,3,0)","v":{"$error":"#N/A"}},{"$f":"Orders!D730/VLOOKUP(B730,Tools!A:C,3,0)","v":{"$error":"#N/A"}}]
[{"$f":"Orders!A731","v":0},{"$f":"VLOOKUP(A731,'Product-tool'!A:B,2,0)","v":{"$error":"#N/A"}},{"$f":"Orders!B731/VLOOKUP(B731,Tools!A:C,3,0)","v":{"$error":"#N/A"}},{"$f":"Orders!C731/VLOOKUP(B731,Tools!A:C,3,0)","v":{"$error":"#N/A"}},{"$f":"Orders!D731/VLOOKUP(B731,Tools!A:C,3,0)","v":{"$error":"#N/A"}}]
[{"$f":"Orders!A732","v":0},{"$f":"VLOOKUP(A732,'Product-tool'!A:B,2,0)","v":{"$error":"#N/A"}},{"$f":"Orders!B732/VLOOKUP(B732,Tools!A:C,3,0)","v":{"$error":"#N/A"}},{"$f":"Orders!C732/VLOOKUP(B732,Tools!A:C,3,0)","v":{"$error":"#N/A"}},{"$f":"Orders!D732/VLOOKUP(B732,Tools!A:C,3,0)","v":{"$error":"#N/A"}}]
[{"$f":"Orders!A733","v":0},{"$f":"VLOOKUP(A733,'Product-tool'!A:B,2,0)","v":{"$error":"#N/A"}},{"$f":"Orders!B733/VLOOKUP(B733,Tools!A:C,3,0)","v":{"$error":"#N/A"}},{"$f":"Orders!C733/VLOOKUP(B733,Tools!A:C,3,0)","v":{"$error":"#N/A"}},{"$f":"Orders!D733/VLOOKUP(B733,Tools!A:C,3,0)","v":{"$error":"#N/A"}}]
[{"$f":"Orders!A734","v":0},{"$f":"VLOOKUP(A734,'Product-tool'!A:B,2,0)","v":{"$error":"#N/A"}},{"$f":"Orders!B734/VLOOKUP(B734,Tools!A:C,3,0)","v":{"$error":"#N/A"}},{"$f":"Orders!C734/VLOOKUP(B734,Tools!A:C,3,0)","v":{"$error":"#N/A"}},{"$f":"Orders!D734/VLOOKUP(B734,Tools!A:C,3,0)","v":{"$error":"#N/A"}}]
[{"$f":"Orders!A735","v":0},{"$f":"VLOOKUP(A735,'Product-tool'!A:B,2,0)","v":{"$error":"#N/A"}},{"$f":"Orders!B735/VLOOKUP(B735,Tools!A:C,3,0)","v":{"$error":"#N/A"}},{"$f":"Orders!C735/VLOOKUP(B735,Tools!A:C,3,0)","v":{"$error":"#N/A"}},{"$f":"Orders!D735/VLOOKUP(B735,Tools!A:C,3,0)","v":{"$error":"#N/A"}}]
[{"$f":"Orders!A736","v":0},{"$f":"VLOOKUP(A736,'Product-tool'!A:B,2,0)","v":{"$error":"#N/A"}},{"$f":"Orders!B736/VLOOKUP(B736,Tools!A:C,3,0)","v":{"$error":"#N/A"}},{"$f":"Orders!C736/VLOOKUP(B736,Tools!A:C,3,0)","v":{"$error":"#N/A"}},{"$f":"Orders!D736/VLOOKUP(B736,Tools!A:C,3,0)","v":{"$error":"#N/A"}}]
[{"$f":"Orders!A737","v":0},{"$f":"VLOOKUP(A737,'Product-tool'!A:B,2,0)","v":{"$error":"#N/A"}},{"$f":"Orders!B737/VLOOKUP(B737,Tools!A:C,3,0)","v":{"$error":"#N/A"}},{"$f":"Orders!C737/VLOOKUP(B737,Tools!A:C,3,0)","v":{"$error":"#N/A"}},{"$f":"Orders!D737/VLOOKUP(B737,Tools!A:C,3,0)","v":{"$error":"#N/A"}}]
[{"$f":"Orders!A738","v":0},{"$f":"VLOOKUP(A738,'Product-tool'!A:B,2,0)","v":{"$error":"#N/A"}},{"$f":"Orders!B738/VLOOKUP(B738,Tools!A:C,3,0)","v":{"$error":"#N/A"}},{"$f":"Orders!C738/VLOOKUP(B738,Tools!A:C,3,0)","v":{"$error":"#N/A"}},{"$f":"Orders!D738/VLOOKUP(B738,Tools!A:C,3,0)","v":{"$error":"#N/A"}}]
[{"$f":"Orders!A739","v":0},{"$f":"VLOOKUP(A739,'Product-tool'!A:B,2,0)","v":{"$error":"#N/A"}},{"$f":"Orders!B739/VLOOKUP(B739,Tools!A:C,3,0)","v":{"$error":"#N/A"}},{"$f":"Orders!C739/VLOOKUP(B739,Tools!A:C,3,0)","v":{"$error":"#N/A"}},{"$f":"Orders!D739/VLOOKUP(B739,Tools!A:C,3,0)","v":{"$error":"#N/A"}}]
[{"$f":"Orders!A740","v":0},{"$f":"VLOOKUP(A740,'Product-tool'!A:B,2,0)","v":{"$error":"#N/A"}},{"$f":"Orders!B740/VLOOKUP(B740,Tools!A:C,3,0)","v":{"$error":"#N/A"}},{"$f":"Orders!C740/VLOOKUP(B740,Tools!A:C,3,0)","v":{"$error":"#N/A"}},{"$f":"Orders!D740/VLOOKUP(B740,Tools!A:C,3,0)","v":{"$error":"#N/A"}}]
[{"$f":"Orders!A741","v":0},{"$f":"VLOOKUP(A741,'Product-tool'!A:B,2,0)","v":{"$error":"#N/A"}},{"$f":"Orders!B741/VLOOKUP(B741,Tools!A:C,3,0)","v":{"$error":"#N/A"}},{"$f":"Orders!C741/VLOOKUP(B741,Tools!A:C,3,0)","v":{"$error":"#N/A"}},{"$f":"Orders!D741/VLOOKUP(B741,Tools!A:C,3,0)","v":{"$error":"#N/A"}}]
[{"$f":"Orders!A742","v":0},{"$f":"VLOOKUP(A742,'Product-tool'!A:B,2,0)","v":{"$error":"#N/A"}},{"$f":"Orders!B742/VLOOKUP(B742,Tools!A:C,3,0)","v":{"$error":"#N/A"}},{"$f":"Orders!C742/VLOOKUP(B742,Tools!A:C,3,0)","v":{"$error":"#N/A"}},{"$f":"Orders!D742/VLOOKUP(B742,Tools!A:C,3,0)","v":{"$error":"#N/A"}}]
[{"$f":"Orders!A743","v":0},{"$f":"VLOOKUP(A743,'Product-tool'!A:B,2,0)","v":{"$error":"#N/A"}},{"$f":"Orders!B743/VLOOKUP(B743,Tools!A:C,3,0)","v":{"$error":"#N/A"}},{"$f":"Orders!C743/VLOOKUP(B743,Tools!A:C,3,0)","v":{"$error":"#N/A"}},{"$f":"Orders!D743/VLOOKUP(B743,Tools!A:C,3,0)","v":{"$error":"#N/A"}}]
[{"$f":"Orders!A744","v":0},{"$f":"VLOOKUP(A744,'Product-tool'!A:B,2,0)","v":{"$error":"#N/A"}},{"$f":"Orders!B744/VLOOKUP(B744,Tools!A:C,3,0)","v":{"$error":"#N/A"}},{"$f":"Orders!C744/VLOOKUP(B744,Tools!A:C,3,0)","v":{"$error":"#N/A"}},{"$f":"Orders!D744/VLOOKUP(B744,Tools!A:C,3,0)","v":{"$error":"#N/A"}}]
[{"$f":"Orders!A745","v":0},{"$f":"VLOOKUP(A745,'Product-tool'!A:B,2,0)","v":{"$error":"#N/A"}},{"$f":"Orders!B745/VLOOKUP(B745,Tools!A:C,3,0)","v":{"$error":"#N/A"}},{"$f":"Orders!C745/VLOOKUP(B745,Tools!A:C,3,0)","v":{"$error":"#N/A"}},{"$f":"Orders!D745/VLOOKUP(B745,Tools!A:C,3,0)","v":{"$error":"#N/A"}}]
[{"$f":"Orders!A746","v":0},{"$f":"VLOOKUP(A746,'Product-tool'!A:B,2,0)","v":{"$error":"#N/A"}},{"$f":"Orders!B746/VLOOKUP(B746,Tools!A:C,3,0)","v":{"$error":"#N/A"}},{"$f":"Orders!C746/VLOOKUP(B746,Tools!A:C,3,0)","v":{"$error":"#N/A"}},{"$f":"Orders!D746/VLOOKUP(B746,Tools!A:C,3,0)","v":{"$error":"#N/A"}}]
[{"$f":"Orders!A747","v":0},{"$f":"VLOOKUP(A747,'Product-tool'!A:B,2,0)","v":{"$error":"#N/A"}},{"$f":"Orders!B747/VLOOKUP(B747,Tools!A:C,3,0)","v":{"$error":"#N/A"}},{"$f":"Orders!C747/VLOOKUP(B747,Tools!A:C,3,0)","v":{"$error":"#N/A"}},{"$f":"Orders!D747/VLOOKUP(B747,Tools!A:C,3,0)","v":{"$error":"#N/A"}}]
[{"$f":"Orders!A748","v":0},{"$f":"VLOOKUP(A748,'Product-tool'!A:B,2,0)","v":{"$error":"#N/A"}},{"$f":"Orders!B748/VLOOKUP(B748,Tools!A:C,3,0)","v":{"$error":"#N/A"}},{"$f":"Orders!C748/VLOOKUP(B748,Tools!A:C,3,0)","v":{"$error":"#N/A"}},{"$f":"Orders!D748/VLOOKUP(B748,Tools!A:C,3,0)","v":{"$error":"#N/A"}}]
[{"$f":"Orders!A749","v":0},{"$f":"VLOOKUP(A749,'Product-tool'!A:B,2,0)","v":{"$error":"#N/A"}},{"$f":"Orders!B749/VLOOKUP(B749,Tools!A:C,3,0)","v":{"$error":"#N/A"}},{"$f":"Orders!C749/VLOOKUP(B749,Tools!A:C,3,0)","v":{"$error":"#N/A"}},{"$f":"Orders!D749/VLOOKUP(B749,Tools!A:C,3,0)","v":{"$error":"#N/A"}}]
[{"$f":"Orders!A750","v":0},{"$f":"VLOOKUP(A750,'Product-tool'!A:B,2,0)","v":{"$error":"#N/A"}},{"$f":"Orders!B750/VLOOKUP(B750,Tools!A:C,3,0)","v":{"$error":"#N/A"}},{"$f":"Orders!C750/VLOOKUP(B750,Tools!A:C,3,0)","v":{"$error":"#N/A"}},{"$f":"Orders!D750/VLOOKUP(B750,Tools!A:C,3,0)","v":{"$error":"#N/A"}}]
[{"$f":"Orders!A751","v":0},{"$f":"VLOOKUP(A751,'Product-tool'!A:B,2,0)","v":{"$error":"#N/A"}},{"$f":"Orders!B751/VLOOKUP(B751,Tools!A:C,3,0)","v":{"$error":"#N/A"}},{"$f":"Orders!C751/VLOOKUP(B751,Tools!A:C,3,0)","v":{"$error":"#N/A"}},{"$f":"Orders!D751/VLOOKUP(B751,Tools!A:C,3,0)","v":{"$error":"#N/A"}}]
[{"$f":"Orders!A752","v":0},{"$f":"VLOOKUP(A752,'Product-tool'!A:B,2,0)","v":{"$error":"#N/A"}},{"$f":"Orders!B752/VLOOKUP(B752,Tools!A:C,3,0)","v":{"$error":"#N/A"}},{"$f":"Orders!C752/VLOOKUP(B752,Tools!A:C,3,0)","v":{"$error":"#N/A"}},{"$f":"Orders!D752/VLOOKUP(B752,Tools!A:C,3,0)","v":{"$error":"#N/A"}}]
[{"$f":"Orders!A753","v":0},{"$f":"VLOOKUP(A753,'Product-tool'!A:B,2,0)","v":{"$error":"#N/A"}},{"$f":"Orders!B753/VLOOKUP(B753,Tools!A:C,3,0)","v":{"$error":"#N/A"}},{"$f":"Orders!C753/VLOOKUP(B753,Tools!A:C,3,0)","v":{"$error":"#N/A"}},{"$f":"Orders!D753/VLOOKUP(B753,Tools!A:C,3,0)","v":{"$error":"#N/A"}}]
[{"$f":"Orders!A754","v":0},{"$f":"VLOOKUP(A754,'Product-tool'!A:B,2,0)","v":{"$error":"#N/A"}},{"$f":"Orders!B754/VLOOKUP(B754,Tools!A:C,3,0)","v":{"$error":"#N/A"}},{"$f":"Orders!C754/VLOOKUP(B754,Tools!A:C,3,0)","v":{"$error":"#N/A"}},{"$f":"Orders!D754/VLOOKUP(B754,Tools!A:C,3,0)","v":{"$error":"#N/A"}}]
[{"$f":"Orders!A755","v":0},{"$f":"VLOOKUP(A755,'Product-tool'!A:B,2,0)","v":{"$error":"#N/A"}},{"$f":"Orders!B755/VLOOKUP(B755,Tools!A:C,3,0)","v":{"$error":"#N/A"}},{"$f":"Orders!C755/VLOOKUP(B755,Tools!A:C,3,0)","v":{"$error":"#N/A"}},{"$f":"Orders!D755/VLOOKUP(B755,Tools!A:C,3,0)","v":{"$error":"#N/A"}}]
[{"$f":"Orders!A756","v":0},{"$f":"VLOOKUP(A756,'Product-tool'!A:B,2,0)","v":{"$error":"#N/A"}},{"$f":"Orders!B756/VLOOKUP(B756,Tools!A:C,3,0)","v":{"$error":"#N/A"}},{"$f":"Orders!C756/VLOOKUP(B756,Tools!A:C,3,0)","v":{"$error":"#N/A"}},{"$f":"Orders!D756/VLOOKUP(B756,Tools!A:C,3,0)","v":{"$error":"#N/A"}}]
[{"$f":"Orders!A757","v":0},{"$f":"VLOOKUP(A757,'Product-tool'!A:B,2,0)","v":{"$error":"#N/A"}},{"$f":"Orders!B757/VLOOKUP(B757,Tools!A:C,3,0)","v":{"$error":"#N/A"}},{"$f":"Orders!C757/VLOOKUP(B757,Tools!A:C,3,0)","v":{"$error":"#N/A"}},{"$f":"Orders!D757/VLOOKUP(B757,Tools!A:C,3,0)","v":{"$error":"#N/A"}}]
[{"$f":"Orders!A758","v":0},{"$f":"VLOOKUP(A758,'Product-tool'!A:B,2,0)","v":{"$error":"#N/A"}},{"$f":"Orders!B758/VLOOKUP(B758,Tools!A:C,3,0)","v":{"$error":"#N/A"}},{"$f":"Orders!C758/VLOOKUP(B758,Tools!A:C,3,0)","v":{"$error":"#N/A"}},{"$f":"Orders!D758/VLOOKUP(B758,Tools!A:C,3,0)","v":{"$error":"#N/A"}}]
[{"$f":"Orders!A759","v":0},{"$f":"VLOOKUP(A759,'Product-tool'!A:B,2,0)","v":{"$error":"#N/A"}},{"$f":"Orders!B759/VLOOKUP(B759,Tools!A:C,3,0)","v":{"$error":"#N/A"}},{"$f":"Orders!C759/VLOOKUP(B759,Tools!A:C,3,0)","v":{"$error":"#N/A"}},{"$f":"Orders!D759/VLOOKUP(B759,Tools!A:C,3,0)","v":{"$error":"#N/A"}}]
[{"$f":"Orders!A760","v":0},{"$f":"VLOOKUP(A760,'Product-tool'!A:B,2,0)","v":{"$error":"#N/A"}},{"$f":"Orders!B760/VLOOKUP(B760,Tools!A:C,3,0)","v":{"$error":"#N/A"}},{"$f":"Orders!C760/VLOOKUP(B760,Tools!A:C,3,0)","v":{"$error":"#N/A"}},{"$f":"Orders!D760/VLOOKUP(B760,Tools!A:C,3,0)","v":{"$error":"#N/A"}}]
[{"$f":"Orders!A761","v":0},{"$f":"VLOOKUP(A761,'Product-tool'!A:B,2,0)","v":{"$error":"#N/A"}},{"$f":"Orders!B761/VLOOKUP(B761,Tools!A:C,3,0)","v":{"$error":"#N/A"}},{"$f":"Orders!C761/VLOOKUP(B761,Tools!A:C,3,0)","v":{"$error":"#N/A"}},{"$f":"Orders!D761/VLOOKUP(B761,Tools!A:C,3,0)","v":{"$error":"#N/A"}}]
[{"$f":"Orders!A762","v":0},{"$f":"VLOOKUP(A762,'Product-tool'!A:B,2,0)","v":{"$error":"#N/A"}},{"$f":"Orders!B762/VLOOKUP(B762,Tools!A:C,3,0)","v":{"$error":"#N/A"}},{"$f":"Orders!C762/VLOOKUP(B762,Tools!A:C,3,0)","v":{"$error":"#N/A"}},{"$f":"Orders!D762/VLOOKUP(B762,Tools!A:C,3,0)","v":{"$error":"#N/A"}}]
[{"$f":"Orders!A763","v":0},{"$f":"VLOOKUP(A763,'Product-tool'!A:B,2,0)","v":{"$error":"#N/A"}},{"$f":"Orders!B763/VLOOKUP(B763,Tools!A:C,3,0)","v":{"$error":"#N/A"}},{"$f":"Orders!C763/VLOOKUP(B763,Tools!A:C,3,0)","v":{"$error":"#N/A"}},{"$f":"Orders!D763/VLOOKUP(B763,Tools!A:C,3,0)","v":{"$error":"#N/A"}}]
[{"$f":"Orders!A764","v":0},{"$f":"VLOOKUP(A764,'Product-tool'!A:B,2,0)","v":{"$error":"#N/A"}},{"$f":"Orders!B764/VLOOKUP(B764,Tools!A:C,3,0)","v":{"$error":"#N/A"}},{"$f":"Orders!C764/VLOOKUP(B764,Tools!A:C,3,0)","v":{"$error":"#N/A"}},{"$f":"Orders!D764/VLOOKUP(B764,Tools!A:C,3,0)","v":{"$error":"#N/A"}}]
[{"$f":"Orders!A765","v":0},{"$f":"VLOOKUP(A765,'Product-tool'!A:B,2,0)","v":{"$error":"#N/A"}},{"$f":"Orders!B765/VLOOKUP(B765,Tools!A:C,3,0)","v":{"$error":"#N/A"}},{"$f":"Orders!C765/VLOOKUP(B765,Tools!A:C,3,0)","v":{"$error":"#N/A"}},{"$f":"Orders!D765/VLOOKUP(B765,Tools!A:C,3,0)","v":{"$error":"#N/A"}}]
[{"$f":"Orders!A766","v":0},{"$f":"VLOOKUP(A766,'Product-tool'!A:B,2,0)","v":{"$error":"#N/A"}},{"$f":"Orders!B766/VLOOKUP(B766,Tools!A:C,3,0)","v":{"$error":"#N/A"}},{"$f":"Orders!C766/VLOOKUP(B766,Tools!A:C,3,0)","v":{"$error":"#N/A"}},{"$f":"Orders!D766/VLOOKUP(B766,Tools!A:C,3,0)","v":{"$error":"#N/A"}}]
[{"$f":"Orders!A767","v":0},{"$f":"VLOOKUP(A767,'Product-tool'!A:B,2,0)","v":{"$error":"#N/A"}},{"$f":"Orders!B767/VLOOKUP(B767,Tools!A:C,3,0)","v":{"$error":"#N/A"}},{"$f":"Orders!C767/VLOOKUP(B767,Tools!A:C,3,0)","v":{"$error":"#N/A"}},{"$f":"Orders!D767/VLOOKUP(B767,Tools!A:C,3,0)","v":{"$error":"#N/A"}}]
[{"$f":"Orders!A768","v":0},{"$f":"VLOOKUP(A768,'Product-tool'!A:B,2,0)","v":{"$error":"#N/A"}},{"$f":"Orders!B768/VLOOKUP(B768,Tools!A:C,3,0)","v":{"$error":"#N/A"}},{"$f":"Orders!C768/VLOOKUP(B768,Tools!A:C,3,0)","v":{"$error":"#N/A"}},{"$f":"Orders!D768/VLOOKUP(B768,Tools!A:C,3,0)","v":{"$error":"#N/A"}}]
[{"$f":"Orders!A769","v":0},{"$f":"VLOOKUP(A769,'Product-tool'!A:B,2,0)","v":{"$error":"#N/A"}},{"$f":"Orders!B769/VLOOKUP(B769,Tools!A:C,3,0)","v":{"$error":"#N/A"}},{"$f":"Orders!C769/VLOOKUP(B769,Tools!A:C,3,0)","v":{"$error":"#N/A"}},{"$f":"Orders!D769/VLOOKUP(B769,Tools!A:C,3,0)","v":{"$error":"#N/A"}}]
[{"$f":"Orders!A770","v":0},{"$f":"VLOOKUP(A770,'Product-tool'!A:B,2,0)","v":{"$error":"#N/A"}},{"$f":"Orders!B770/VLOOKUP(B770,Tools!A:C,3,0)","v":{"$error":"#N/A"}},{"$f":"Orders!C770/VLOOKUP(B770,Tools!A:C,3,0)","v":{"$error":"#N/A"}},{"$f":"Orders!D770/VLOOKUP(B770,Tools!A:C,3,0)","v":{"$error":"#N/A"}}]
[{"$f":"Orders!A771","v":0},{"$f":"VLOOKUP(A771,'Product-tool'!A:B,2,0)","v":{"$error":"#N/A"}},{"$f":"Orders!B771/VLOOKUP(B771,Tools!A:C,3,0)","v":{"$error":"#N/A"}},{"$f":"Orders!C771/VLOOKUP(B771,Tools!A:C,3,0)","v":{"$error":"#N/A"}},{"$f":"Orders!D771/VLOOKUP(B771,Tools!A:C,3,0)","v":{"$error":"#N/A"}}]
[{"$f":"Orders!A772","v":0},{"$f":"VLOOKUP(A772,'Product-tool'!A:B,2,0)","v":{"$error":"#N/A"}},{"$f":"Orders!B772/VLOOKUP(B772,Tools!A:C,3,0)","v":{"$error":"#N/A"}},{"$f":"Orders!C772/VLOOKUP(B772,Tools!A:C,3,0)","v":{"$error":"#N/A"}},{"$f":"Orders!D772/VLOOKUP(B772,Tools!A:C,3,0)","v":{"$error":"#N/A"}}]
[{"$f":"Orders!A773","v":0},{"$f":"VLOOKUP(A773,'Product-tool'!A:B,2,0)","v":{"$error":"#N/A"}},{"$f":"Orders!B773/VLOOKUP(B773,Tools!A:C,3,0)","v":{"$error":"#N/A"}},{"$f":"Orders!C773/VLOOKUP(B773,Tools!A:C,3,0)","v":{"$error":"#N/A"}},{"$f":"Orders!D773/VLOOKUP(B773,Tools!A:C,3,0)","v":{"$error":"#N/A"}}]
[{"$f":"Orders!A774","v":0},{"$f":"VLOOKUP(A774,'Product-tool'!A:B,2,0)","v":{"$error":"#N/A"}},{"$f":"Orders!B774/VLOOKUP(B774,Tools!A:C,3,0)","v":{"$error":"#N/A"}},{"$f":"Orders!C774/VLOOKUP(B774,Tools!A:C,3,0)","v":{"$error":"#N/A"}},{"$f":"Orders!D774/VLOOKUP(B774,Tools!A:C,3,0)","v":{"$error":"#N/A"}}]
[{"$f":"Orders!A775","v":0},{"$f":"VLOOKUP(A775,'Product-tool'!A:B,2,0)","v":{"$error":"#N/A"}},{"$f":"Orders!B775/VLOOKUP(B775,Tools!A:C,3,0)","v":{"$error":"#N/A"}},{"$f":"Orders!C775/VLOOKUP(B775,Tools!A:C,3,0)","v":{"$error":"#N/A"}},{"$f":"Orders!D775/VLOOKUP(B775,Tools!A:C,3,0)","v":{"$error":"#N/A"}}]
[{"$f":"Orders!A776","v":0},{"$f":"VLOOKUP(A776,'Product-tool'!A:B,2,0)","v":{"$error":"#N/A"}},{"$f":"Orders!B776/VLOOKUP(B776,Tools!A:C,3,0)","v":{"$error":"#N/A"}},{"$f":"Orders!C776/VLOOKUP(B776,Tools!A:C,3,0)","v":{"$error":"#N/A"}},{"$f":"Orders!D776/VLOOKUP(B776,Tools!A:C,3,0)","v":{"$error":"#N/A"}}]
[{"$f":"Orders!A777","v":0},{"$f":"VLOOKUP(A777,'Product-tool'!A:B,2,0)","v":{"$error":"#N/A"}},{"$f":"Orders!B777/VLOOKUP(B777,Tools!A:C,3,0)","v":{"$error":"#N/A"}},{"$f":"Orders!C777/VLOOKUP(B777,Tools!A:C,3,0)","v":{"$error":"#N/A"}},{"$f":"Orders!D777/VLOOKUP(B777,Tools!A:C,3,0)","v":{"$error":"#N/A"}}]
[{"$f":"Orders!A778","v":0},{"$f":"VLOOKUP(A778,'Product-tool'!A:B,2,0)","v":{"$error":"#N/A"}},{"$f":"Orders!B778/VLOOKUP(B778,Tools!A:C,3,0)","v":{"$error":"#N/A"}},{"$f":"Orders!C778/VLOOKUP(B778,Tools!A:C,3,0)","v":{"$error":"#N/A"}},{"$f":"Orders!D778/VLOOKUP(B778,Tools!A:C,3,0)","v":{"$error":"#N/A"}}]
[{"$f":"Orders!A779","v":0},{"$f":"VLOOKUP(A779,'Product-tool'!A:B,2,0)","v":{"$error":"#N/A"}},{"$f":"Orders!B779/VLOOKUP(B779,Tools!A:C,3,0)","v":{"$error":"#N/A"}},{"$f":"Orders!C779/VLOOKUP(B779,Tools!A:C,3,0)","v":{"$error":"#N/A"}},{"$f":"Orders!D779/VLOOKUP(B779,Tools!A:C,3,0)","v":{"$error":"#N/A"}}]
[{"$f":"Orders!A780","v":0},{"$f":"VLOOKUP(A780,'Product-tool'!A:B,2,0)","v":{"$error":"#N/A"}},{"$f":"Orders!B780/VLOOKUP(B780,Tools!A:C,3,0)","v":{"$error":"#N/A"}},{"$f":"Orders!C780/VLOOKUP(B780,Tools!A:C,3,0)","v":{"$error":"#N/A"}},{"$f":"Orders!D780/VLOOKUP(B780,Tools!A:C,3,0)","v":{"$error":"#N/A"}}]
[{"$f":"Orders!A781","v":0},{"$f":"VLOOKUP(A781,'Product-tool'!A:B,2,0)","v":{"$error":"#N/A"}},{"$f":"Orders!B781/VLOOKUP(B781,Tools!A:C,3,0)","v":{"$error":"#N/A"}},{"$f":"Orders!C781/VLOOKUP(B781,Tools!A:C,3,0)","v":{"$error":"#N/A"}},{"$f":"Orders!D781/VLOOKUP(B781,Tools!A:C,3,0)","v":{"$error":"#N/A"}}]
[{"$f":"Orders!A782","v":0},{"$f":"VLOOKUP(A782,'Product-tool'!A:B,2,0)","v":{"$error":"#N/A"}},{"$f":"Orders!B782/VLOOKUP(B782,Tools!A:C,3,0)","v":{"$error":"#N/A"}},{"$f":"Orders!C782/VLOOKUP(B782,Tools!A:C,3,0)","v":{"$error":"#N/A"}},{"$f":"Orders!D782/VLOOKUP(B782,Tools!A:C,3,0)","v":{"$error":"#N/A"}}]
[{"$f":"Orders!A783","v":0},{"$f":"VLOOKUP(A783,'Product-tool'!A:B,2,0)","v":{"$error":"#N/A"}},{"$f":"Orders!B783/VLOOKUP(B783,Tools!A:C,3,0)","v":{"$error":"#N/A"}},{"$f":"Orders!C783/VLOOKUP(B783,Tools!A:C,3,0)","v":{"$error":"#N/A"}},{"$f":"Orders!D783/VLOOKUP(B783,Tools!A:C,3,0)","v":{"$error":"#N/A"}}]
[{"$f":"Orders!A784","v":0},{"$f":"VLOOKUP(A784,'Product-tool'!A:B,2,0)","v":{"$error":"#N/A"}},{"$f":"Orders!B784/VLOOKUP(B784,Tools!A:C,3,0)","v":{"$error":"#N/A"}},{"$f":"Orders!C784/VLOOKUP(B784,Tools!A:C,3,0)","v":{"$error":"#N/A"}},{"$f":"Orders!D784/VLOOKUP(B784,Tools!A:C,3,0)","v":{"$error":"#N/A"}}]
[{"$f":"Orders!A785","v":0},{"$f":"VLOOKUP(A785,'Product-tool'!A:B,2,0)","v":{"$error":"#N/A"}},{"$f":"Orders!B785/VLOOKUP(B785,Tools!A:C,3,0)","v":{"$error":"#N/A"}},{"$f":"Orders!C785/VLOOKUP(B785,Tools!A:C,3,0)","v":{"$error":"#N/A"}},{"$f":"Orders!D785/VLOOKUP(B785,Tools!A:C,3,0)","v":{"$error":"#N/A"}}]
[{"$f":"Orders!A786","v":0},{"$f":"VLOOKUP(A786,'Product-tool'!A:B,2,0)","v":{"$error":"#N/A"}},{"$f":"Orders!B786/VLOOKUP(B786,Tools!A:C,3,0)","v":{"$error":"#N/A"}},{"$f":"Orders!C786/VLOOKUP(B786,Tools!A:C,3,0)","v":{"$error":"#N/A"}},{"$f":"Orders!D786/VLOOKUP(B786,Tools!A:C,3,0)","v":{"$error":"#N/A"}}]
[{"$f":"Orders!A787","v":0},{"$f":"VLOOKUP(A787,'Product-tool'!A:B,2,0)","v":{"$error":"#N/A"}},{"$f":"Orders!B787/VLOOKUP(B787,Tools!A:C,3,0)","v":{"$error":"#N/A"}},{"$f":"Orders!C787/VLOOKUP(B787,Tools!A:C,3,0)","v":{"$error":"#N/A"}},{"$f":"Orders!D787/VLOOKUP(B787,Tools!A:C,3,0)","v":{"$error":"#N/A"}}]
[{"$f":"Orders!A788","v":0},{"$f":"VLOOKUP(A788,'Product-tool'!A:B,2,0)","v":{"$error":"#N/A"}},{"$f":"Orders!B788/VLOOKUP(B788,Tools!A:C,3,0)","v":{"$error":"#N/A"}},{"$f":"Orders!C788/VLOOKUP(B788,Tools!A:C,3,0)","v":{"$error":"#N/A"}},{"$f":"Orders!D788/VLOOKUP(B788,Tools!A:C,3,0)","v":{"$error":"#N/A"}}]
[{"$f":"Orders!A789","v":0},{"$f":"VLOOKUP(A789,'Product-tool'!A:B,2,0)","v":{"$error":"#N/A"}},{"$f":"Orders!B789/VLOOKUP(B789,Tools!A:C,3,0)","v":{"$error":"#N/A"}},{"$f":"Orders!C789/VLOOKUP(B789,Tools!A:C,3,0)","v":{"$error":"#N/A"}},{"$f":"Orders!D789/VLOOKUP(B789,Tools!A:C,3,0)","v":{"$error":"#N/A"}}]
[{"$f":"Orders!A790","v":0},{"$f":"VLOOKUP(A790,'Product-tool'!A:B,2,0)","v":{"$error":"#N/A"}},{"$f":"Orders!B790/VLOOKUP(B790,Tools!A:C,3,0)","v":{"$error":"#N/A"}},{"$f":"Orders!C790/VLOOKUP(B790,Tools!A:C,3,0)","v":{"$error":"#N/A"}},{"$f":"Orders!D790/VLOOKUP(B790,Tools!A:C,3,0)","v":{"$error":"#N/A"}}]
[{"$f":"Orders!A791","v":0},{"$f":"VLOOKUP(A791,'Product-tool'!A:B,2,0)","v":{"$error":"#N/A"}},{"$f":"Orders!B791/VLOOKUP(B791,Tools!A:C,3,0)","v":{"$error":"#N/A"}},{"$f":"Orders!C791/VLOOKUP(B791,Tools!A:C,3,0)","v":{"$error":"#N/A"}},{"$f":"Orders!D791/VLOOKUP(B791,Tools!A:C,3,0)","v":{"$error":"#N/A"}}]
[{"$f":"Orders!A792","v":0},{"$f":"VLOOKUP(A792,'Product-tool'!A:B,2,0)","v":{"$error":"#N/A"}},{"$f":"Orders!B792/VLOOKUP(B792,Tools!A:C,3,0)","v":{"$error":"#N/A"}},{"$f":"Orders!C792/VLOOKUP(B792,Tools!A:C,3,0)","v":{"$error":"#N/A"}},{"$f":"Orders!D792/VLOOKUP(B792,Tools!A:C,3,0)","v":{"$error":"#N/A"}}]
[{"$f":"Orders!A793","v":0},{"$f":"VLOOKUP(A793,'Product-tool'!A:B,2,0)","v":{"$error":"#N/A"}},{"$f":"Orders!B793/VLOOKUP(B793,Tools!A:C,3,0)","v":{"$error":"#N/A"}},{"$f":"Orders!C793/VLOOKUP(B793,Tools!A:C,3,0)","v":{"$error":"#N/A"}},{"$f":"Orders!D793/VLOOKUP(B793,Tools!A:C,3,0)","v":{"$error":"#N/A"}}]
[{"$f":"Orders!A794","v":0},{"$f":"VLOOKUP(A794,'Product-tool'!A:B,2,0)","v":{"$error":"#N/A"}},{"$f":"Orders!B794/VLOOKUP(B794,Tools!A:C,3,0)","v":{"$error":"#N/A"}},{"$f":"Orders!C794/VLOOKUP(B794,Tools!A:C,3,0)","v":{"$error":"#N/A"}},{"$f":"Orders!D794/VLOOKUP(B794,Tools!A:C,3,0)","v":{"$error":"#N/A"}}]
[{"$f":"Orders!A795","v":0},{"$f":"VLOOKUP(A795,'Product-tool'!A:B,2,0)","v":{"$error":"#N/A"}},{"$f":"Orders!B795/VLOOKUP(B795,Tools!A:C,3,0)","v":{"$error":"#N/A"}},{"$f":"Orders!C795/VLOOKUP(B795,Tools!A:C,3,0)","v":{"$error":"#N/A"}},{"$f":"Orders!D795/VLOOKUP(B795,Tools!A:C,3,0)","v":{"$error":"#N/A"}}]
[{"$f":"Orders!A796","v":0},{"$f":"VLOOKUP(A796,'Product-tool'!A:B,2,0)","v":{"$error":"#N/A"}},{"$f":"Orders!B796/VLOOKUP(B796,Tools!A:C,3,0)","v":{"$error":"#N/A"}},{"$f":"Orders!C796/VLOOKUP(B796,Tools!A:C,3,0)","v":{"$error":"#N/A"}},{"$f":"Orders!D796/VLOOKUP(B796,Tools!A:C,3,0)","v":{"$error":"#N/A"}}]
[{"$f":"Orders!A797","v":0},{"$f":"VLOOKUP(A797,'Product-tool'!A:B,2,0)","v":{"$error":"#N/A"}},{"$f":"Orders!B797/VLOOKUP(B797,Tools!A:C,3,0)","v":{"$error":"#N/A"}},{"$f":"Orders!C797/VLOOKUP(B797,Tools!A:C,3,0)","v":{"$error":"#N/A"}},{"$f":"Orders!D797/VLOOKUP(B797,Tools!A:C,3,0)","v":{"$error":"#N/A"}}]
[{"$f":"Orders!A798","v":0},{"$f":"VLOOKUP(A798,'Product-tool'!A:B,2,0)","v":{"$error":"#N/A"}},{"$f":"Orders!B798/VLOOKUP(B798,Tools!A:C,3,0)","v":{"$error":"#N/A"}},{"$f":"Orders!C798/VLOOKUP(B798,Tools!A:C,3,0)","v":{"$error":"#N/A"}},{"$f":"Orders!D798/VLOOKUP(B798,Tools!A:C,3,0)","v":{"$error":"#N/A"}}]
[{"$f":"Orders!A799","v":0},{"$f":"VLOOKUP(A799,'Product-tool'!A:B,2,0)","v":{"$error":"#N/A"}},{"$f":"Orders!B799/VLOOKUP(B799,Tools!A:C,3,0)","v":{"$error":"#N/A"}},{"$f":"Orders!C799/VLOOKUP(B799,Tools!A:C,3,0)","v":{"$error":"#N/A"}},{"$f":"Orders!D799/VLOOKUP(B799,Tools!A:C,3,0)","v":{"$error":"#N/A"}}]
[{"$f":"Orders!A800","v":0},{"$f":"VLOOKUP(A800,'Product-tool'!A:B,2,0)","v":{"$error":"#N/A"}},{"$f":"Orders!B800/VLOOKUP(B800,Tools!A:C,3,0)","v":{"$error":"#N/A"}},{"$f":"Orders!C800/VLOOKUP(B800,Tools!A:C,3,0)","v":{"$error":"#N/A"}},{"$f":"Orders!D800/VLOOKUP(B800,Tools!A:C,3,0)","v":{"$error":"#N/A"}}]
[{"$f":"Orders!A801","v":0},{"$f":"VLOOKUP(A801,'Product-tool'!A:B,2,0)","v":{"$error":"#N/A"}},{"$f":"Orders!B801/VLOOKUP(B801,Tools!A:C,3,0)","v":{"$error":"#N/A"}},{"$f":"Orders!C801/VLOOKUP(B801,Tools!A:C,3,0)","v":{"$error":"#N/A"}},{"$f":"Orders!D801/VLOOKUP(B801,Tools!A:C,3,0)","v":{"$error":"#N/A"}}]
[{"$f":"Orders!A802","v":0},{"$f":"VLOOKUP(A802,'Product-tool'!A:B,2,0)","v":{"$error":"#N/A"}},{"$f":"Orders!B802/VLOOKUP(B802,Tools!A:C,3,0)","v":{"$error":"#N/A"}},{"$f":"Orders!C802/VLOOKUP(B802,Tools!A:C,3,0)","v":{"$error":"#N/A"}},{"$f":"Orders!D802/VLOOKUP(B802,Tools!A:C,3,0)","v":{"$error":"#N/A"}}]
[{"$f":"Orders!A803","v":0},{"$f":"VLOOKUP(A803,'Product-tool'!A:B,2,0)","v":{"$error":"#N/A"}},{"$f":"Orders!B803/VLOOKUP(B803,Tools!A:C,3,0)","v":{"$error":"#N/A"}},{"$f":"Orders!C803/VLOOKUP(B803,Tools!A:C,3,0)","v":{"$error":"#N/A"}},{"$f":"Orders!D803/VLOOKUP(B803,Tools!A:C,3,0)","v":{"$error":"#N/A"}}]
[{"$f":"Orders!A804","v":0},{"$f":"VLOOKUP(A804,'Product-tool'!A:B,2,0)","v":{"$error":"#N/A"}},{"$f":"Orders!B804/VLOOKUP(B804,Tools!A:C,3,0)","v":{"$error":"#N/A"}},{"$f":"Orders!C804/VLOOKUP(B804,Tools!A:C,3,0)","v":{"$error":"#N/A"}},{"$f":"Orders!D804/VLOOKUP(B804,Tools!A:C,3,0)","v":{"$error":"#N/A"}}]
[{"$f":"Orders!A805","v":0},{"$f":"VLOOKUP(A805,'Product-tool'!A:B,2,0)","v":{"$error":"#N/A"}},{"$f":"Orders!B805/VLOOKUP(B805,Tools!A:C,3,0)","v":{"$error":"#N/A"}},{"$f":"Orders!C805/VLOOKUP(B805,Tools!A:C,3,0)","v":{"$error":"#N/A"}},{"$f":"Orders!D805/VLOOKUP(B805,Tools!A:C,3,0)","v":{"$error":"#N/A"}}]
[{"$f":"Orders!A806","v":0},{"$f":"VLOOKUP(A806,'Product-tool'!A:B,2,0)","v":{"$error":"#N/A"}},{"$f":"Orders!B806/VLOOKUP(B806,Tools!A:C,3,0)","v":{"$error":"#N/A"}},{"$f":"Orders!C806/VLOOKUP(B806,Tools!A:C,3,0)","v":{"$error":"#N/A"}},{"$f":"Orders!D806/VLOOKUP(B806,Tools!A:C,3,0)","v":{"$error":"#N/A"}}]
[{"$f":"Orders!A807","v":0},{"$f":"VLOOKUP(A807,'Product-tool'!A:B,2,0)","v":{"$error":"#N/A"}},{"$f":"Orders!B807/VLOOKUP(B807,Tools!A:C,3,0)","v":{"$error":"#N/A"}},{"$f":"Orders!C807/VLOOKUP(B807,Tools!A:C,3,0)","v":{"$error":"#N/A"}},{"$f":"Orders!D807/VLOOKUP(B807,Tools!A:C,3,0)","v":{"$error":"#N/A"}}]
[{"$f":"Orders!A808","v":0},{"$f":"VLOOKUP(A808,'Product-tool'!A:B,2,0)","v":{"$error":"#N/A"}},{"$f":"Orders!B808/VLOOKUP(B808,Tools!A:C,3,0)","v":{"$error":"#N/A"}},{"$f":"Orders!C808/VLOOKUP(B808,Tools!A:C,3,0)","v":{"$error":"#N/A"}},{"$f":"Orders!D808/VLOOKUP(B808,Tools!A:C,3,0)","v":{"$error":"#N/A"}}]
[{"$f":"Orders!A809","v":0},{"$f":"VLOOKUP(A809,'Product-tool'!A:B,2,0)","v":{"$error":"#N/A"}},{"$f":"Orders!B809/VLOOKUP(B809,Tools!A:C,3,0)","v":{"$error":"#N/A"}},{"$f":"Orders!C809/VLOOKUP(B809,Tools!A:C,3,0)","v":{"$error":"#N/A"}},{"$f":"Orders!D809/VLOOKUP(B809,Tools!A:C,3,0)","v":{"$error":"#N/A"}}]
[{"$f":"Orders!A810","v":0},{"$f":"VLOOKUP(A810,'Product-tool'!A:B,2,0)","v":{"$error":"#N/A"}},{"$f":"Orders!B810/VLOOKUP(B810,Tools!A:C,3,0)","v":{"$error":"#N/A"}},{"$f":"Orders!C810/VLOOKUP(B810,Tools!A:C,3,0)","v":{"$error":"#N/A"}},{"$f":"Orders!D810/VLOOKUP(B810,Tools!A:C,3,0)","v":{"$error":"#N/A"}}]
[{"$f":"Orders!A811","v":0},{"$f":"VLOOKUP(A811,'Product-tool'!A:B,2,0)","v":{"$error":"#N/A"}},{"$f":"Orders!B811/VLOOKUP(B811,Tools!A:C,3,0)","v":{"$error":"#N/A"}},{"$f":"Orders!C811/VLOOKUP(B811,Tools!A:C,3,0)","v":{"$error":"#N/A"}},{"$f":"Orders!D811/VLOOKUP(B811,Tools!A:C,3,0)","v":{"$error":"#N/A"}}]
[{"$f":"Orders!A812","v":0},{"$f":"VLOOKUP(A812,'Product-tool'!A:B,2,0)","v":{"$error":"#N/A"}},{"$f":"Orders!B812/VLOOKUP(B812,Tools!A:C,3,0)","v":{"$error":"#N/A"}},{"$f":"Orders!C812/VLOOKUP(B812,Tools!A:C,3,0)","v":{"$error":"#N/A"}},{"$f":"Orders!D812/VLOOKUP(B812,Tools!A:C,3,0)","v":{"$error":"#N/A"}}]
[{"$f":"Orders!A813","v":0},{"$f":"VLOOKUP(A813,'Product-tool'!A:B,2,0)","v":{"$error":"#N/A"}},{"$f":"Orders!B813/VLOOKUP(B813,Tools!A:C,3,0)","v":{"$error":"#N/A"}},{"$f":"Orders!C813/VLOOKUP(B813,Tools!A:C,3,0)","v":{"$error":"#N/A"}},{"$f":"Orders!D813/VLOOKUP(B813,Tools!A:C,3,0)","v":{"$error":"#N/A"}}]
[{"$f":"Orders!A814","v":0},{"$f":"VLOOKUP(A814,'Product-tool'!A:B,2,0)","v":{"$error":"#N/A"}},{"$f":"Orders!B814/VLOOKUP(B814,Tools!A:C,3,0)","v":{"$error":"#N/A"}},{"$f":"Orders!C814/VLOOKUP(B814,Tools!A:C,3,0)","v":{"$error":"#N/A"}},{"$f":"Orders!D814/VLOOKUP(B814,Tools!A:C,3,0)","v":{"$error":"#N/A"}}]
[{"$f":"Orders!A815","v":0},{"$f":"VLOOKUP(A815,'Product-tool'!A:B,2,0)","v":{"$error":"#N/A"}},{"$f":"Orders!B815/VLOOKUP(B815,Tools!A:C,3,0)","v":{"$error":"#N/A"}},{"$f":"Orders!C815/VLOOKUP(B815,Tools!A:C,3,0)","v":{"$error":"#N/A"}},{"$f":"Orders!D815/VLOOKUP(B815,Tools!A:C,3,0)","v":{"$error":"#N/A"}}]
[{"$f":"Orders!A816","v":0},{"$f":"VLOOKUP(A816,'Product-tool'!A:B,2,0)","v":{"$error":"#N/A"}},{"$f":"Orders!B816/VLOOKUP(B816,Tools!A:C,3,0)","v":{"$error":"#N/A"}},{"$f":"Orders!C816/VLOOKUP(B816,Tools!A:C,3,0)","v":{"$error":"#N/A"}},{"$f":"Orders!D816/VLOOKUP(B816,Tools!A:C,3,0)","v":{"$error":"#N/A"}}]
[{"$f":"Orders!A817","v":0},{"$f":"VLOOKUP(A817,'Product-tool'!A:B,2,0)","v":{"$error":"#N/A"}},{"$f":"Orders!B817/VLOOKUP(B817,Tools!A:C,3,0)","v":{"$error":"#N/A"}},{"$f":"Orders!C817/VLOOKUP(B817,Tools!A:C,3,0)","v":{"$error":"#N/A"}},{"$f":"Orders!D817/VLOOKUP(B817,Tools!A:C,3,0)","v":{"$error":"#N/A"}}]
[{"$f":"Orders!A818","v":0},{"$f":"VLOOKUP(A818,'Product-tool'!A:B,2,0)","v":{"$error":"#N/A"}},{"$f":"Orders!B818/VLOOKUP(B818,Tools!A:C,3,0)","v":{"$error":"#N/A"}},{"$f":"Orders!C818/VLOOKUP(B818,Tools!A:C,3,0)","v":{"$error":"#N/A"}},{"$f":"Orders!D818/VLOOKUP(B818,Tools!A:C,3,0)","v":{"$error":"#N/A"}}]
[{"$f":"Orders!A819","v":0},{"$f":"VLOOKUP(A819,'Product-tool'!A:B,2,0)","v":{"$error":"#N/A"}},{"$f":"Orders!B819/VLOOKUP(B819,Tools!A:C,3,0)","v":{"$error":"#N/A"}},{"$f":"Orders!C819/VLOOKUP(B819,Tools!A:C,3,0)","v":{"$error":"#N/A"}},{"$f":"Orders!D819/VLOOKUP(B819,Tools!A:C,3,0)","v":{"$error":"#N/A"}}]
[{"$f":"Orders!A820","v":0},{"$f":"VLOOKUP(A820,'Product-tool'!A:B,2,0)","v":{"$error":"#N/A"}},{"$f":"Orders!B820/VLOOKUP(B820,Tools!A:C,3,0)","v":{"$error":"#N/A"}},{"$f":"Orders!C820/VLOOKUP(B820,Tools!A:C,3,0)","v":{"$error":"#N/A"}},{"$f":"Orders!D820/VLOOKUP(B820,Tools!A:C,3,0)","v":{"$error":"#N/A"}}]
[{"$f":"Orders!A821","v":0},{"$f":"VLOOKUP(A821,'Product-tool'!A:B,2,0)","v":{"$error":"#N/A"}},{"$f":"Orders!B821/VLOOKUP(B821,Tools!A:C,3,0)","v":{"$error":"#N/A"}},{"$f":"Orders!C821/VLOOKUP(B821,Tools!A:C,3,0)","v":{"$error":"#N/A"}},{"$f":"Orders!D821/VLOOKUP(B821,Tools!A:C,3,0)","v":{"$error":"#N/A"}}]
[{"$f":"Orders!A822","v":0},{"$f":"VLOOKUP(A822,'Product-tool'!A:B,2,0)","v":{"$error":"#N/A"}},{"$f":"Orders!B822/VLOOKUP(B822,Tools!A:C,3,0)","v":{"$error":"#N/A"}},{"$f":"Orders!C822/VLOOKUP(B822,Tools!A:C,3,0)","v":{"$error":"#N/A"}},{"$f":"Orders!D822/VLOOKUP(B822,Tools!A:C,3,0)","v":{"$error":"#N/A"}}]
[{"$f":"Orders!A823","v":0},{"$f":"VLOOKUP(A823,'Product-tool'!A:B,2,0)","v":{"$error":"#N/A"}},{"$f":"Orders!B823/VLOOKUP(B823,Tools!A:C,3,0)","v":{"$error":"#N/A"}},{"$f":"Orders!C823/VLOOKUP(B823,Tools!A:C,3,0)","v":{"$error":"#N/A"}},{"$f":"Orders!D823/VLOOKUP(B823,Tools!A:C,3,0)","v":{"$error":"#N/A"}}]
[{"$f":"Orders!A824","v":0},{"$f":"VLOOKUP(A824,'Product-tool'!A:B,2,0)","v":{"$error":"#N/A"}},{"$f":"Orders!B824/VLOOKUP(B824,Tools!A:C,3,0)","v":{"$error":"#N/A"}},{"$f":"Orders!C824/VLOOKUP(B824,Tools!A:C,3,0)","v":{"$error":"#N/A"}},{"$f":"Orders!D824/VLOOKUP(B824,Tools!A:C,3,0)","v":{"$error":"#N/A"}}]
[{"$f":"Orders!A825","v":0},{"$f":"VLOOKUP(A825,'Product-tool'!A:B,2,0)","v":{"$error":"#N/A"}},{"$f":"Orders!B825/VLOOKUP(B825,Tools!A:C,3,0)","v":{"$error":"#N/A"}},{"$f":"Orders!C825/VLOOKUP(B825,Tools!A:C,3,0)","v":{"$error":"#N/A"}},{"$f":"Orders!D825/VLOOKUP(B825,Tools!A:C,3,0)","v":{"$error":"#N/A"}}]
[{"$f":"Orders!A826","v":0},{"$f":"VLOOKUP(A826,'Product-tool'!A:B,2,0)","v":{"$error":"#N/A"}},{"$f":"Orders!B826/VLOOKUP(B826,Tools!A:C,3,0)","v":{"$error":"#N/A"}},{"$f":"Orders!C826/VLOOKUP(B826,Tools!A:C,3,0)","v":{"$error":"#N/A"}},{"$f":"Orders!D826/VLOOKUP(B826,Tools!A:C,3,0)","v":{"$error":"#N/A"}}]
[{"$f":"Orders!A827","v":0},{"$f":"VLOOKUP(A827,'Product-tool'!A:B,2,0)","v":{"$error":"#N/A"}},{"$f":"Orders!B827/VLOOKUP(B827,Tools!A:C,3,0)","v":{"$error":"#N/A"}},{"$f":"Orders!C827/VLOOKUP(B827,Tools!A:C,3,0)","v":{"$error":"#N/A"}},{"$f":"Orders!D827/VLOOKUP(B827,Tools!A:C,3,0)","v":{"$error":"#N/A"}}]
[{"$f":"Orders!A828","v":0},{"$f":"VLOOKUP(A828,'Product-tool'!A:B,2,0)","v":{"$error":"#N/A"}},{"$f":"Orders!B828/VLOOKUP(B828,Tools!A:C,3,0)","v":{"$error":"#N/A"}},{"$f":"Orders!C828/VLOOKUP(B828,Tools!A:C,3,0)","v":{"$error":"#N/A"}},{"$f":"Orders!D828/VLOOKUP(B828,Tools!A:C,3,0)","v":{"$error":"#N/A"}}]
[{"$f":"Orders!A829","v":0},{"$f":"VLOOKUP(A829,'Product-tool'!A:B,2,0)","v":{"$error":"#N/A"}},{"$f":"Orders!B829/VLOOKUP(B829,Tools!A:C,3,0)","v":{"$error":"#N/A"}},{"$f":"Orders!C829/VLOOKUP(B829,Tools!A:C,3,0)","v":{"$error":"#N/A"}},{"$f":"Orders!D829/VLOOKUP(B829,Tools!A:C,3,0)","v":{"$error":"#N/A"}}]
[{"$f":"Orders!A830","v":0},{"$f":"VLOOKUP(A830,'Product-tool'!A:B,2,0)","v":{"$error":"#N/A"}},{"$f":"Orders!B830/VLOOKUP(B830,Tools!A:C,3,0)","v":{"$error":"#N/A"}},{"$f":"Orders!C830/VLOOKUP(B830,Tools!A:C,3,0)","v":{"$error":"#N/A"}},{"$f":"Orders!D830/VLOOKUP(B830,Tools!A:C,3,0)","v":{"$error":"#N/A"}}]
[{"$f":"Orders!A831","v":0},{"$f":"VLOOKUP(A831,'Product-tool'!A:B,2,0)","v":{"$error":"#N/A"}},{"$f":"Orders!B831/VLOOKUP(B831,Tools!A:C,3,0)","v":{"$error":"#N/A"}},{"$f":"Orders!C831/VLOOKUP(B831,Tools!A:C,3,0)","v":{"$error":"#N/A"}},{"$f":"Orders!D831/VLOOKUP(B831,Tools!A:C,3,0)","v":{"$error":"#N/A"}}]
[{"$f":"Orders!A832","v":0},{"$f":"VLOOKUP(A832,'Product-tool'!A:B,2,0)","v":{"$error":"#N/A"}},{"$f":"Orders!B832/VLOOKUP(B832,Tools!A:C,3,0)","v":{"$error":"#N/A"}},{"$f":"Orders!C832/VLOOKUP(B832,Tools!A:C,3,0)","v":{"$error":"#N/A"}},{"$f":"Orders!D832/VLOOKUP(B832,Tools!A:C,3,0)","v":{"$error":"#N/A"}}]
[{"$f":"Orders!A833","v":0},{"$f":"VLOOKUP(A833,'Product-tool'!A:B,2,0)","v":{"$error":"#N/A"}},{"$f":"Orders!B833/VLOOKUP(B833,Tools!A:C,3,0)","v":{"$error":"#N/A"}},{"$f":"Orders!C833/VLOOKUP(B833,Tools!A:C,3,0)","v":{"$error":"#N/A"}},{"$f":"Orders!D833/VLOOKUP(B833,Tools!A:C,3,0)","v":{"$error":"#N/A"}}]
[{"$f":"Orders!A834","v":0},{"$f":"VLOOKUP(A834,'Product-tool'!A:B,2,0)","v":{"$error":"#N/A"}},{"$f":"Orders!B834/VLOOKUP(B834,Tools!A:C,3,0)","v":{"$error":"#N/A"}},{"$f":"Orders!C834/VLOOKUP(B834,Tools!A:C,3,0)","v":{"$error":"#N/A"}},{"$f":"Orders!D834/VLOOKUP(B834,Tools!A:C,3,0)","v":{"$error":"#N/A"}}]
[{"$f":"Orders!A835","v":0},{"$f":"VLOOKUP(A835,'Product-tool'!A:B,2,0)","v":{"$error":"#N/A"}},{"$f":"Orders!B835/VLOOKUP(B835,Tools!A:C,3,0)","v":{"$error":"#N/A"}},{"$f":"Orders!C835/VLOOKUP(B835,Tools!A:C,3,0)","v":{"$error":"#N/A"}},{"$f":"Orders!D835/VLOOKUP(B835,Tools!A:C,3,0)","v":{"$error":"#N/A"}}]
[{"$f":"Orders!A836","v":0},{"$f":"VLOOKUP(A836,'Product-tool'!A:B,2,0)","v":{"$error":"#N/A"}},{"$f":"Orders!B836/VLOOKUP(B836,Tools!A:C,3,0)","v":{"$error":"#N/A"}},{"$f":"Orders!C836/VLOOKUP(B836,Tools!A:C,3,0)","v":{"$error":"#N/A"}},{"$f":"Orders!D836/VLOOKUP(B836,Tools!A:C,3,0)","v":{"$error":"#N/A"}}]
[{"$f":"Orders!A837","v":0},{"$f":"VLOOKUP(A837,'Product-tool'!A:B,2,0)","v":{"$error":"#N/A"}},{"$f":"Orders!B837/VLOOKUP(B837,Tools!A:C,3,0)","v":{"$error":"#N/A"}},{"$f":"Orders!C837/VLOOKUP(B837,Tools!A:C,3,0)","v":{"$error":"#N/A"}},{"$f":"Orders!D837/VLOOKUP(B837,Tools!A:C,3,0)","v":{"$error":"#N/A"}}]
[{"$f":"Orders!A838","v":0},{"$f":"VLOOKUP(A838,'Product-tool'!A:B,2,0)","v":{"$error":"#N/A"}},{"$f":"Orders!B838/VLOOKUP(B838,Tools!A:C,3,0)","v":{"$error":"#N/A"}},{"$f":"Orders!C838/VLOOKUP(B838,Tools!A:C,3,0)","v":{"$error":"#N/A"}},{"$f":"Orders!D838/VLOOKUP(B838,Tools!A:C,3,0)","v":{"$error":"#N/A"}}]
[{"$f":"Orders!A839","v":0},{"$f":"VLOOKUP(A839,'Product-tool'!A:B,2,0)","v":{"$error":"#N/A"}},{"$f":"Orders!B839/VLOOKUP(B839,Tools!A:C,3,0)","v":{"$error":"#N/A"}},{"$f":"Orders!C839/VLOOKUP(B839,Tools!A:C,3,0)","v":{"$error":"#N/A"}},{"$f":"Orders!D839/VLOOKUP(B839,Tools!A:C,3,0)","v":{"$error":"#N/A"}}]
[{"$f":"Orders!A840","v":0},{"$f":"VLOOKUP(A840,'Product-tool'!A:B,2,0)","v":{"$error":"#N/A"}},{"$f":"Orders!B840/VLOOKUP(B840,Tools!A:C,3,0)","v":{"$error":"#N/A"}},{"$f":"Orders!C840/VLOOKUP(B840,Tools!A:C,3,0)","v":{"$error":"#N/A"}},{"$f":"Orders!D840/VLOOKUP(B840,Tools!A:C,3,0)","v":{"$error":"#N/A"}}]
[{"$f":"Orders!A841","v":0},{"$f":"VLOOKUP(A841,'Product-tool'!A:B,2,0)","v":{"$error":"#N/A"}},{"$f":"Orders!B841/VLOOKUP(B841,Tools!A:C,3,0)","v":{"$error":"#N/A"}},{"$f":"Orders!C841/VLOOKUP(B841,Tools!A:C,3,0)","v":{"$error":"#N/A"}},{"$f":"Orders!D841/VLOOKUP(B841,Tools!A:C,3,0)","v":{"$error":"#N/A"}}]
[{"$f":"Orders!A842","v":0},{"$f":"VLOOKUP(A842,'Product-tool'!A:B,2,0)","v":{"$error":"#N/A"}},{"$f":"Orders!B842/VLOOKUP(B842,Tools!A:C,3,0)","v":{"$error":"#N/A"}},{"$f":"Orders!C842/VLOOKUP(B842,Tools!A:C,3,0)","v":{"$error":"#N/A"}},{"$f":"Orders!D842/VLOOKUP(B842,Tools!A:C,3,0)","v":{"$error":"#N/A"}}]
[{"$f":"Orders!A843","v":0},{"$f":"VLOOKUP(A843,'Product-tool'!A:B,2,0)","v":{"$error":"#N/A"}},{"$f":"Orders!B843/VLOOKUP(B843,Tools!A:C,3,0)","v":{"$error":"#N/A"}},{"$f":"Orders!C843/VLOOKUP(B843,Tools!A:C,3,0)","v":{"$error":"#N/A"}},{"$f":"Orders!D843/VLOOKUP(B843,Tools!A:C,3,0)","v":{"$error":"#N/A"}}]
[{"$f":"Orders!A844","v":0},{"$f":"VLOOKUP(A844,'Product-tool'!A:B,2,0)","v":{"$error":"#N/A"}},{"$f":"Orders!B844/VLOOKUP(B844,Tools!A:C,3,0)","v":{"$error":"#N/A"}},{"$f":"Orders!C844/VLOOKUP(B844,Tools!A:C,3,0)","v":{"$error":"#N/A"}},{"$f":"Orders!D844/VLOOKUP(B844,Tools!A:C,3,0)","v":{"$error":"#N/A"}}]
[{"$f":"Orders!A845","v":0},{"$f":"VLOOKUP(A845,'Product-tool'!A:B,2,0)","v":{"$error":"#N/A"}},{"$f":"Orders!B845/VLOOKUP(B845,Tools!A:C,3,0)","v":{"$error":"#N/A"}},{"$f":"Orders!C845/VLOOKUP(B845,Tools!A:C,3,0)","v":{"$error":"#N/A"}},{"$f":"Orders!D845/VLOOKUP(B845,Tools!A:C,3,0)","v":{"$error":"#N/A"}}]
[{"$f":"Orders!A846","v":0},{"$f":"VLOOKUP(A846,'Product-tool'!A:B,2,0)","v":{"$error":"#N/A"}},{"$f":"Orders!B846/VLOOKUP(B846,Tools!A:C,3,0)","v":{"$error":"#N/A"}},{"$f":"Orders!C846/VLOOKUP(B846,Tools!A:C,3,0)","v":{"$error":"#N/A"}},{"$f":"Orders!D846/VLOOKUP(B846,Tools!A:C,3,0)","v":{"$error":"#N/A"}}]
[{"$f":"Orders!A847","v":0},{"$f":"VLOOKUP(A847,'Product-tool'!A:B,2,0)","v":{"$error":"#N/A"}},{"$f":"Orders!B847/VLOOKUP(B847,Tools!A:C,3,0)","v":{"$error":"#N/A"}},{"$f":"Orders!C847/VLOOKUP(B847,Tools!A:C,3,0)","v":{"$error":"#N/A"}},{"$f":"Orders!D847/VLOOKUP(B847,Tools!A:C,3,0)","v":{"$error":"#N/A"}}]
[{"$f":"Orders!A848","v":0},{"$f":"VLOOKUP(A848,'Product-tool'!A:B,2,0)","v":{"$error":"#N/A"}},{"$f":"Orders!B848/VLOOKUP(B848,Tools!A:C,3,0)","v":{"$error":"#N/A"}},{"$f":"Orders!C848/VLOOKUP(B848,Tools!A:C,3,0)","v":{"$error":"#N/A"}},{"$f":"Orders!D848/VLOOKUP(B848,Tools!A:C,3,0)","v":{"$error":"#N/A"}}]
[{"$f":"Orders!A849","v":0},{"$f":"VLOOKUP(A849,'Product-tool'!A:B,2,0)","v":{"$error":"#N/A"}},{"$f":"Orders!B849/VLOOKUP(B849,Tools!A:C,3,0)","v":{"$error":"#N/A"}},{"$f":"Orders!C849/VLOOKUP(B849,Tools!A:C,3,0)","v":{"$error":"#N/A"}},{"$f":"Orders!D849/VLOOKUP(B849,Tools!A:C,3,0)","v":{"$error":"#N/A"}}]
[{"$f":"Orders!A850","v":0},{"$f":"VLOOKUP(A850,'Product-tool'!A:B,2,0)","v":{"$error":"#N/A"}},{"$f":"Orders!B850/VLOOKUP(B850,Tools!A:C,3,0)","v":{"$error":"#N/A"}},{"$f":"Orders!C850/VLOOKUP(B850,Tools!A:C,3,0)","v":{"$error":"#N/A"}},{"$f":"Orders!D850/VLOOKUP(B850,Tools!A:C,3,0)","v":{"$error":"#N/A"}}]
[{"$f":"Orders!A851","v":0},{"$f":"VLOOKUP(A851,'Product-tool'!A:B,2,0)","v":{"$error":"#N/A"}},{"$f":"Orders!B851/VLOOKUP(B851,Tools!A:C,3,0)","v":{"$error":"#N/A"}},{"$f":"Orders!C851/VLOOKUP(B851,Tools!A:C,3,0)","v":{"$error":"#N/A"}},{"$f":"Orders!D851/VLOOKUP(B851,Tools!A:C,3,0)","v":{"$error":"#N/A"}}]
[{"$f":"Orders!A852","v":0},{"$f":"VLOOKUP(A852,'Product-tool'!A:B,2,0)","v":{"$error":"#N/A"}},{"$f":"Orders!B852/VLOOKUP(B852,Tools!A:C,3,0)","v":{"$error":"#N/A"}},{"$f":"Orders!C852/VLOOKUP(B852,Tools!A:C,3,0)","v":{"$error":"#N/A"}},{"$f":"Orders!D852/VLOOKUP(B852,Tools!A:C,3,0)","v":{"$error":"#N/A"}}]
[{"$f":"Orders!A853","v":0},{"$f":"VLOOKUP(A853,'Product-tool'!A:B,2,0)","v":{"$error":"#N/A"}},{"$f":"Orders!B853/VLOOKUP(B853,Tools!A:C,3,0)","v":{"$error":"#N/A"}},{"$f":"Orders!C853/VLOOKUP(B853,Tools!A:C,3,0)","v":{"$error":"#N/A"}},{"$f":"Orders!D853/VLOOKUP(B853,Tools!A:C,3,0)","v":{"$error":"#N/A"}}]
[{"$f":"Orders!A854","v":0},{"$f":"VLOOKUP(A854,'Product-tool'!A:B,2,0)","v":{"$error":"#N/A"}},{"$f":"Orders!B854/VLOOKUP(B854,Tools!A:C,3,0)","v":{"$error":"#N/A"}},{"$f":"Orders!C854/VLOOKUP(B854,Tools!A:C,3,0)","v":{"$error":"#N/A"}},{"$f":"Orders!D854/VLOOKUP(B854,Tools!A:C,3,0)","v":{"$error":"#N/A"}}]
[{"$f":"Orders!A855","v":0},{"$f":"VLOOKUP(A855,'Product-tool'!A:B,2,0)","v":{"$error":"#N/A"}},{"$f":"Orders!B855/VLOOKUP(B855,Tools!A:C,3,0)","v":{"$error":"#N/A"}},{"$f":"Orders!C855/VLOOKUP(B855,Tools!A:C,3,0)","v":{"$error":"#N/A"}},{"$f":"Orders!D855/VLOOKUP(B855,Tools!A:C,3,0)","v":{"$error":"#N/A"}}]
[{"$f":"Orders!A856","v":0},{"$f":"VLOOKUP(A856,'Product-tool'!A:B,2,0)","v":{"$error":"#N/A"}},{"$f":"Orders!B856/VLOOKUP(B856,Tools!A:C,3,0)","v":{"$error":"#N/A"}},{"$f":"Orders!C856/VLOOKUP(B856,Tools!A:C,3,0)","v":{"$error":"#N/A"}},{"$f":"Orders!D856/VLOOKUP(B856,Tools!A:C,3,0)","v":{"$error":"#N/A"}}]
[{"$f":"Orders!A857","v":0},{"$f":"VLOOKUP(A857,'Product-tool'!A:B,2,0)","v":{"$error":"#N/A"}},{"$f":"Orders!B857/VLOOKUP(B857,Tools!A:C,3,0)","v":{"$error":"#N/A"}},{"$f":"Orders!C857/VLOOKUP(B857,Tools!A:C,3,0)","v":{"$error":"#N/A"}},{"$f":"Orders!D857/VLOOKUP(B857,Tools!A:C,3,0)","v":{"$error":"#N/A"}}]
[{"$f":"Orders!A858","v":0},{"$f":"VLOOKUP(A858,'Product-tool'!A:B,2,0)","v":{"$error":"#N/A"}},{"$f":"Orders!B858/VLOOKUP(B858,Tools!A:C,3,0)","v":{"$error":"#N/A"}},{"$f":"Orders!C858/VLOOKUP(B858,Tools!A:C,3,0)","v":{"$error":"#N/A"}},{"$f":"Orders!D858/VLOOKUP(B858,Tools!A:C,3,0)","v":{"$error":"#N/A"}}]
[{"$f":"Orders!A859","v":0},{"$f":"VLOOKUP(A859,'Product-tool'!A:B,2,0)","v":{"$error":"#N/A"}},{"$f":"Orders!B859/VLOOKUP(B859,Tools!A:C,3,0)","v":{"$error":"#N/A"}},{"$f":"Orders!C859/VLOOKUP(B859,Tools!A:C,3,0)","v":{"$error":"#N/A"}},{"$f":"Orders!D859/VLOOKUP(B859,Tools!A:C,3,0)","v":{"$error":"#N/A"}}]
[{"$f":"Orders!A860","v":0},{"$f":"VLOOKUP(A860,'Product-tool'!A:B,2,0)","v":{"$error":"#N/A"}},{"$f":"Orders!B860/VLOOKUP(B860,Tools!A:C,3,0)","v":{"$error":"#N/A"}},{"$f":"Orders!C860/VLOOKUP(B860,Tools!A:C,3,0)","v":{"$error":"#N/A"}},{"$f":"Orders!D860/VLOOKUP(B860,Tools!A:C,3,0)","v":{"$error":"#N/A"}}]
[{"$f":"Orders!A861","v":0},{"$f":"VLOOKUP(A861,'Product-tool'!A:B,2,0)","v":{"$error":"#N/A"}},{"$f":"Orders!B861/VLOOKUP(B861,Tools!A:C,3,0)","v":{"$error":"#N/A"}},{"$f":"Orders!C861/VLOOKUP(B861,Tools!A:C,3,0)","v":{"$error":"#N/A"}},{"$f":"Orders!D861/VLOOKUP(B861,Tools!A:C,3,0)","v":{"$error":"#N/A"}}]
[{"$f":"Orders!A862","v":0},{"$f":"VLOOKUP(A862,'Product-tool'!A:B,2,0)","v":{"$error":"#N/A"}},{"$f":"Orders!B862/VLOOKUP(B862,Tools!A:C,3,0)","v":{"$error":"#N/A"}},{"$f":"Orders!C862/VLOOKUP(B862,Tools!A:C,3,0)","v":{"$error":"#N/A"}},{"$f":"Orders!D862/VLOOKUP(B862,Tools!A:C,3,0)","v":{"$error":"#N/A"}}]
[{"$f":"Orders!A863","v":0},{"$f":"VLOOKUP(A863,'Product-tool'!A:B,2,0)","v":{"$error":"#N/A"}},{"$f":"Orders!B863/VLOOKUP(B863,Tools!A:C,3,0)","v":{"$error":"#N/A"}},{"$f":"Orders!C863/VLOOKUP(B863,Tools!A:C,3,0)","v":{"$error":"#N/A"}},{"$f":"Orders!D863/VLOOKUP(B863,Tools!A:C,3,0)","v":{"$error":"#N/A"}}]
[{"$f":"Orders!A864","v":0},{"$f":"VLOOKUP(A864,'Product-tool'!A:B,2,0)","v":{"$error":"#N/A"}},{"$f":"Orders!B864/VLOOKUP(B864,Tools!A:C,3,0)","v":{"$error":"#N/A"}},{"$f":"Orders!C864/VLOOKUP(B864,Tools!A:C,3,0)","v":{"$error":"#N/A"}},{"$f":"Orders!D864/VLOOKUP(B864,Tools!A:C,3,0)","v":{"$error":"#N/A"}}]
[{"$f":"Orders!A865","v":0},{"$f":"VLOOKUP(A865,'Product-tool'!A:B,2,0)","v":{"$error":"#N/A"}},{"$f":"Orders!B865/VLOOKUP(B865,Tools!A:C,3,0)","v":{"$error":"#N/A"}},{"$f":"Orders!C865/VLOOKUP(B865,Tools!A:C,3,0)","v":{"$error":"#N/A"}},{"$f":"Orders!D865/VLOOKUP(B865,Tools!A:C,3,0)","v":{"$error":"#N/A"}}]
[{"$f":"Orders!A866","v":0},{"$f":"VLOOKUP(A866,'Product-tool'!A:B,2,0)","v":{"$error":"#N/A"}},{"$f":"Orders!B866/VLOOKUP(B866,Tools!A:C,3,0)","v":{"$error":"#N/A"}},{"$f":"Orders!C866/VLOOKUP(B866,Tools!A:C,3,0)","v":{"$error":"#N/A"}},{"$f":"Orders!D866/VLOOKUP(B866,Tools!A:C,3,0)","v":{"$error":"#N/A"}}]
[{"$f":"Orders!A867","v":0},{"$f":"VLOOKUP(A867,'Product-tool'!A:B,2,0)","v":{"$error":"#N/A"}},{"$f":"Orders!B867/VLOOKUP(B867,Tools!A:C,3,0)","v":{"$error":"#N/A"}},{"$f":"Orders!C867/VLOOKUP(B867,Tools!A:C,3,0)","v":{"$error":"#N/A"}},{"$f":"Orders!D867/VLOOKUP(B867,Tools!A:C,3,0)","v":{"$error":"#N/A"}}]
[{"$f":"Orders!A868","v":0},{"$f":"VLOOKUP(A868,'Product-tool'!A:B,2,0)","v":{"$error":"#N/A"}},{"$f":"Orders!B868/VLOOKUP(B868,Tools!A:C,3,0)","v":{"$error":"#N/A"}},{"$f":"Orders!C868/VLOOKUP(B868,Tools!A:C,3,0)","v":{"$error":"#N/A"}},{"$f":"Orders!D868/VLOOKUP(B868,Tools!A:C,3,0)","v":{"$error":"#N/A"}}]
[{"$f":"Orders!A869","v":0},{"$f":"VLOOKUP(A869,'Product-tool'!A:B,2,0)","v":{"$error":"#N/A"}},{"$f":"Orders!B869/VLOOKUP(B869,Tools!A:C,3,0)","v":{"$error":"#N/A"}},{"$f":"Orders!C869/VLOOKUP(B869,Tools!A:C,3,0)","v":{"$error":"#N/A"}},{"$f":"Orders!D869/VLOOKUP(B869,Tools!A:C,3,0)","v":{"$error":"#N/A"}}]
[{"$f":"Orders!A870","v":0},{"$f":"VLOOKUP(A870,'Product-tool'!A:B,2,0)","v":{"$error":"#N/A"}},{"$f":"Orders!B870/VLOOKUP(B870,Tools!A:C,3,0)","v":{"$error":"#N/A"}},{"$f":"Orders!C870/VLOOKUP(B870,Tools!A:C,3,0)","v":{"$error":"#N/A"}},{"$f":"Orders!D870/VLOOKUP(B870,Tools!A:C,3,0)","v":{"$error":"#N/A"}}]
[{"$f":"Orders!A871","v":0},{"$f":"VLOOKUP(A871,'Product-tool'!A:B,2,0)","v":{"$error":"#N/A"}},{"$f":"Orders!B871/VLOOKUP(B871,Tools!A:C,3,0)","v":{"$error":"#N/A"}},{"$f":"Orders!C871/VLOOKUP(B871,Tools!A:C,3,0)","v":{"$error":"#N/A"}},{"$f":"Orders!D871/VLOOKUP(B871,Tools!A:C,3,0)","v":{"$error":"#N/A"}}]
[{"$f":"Orders!A872","v":0},{"$f":"VLOOKUP(A872,'Product-tool'!A:B,2,0)","v":{"$error":"#N/A"}},{"$f":"Orders!B872/VLOOKUP(B872,Tools!A:C,3,0)","v":{"$error":"#N/A"}},{"$f":"Orders!C872/VLOOKUP(B872,Tools!A:C,3,0)","v":{"$error":"#N/A"}},{"$f":"Orders!D872/VLOOKUP(B872,Tools!A:C,3,0)","v":{"$error":"#N/A"}}]
[{"$f":"Orders!A873","v":0},{"$f":"VLOOKUP(A873,'Product-tool'!A:B,2,0)","v":{"$error":"#N/A"}},{"$f":"Orders!B873/VLOOKUP(B873,Tools!A:C,3,0)","v":{"$error":"#N/A"}},{"$f":"Orders!C873/VLOOKUP(B873,Tools!A:C,3,0)","v":{"$error":"#N/A"}},{"$f":"Orders!D873/VLOOKUP(B873,Tools!A:C,3,0)","v":{"$error":"#N/A"}}]
[{"$f":"Orders!A874","v":0},{"$f":"VLOOKUP(A874,'Product-tool'!A:B,2,0)","v":{"$error":"#N/A"}},{"$f":"Orders!B874/VLOOKUP(B874,Tools!A:C,3,0)","v":{"$error":"#N/A"}},{"$f":"Orders!C874/VLOOKUP(B874,Tools!A:C,3,0)","v":{"$error":"#N/A"}},{"$f":"Orders!D874/VLOOKUP(B874,Tools!A:C,3,0)","v":{"$error":"#N/A"}}]
[{"$f":"Orders!A875","v":0},{"$f":"VLOOKUP(A875,'Product-tool'!A:B,2,0)","v":{"$error":"#N/A"}},{"$f":"Orders!B875/VLOOKUP(B875,Tools!A:C,3,0)","v":{"$error":"#N/A"}},{"$f":"Orders!C875/VLOOKUP(B875,Tools!A:C,3,0)","v":{"$error":"#N/A"}},{"$f":"Orders!D875/VLOOKUP(B875,Tools!A:C,3,0)","v":{"$error":"#N/A"}}]
[{"$f":"Orders!A876","v":0},{"$f":"VLOOKUP(A876,'Product-tool'!A:B,2,0)","v":{"$error":"#N/A"}},{"$f":"Orders!B876/VLOOKUP(B876,Tools!A:C,3,0)","v":{"$error":"#N/A"}},{"$f":"Orders!C876/VLOOKUP(B876,Tools!A:C,3,0)","v":{"$error":"#N/A"}},{"$f":"Orders!D876/VLOOKUP(B876,Tools!A:C,3,0)","v":{"$error":"#N/A"}}]
[{"$f":"Orders!A877","v":0},{"$f":"VLOOKUP(A877,'Product-tool'!A:B,2,0)","v":{"$error":"#N/A"}},{"$f":"Orders!B877/VLOOKUP(B877,Tools!A:C,3,0)","v":{"$error":"#N/A"}},{"$f":"Orders!C877/VLOOKUP(B877,Tools!A:C,3,0)","v":{"$error":"#N/A"}},{"$f":"Orders!D877/VLOOKUP(B877,Tools!A:C,3,0)","v":{"$error":"#N/A"}}]
[{"$f":"Orders!A878","v":0},{"$f":"VLOOKUP(A878,'Product-tool'!A:B,2,0)","v":{"$error":"#N/A"}},{"$f":"Orders!B878/VLOOKUP(B878,Tools!A:C,3,0)","v":{"$error":"#N/A"}},{"$f":"Orders!C878/VLOOKUP(B878,Tools!A:C,3,0)","v":{"$error":"#N/A"}},{"$f":"Orders!D878/VLOOKUP(B878,Tools!A:C,3,0)","v":{"$error":"#N/A"}}]
[{"$f":"Orders!A879","v":0},{"$f":"VLOOKUP(A879,'Product-tool'!A:B,2,0)","v":{"$error":"#N/A"}},{"$f":"Orders!B879/VLOOKUP(B879,Tools!A:C,3,0)","v":{"$error":"#N/A"}},{"$f":"Orders!C879/VLOOKUP(B879,Tools!A:C,3,0)","v":{"$error":"#N/A"}},{"$f":"Orders!D879/VLOOKUP(B879,Tools!A:C,3,0)","v":{"$error":"#N/A"}}]
[{"$f":"Orders!A880","v":0},{"$f":"VLOOKUP(A880,'Product-tool'!A:B,2,0)","v":{"$error":"#N/A"}},{"$f":"Orders!B880/VLOOKUP(B880,Tools!A:C,3,0)","v":{"$error":"#N/A"}},{"$f":"Orders!C880/VLOOKUP(B880,Tools!A:C,3,0)","v":{"$error":"#N/A"}},{"$f":"Orders!D880/VLOOKUP(B880,Tools!A:C,3,0)","v":{"$error":"#N/A"}}]
[{"$f":"Orders!A881","v":0},{"$f":"VLOOKUP(A881,'Product-tool'!A:B,2,0)","v":{"$error":"#N/A"}},{"$f":"Orders!B881/VLOOKUP(B881,Tools!A:C,3,0)","v":{"$error":"#N/A"}},{"$f":"Orders!C881/VLOOKUP(B881,Tools!A:C,3,0)","v":{"$error":"#N/A"}},{"$f":"Orders!D881/VLOOKUP(B881,Tools!A:C,3,0)","v":{"$error":"#N/A"}}]
[{"$f":"Orders!A882","v":0},{"$f":"VLOOKUP(A882,'Product-tool'!A:B,2,0)","v":{"$error":"#N/A"}},{"$f":"Orders!B882/VLOOKUP(B882,Tools!A:C,3,0)","v":{"$error":"#N/A"}},{"$f":"Orders!C882/VLOOKUP(B882,Tools!A:C,3,0)","v":{"$error":"#N/A"}},{"$f":"Orders!D882/VLOOKUP(B882,Tools!A:C,3,0)","v":{"$error":"#N/A"}}]
[{"$f":"Orders!A883","v":0},{"$f":"VLOOKUP(A883,'Product-tool'!A:B,2,0)","v":{"$error":"#N/A"}},{"$f":"Orders!B883/VLOOKUP(B883,Tools!A:C,3,0)","v":{"$error":"#N/A"}},{"$f":"Orders!C883/VLOOKUP(B883,Tools!A:C,3,0)","v":{"$error":"#N/A"}},{"$f":"Orders!D883/VLOOKUP(B883,Tools!A:C,3,0)","v":{"$error":"#N/A"}}]
[{"$f":"Orders!A884","v":0},{"$f":"VLOOKUP(A884,'Product-tool'!A:B,2,0)","v":{"$error":"#N/A"}},{"$f":"Orders!B884/VLOOKUP(B884,Tools!A:C,3,0)","v":{"$error":"#N/A"}},{"$f":"Orders!C884/VLOOKUP(B884,Tools!A:C,3,0)","v":{"$error":"#N/A"}},{"$f":"Orders!D884/VLOOKUP(B884,Tools!A:C,3,0)","v":{"$error":"#N/A"}}]
[{"$f":"Orders!A885","v":0},{"$f":"VLOOKUP(A885,'Product-tool'!A:B,2,0)","v":{"$error":"#N/A"}},{"$f":"Orders!B885/VLOOKUP(B885,Tools!A:C,3,0)","v":{"$error":"#N/A"}},{"$f":"Orders!C885/VLOOKUP(B885,Tools!A:C,3,0)","v":{"$error":"#N/A"}},{"$f":"Orders!D885/VLOOKUP(B885,Tools!A:C,3,0)","v":{"$error":"#N/A"}}]
[{"$f":"Orders!A886","v":0},{"$f":"VLOOKUP(A886,'Product-tool'!A:B,2,0)","v":{"$error":"#N/A"}},{"$f":"Orders!B886/VLOOKUP(B886,Tools!A:C,3,0)","v":{"$error":"#N/A"}},{"$f":"Orders!C886/VLOOKUP(B886,Tools!A:C,3,0)","v":{"$error":"#N/A"}},{"$f":"Orders!D886/VLOOKUP(B886,Tools!A:C,3,0)","v":{"$error":"#N/A"}}]
[{"$f":"Orders!A887","v":0},{"$f":"VLOOKUP(A887,'Product-tool'!A:B,2,0)","v":{"$error":"#N/A"}},{"$f":"Orders!B887/VLOOKUP(B887,Tools!A:C,3,0)","v":{"$error":"#N/A"}},{"$f":"Orders!C887/VLOOKUP(B887,Tools!A:C,3,0)","v":{"$error":"#N/A"}},{"$f":"Orders!D887/VLOOKUP(B887,Tools!A:C,3,0)","v":{"$error":"#N/A"}}]
[{"$f":"Orders!A888","v":0},{"$f":"VLOOKUP(A888,'Product-tool'!A:B,2,0)","v":{"$error":"#N/A"}},{"$f":"Orders!B888/VLOOKUP(B888,Tools!A:C,3,0)","v":{"$error":"#N/A"}},{"$f":"Orders!C888/VLOOKUP(B888,Tools!A:C,3,0)","v":{"$error":"#N/A"}},{"$f":"Orders!D888/VLOOKUP(B888,Tools!A:C,3,0)","v":{"$error":"#N/A"}}]
[{"$f":"Orders!A889","v":0},{"$f":"VLOOKUP(A889,'Product-tool'!A:B,2,0)","v":{"$error":"#N/A"}},{"$f":"Orders!B889/VLOOKUP(B889,Tools!A:C,3,0)","v":{"$error":"#N/A"}},{"$f":"Orders!C889/VLOOKUP(B889,Tools!A:C,3,0)","v":{"$error":"#N/A"}},{"$f":"Orders!D889/VLOOKUP(B889,Tools!A:C,3,0)","v":{"$error":"#N/A"}}]
[{"$f":"Orders!A890","v":0},{"$f":"VLOOKUP(A890,'Product-tool'!A:B,2,0)","v":{"$error":"#N/A"}},{"$f":"Orders!B890/VLOOKUP(B890,Tools!A:C,3,0)","v":{"$error":"#N/A"}},{"$f":"Orders!C890/VLOOKUP(B890,Tools!A:C,3,0)","v":{"$error":"#N/A"}},{"$f":"Orders!D890/VLOOKUP(B890,Tools!A:C,3,0)","v":{"$error":"#N/A"}}]
[{"$f":"Orders!A891","v":0},{"$f":"VLOOKUP(A891,'Product-tool'!A:B,2,0)","v":{"$error":"#N/A"}},{"$f":"Orders!B891/VLOOKUP(B891,Tools!A:C,3,0)","v":{"$error":"#N/A"}},{"$f":"Orders!C891/VLOOKUP(B891,Tools!A:C,3,0)","v":{"$error":"#N/A"}},{"$f":"Orders!D891/VLOOKUP(B891,Tools!A:C,3,0)","v":{"$error":"#N/A"}}]
[{"$f":"Orders!A892","v":0},{"$f":"VLOOKUP(A892,'Product-tool'!A:B,2,0)","v":{"$error":"#N/A"}},{"$f":"Orders!B892/VLOOKUP(B892,Tools!A:C,3,0)","v":{"$error":"#N/A"}},{"$f":"Orders!C892/VLOOKUP(B892,Tools!A:C,3,0)","v":{"$error":"#N/A"}},{"$f":"Orders!D892/VLOOKUP(B892,Tools!A:C,3,0)","v":{"$error":"#N/A"}}]
[{"$f":"Orders!A893","v":0},{"$f":"VLOOKUP(A893,'Product-tool'!A:B,2,0)","v":{"$error":"#N/A"}},{"$f":"Orders!B893/VLOOKUP(B893,Tools!A:C,3,0)","v":{"$error":"#N/A"}},{"$f":"Orders!C893/VLOOKUP(B893,Tools!A:C,3,0)","v":{"$error":"#N/A"}},{"$f":"Orders!D893/VLOOKUP(B893,Tools!A:C,3,0)","v":{"$error":"#N/A"}}]
[{"$f":"Orders!A894","v":0},{"$f":"VLOOKUP(A894,'Product-tool'!A:B,2,0)","v":{"$error":"#N/A"}},{"$f":"Orders!B894/VLOOKUP(B894,Tools!A:C,3,0)","v":{"$error":"#N/A"}},{"$f":"Orders!C894/VLOOKUP(B894,Tools!A:C,3,0)","v":{"$error":"#N/A"}},{"$f":"Orders!D894/VLOOKUP(B894,Tools!A:C,3,0)","v":{"$error":"#N/A"}}]
[{"$f":"Orders!A895","v":0},{"$f":"VLOOKUP(A895,'Product-tool'!A:B,2,0)","v":{"$error":"#N/A"}},{"$f":"Orders!B895/VLOOKUP(B895,Tools!A:C,3,0)","v":{"$error":"#N/A"}},{"$f":"Orders!C895/VLOOKUP(B895,Tools!A:C,3,0)","v":{"$error":"#N/A"}},{"$f":"Orders!D895/VLOOKUP(B895,Tools!A:C,3,0)","v":{"$error":"#N/A"}}]
[{"$f":"Orders!A896","v":0},{"$f":"VLOOKUP(A896,'Product-tool'!A:B,2,0)","v":{"$error":"#N/A"}},{"$f":"Orders!B896/VLOOKUP(B896,Tools!A:C,3,0)","v":{"$error":"#N/A"}},{"$f":"Orders!C896/VLOOKUP(B896,Tools!A:C,3,0)","v":{"$error":"#N/A"}},{"$f":"Orders!D896/VLOOKUP(B896,Tools!A:C,3,0)","v":{"$error":"#N/A"}}]
[{"$f":"Orders!A897","v":0},{"$f":"VLOOKUP(A897,'Product-tool'!A:B,2,0)","v":{"$error":"#N/A"}},{"$f":"Orders!B897/VLOOKUP(B897,Tools!A:C,3,0)","v":{"$error":"#N/A"}},{"$f":"Orders!C897/VLOOKUP(B897,Tools!A:C,3,0)","v":{"$error":"#N/A"}},{"$f":"Orders!D897/VLOOKUP(B897,Tools!A:C,3,0)","v":{"$error":"#N/A"}}]
[{"$f":"Orders!A898","v":0},{"$f":"VLOOKUP(A898,'Product-tool'!A:B,2,0)","v":{"$error":"#N/A"}},{"$f":"Orders!B898/VLOOKUP(B898,Tools!A:C,3,0)","v":{"$error":"#N/A"}},{"$f":"Orders!C898/VLOOKUP(B898,Tools!A:C,3,0)","v":{"$error":"#N/A"}},{"$f":"Orders!D898/VLOOKUP(B898,Tools!A:C,3,0)","v":{"$error":"#N/A"}}]
[{"$f":"Orders!A899","v":0},{"$f":"VLOOKUP(A899,'Product-tool'!A:B,2,0)","v":{"$error":"#N/A"}},{"$f":"Orders!B899/VLOOKUP(B899,Tools!A:C,3,0)","v":{"$error":"#N/A"}},{"$f":"Orders!C899/VLOOKUP(B899,Tools!A:C,3,0)","v":{"$error":"#N/A"}},{"$f":"Orders!D899/VLOOKUP(B899,Tools!A:C,3,0)","v":{"$error":"#N/A"}}]
[{"$f":"Orders!A900","v":0},{"$f":"VLOOKUP(A900,'Product-tool'!A:B,2,0)","v":{"$error":"#N/A"}},{"$f":"Orders!B900/VLOOKUP(B900,Tools!A:C,3,0)","v":{"$error":"#N/A"}},{"$f":"Orders!C900/VLOOKUP(B900,Tools!A:C,3,0)","v":{"$error":"#N/A"}},{"$f":"Orders!D900/VLOOKUP(B900,Tools!A:C,3,0)","v":{"$error":"#N/A"}}]
[{"$f":"Orders!A901","v":0},{"$f":"VLOOKUP(A901,'Product-tool'!A:B,2,0)","v":{"$error":"#N/A"}},{"$f":"Orders!B901/VLOOKUP(B901,Tools!A:C,3,0)","v":{"$error":"#N/A"}},{"$f":"Orders!C901/VLOOKUP(B901,Tools!A:C,3,0)","v":{"$error":"#N/A"}},{"$f":"Orders!D901/VLOOKUP(B901,Tools!A:C,3,0)","v":{"$error":"#N/A"}}]
[{"$f":"Orders!A902","v":0},{"$f":"VLOOKUP(A902,'Product-tool'!A:B,2,0)","v":{"$error":"#N/A"}},{"$f":"Orders!B902/VLOOKUP(B902,Tools!A:C,3,0)","v":{"$error":"#N/A"}},{"$f":"Orders!C902/VLOOKUP(B902,Tools!A:C,3,0)","v":{"$error":"#N/A"}},{"$f":"Orders!D902/VLOOKUP(B902,Tools!A:C,3,0)","v":{"$error":"#N/A"}}]
[{"$f":"Orders!A903","v":0},{"$f":"VLOOKUP(A903,'Product-tool'!A:B,2,0)","v":{"$error":"#N/A"}},{"$f":"Orders!B903/VLOOKUP(B903,Tools!A:C,3,0)","v":{"$error":"#N/A"}},{"$f":"Orders!C903/VLOOKUP(B903,Tools!A:C,3,0)","v":{"$error":"#N/A"}},{"$f":"Orders!D903/VLOOKUP(B903,Tools!A:C,3,0)","v":{"$error":"#N/A"}}]
[{"$f":"Orders!A904","v":0},{"$f":"VLOOKUP(A904,'Product-tool'!A:B,2,0)","v":{"$error":"#N/A"}},{"$f":"Orders!B904/VLOOKUP(B904,Tools!A:C,3,0)","v":{"$error":"#N/A"}},{"$f":"Orders!C904/VLOOKUP(B904,Tools!A:C,3,0)","v":{"$error":"#N/A"}},{"$f":"Orders!D904/VLOOKUP(B904,Tools!A:C,3,0)","v":{"$error":"#N/A"}}]
[{"$f":"Orders!A905","v":0},{"$f":"VLOOKUP(A905,'Product-tool'!A:B,2,0)","v":{"$error":"#N/A"}},{"$f":"Orders!B905/VLOOKUP(B905,Tools!A:C,3,0)","v":{"$error":"#N/A"}},{"$f":"Orders!C905/VLOOKUP(B905,Tools!A:C,3,0)","v":{"$error":"#N/A"}},{"$f":"Orders!D905/VLOOKUP(B905,Tools!A:C,3,0)","v":{"$error":"#N/A"}}]
[{"$f":"Orders!A906","v":0},{"$f":"VLOOKUP(A906,'Product-tool'!A:B,2,0)","v":{"$error":"#N/A"}},{"$f":"Orders!B906/VLOOKUP(B906,Tools!A:C,3,0)","v":{"$error":"#N/A"}},{"$f":"Orders!C906/VLOOKUP(B906,Tools!A:C,3,0)","v":{"$error":"#N/A"}},{"$f":"Orders!D906/VLOOKUP(B906,Tools!A:C,3,0)","v":{"$error":"#N/A"}}]
[{"$f":"Orders!A907","v":0},{"$f":"VLOOKUP(A907,'Product-tool'!A:B,2,0)","v":{"$error":"#N/A"}},{"$f":"Orders!B907/VLOOKUP(B907,Tools!A:C,3,0)","v":{"$error":"#N/A"}},{"$f":"Orders!C907/VLOOKUP(B907,Tools!A:C,3,0)","v":{"$error":"#N/A"}},{"$f":"Orders!D907/VLOOKUP(B907,Tools!A:C,3,0)","v":{"$error":"#N/A"}}]
[{"$f":"Orders!A908","v":0},{"$f":"VLOOKUP(A908,'Product-tool'!A:B,2,0)","v":{"$error":"#N/A"}},{"$f":"Orders!B908/VLOOKUP(B908,Tools!A:C,3,0)","v":{"$error":"#N/A"}},{"$f":"Orders!C908/VLOOKUP(B908,Tools!A:C,3,0)","v":{"$error":"#N/A"}},{"$f":"Orders!D908/VLOOKUP(B908,Tools!A:C,3,0)","v":{"$error":"#N/A"}}]
[{"$f":"Orders!A909","v":0},{"$f":"VLOOKUP(A909,'Product-tool'!A:B,2,0)","v":{"$error":"#N/A"}},{"$f":"Orders!B909/VLOOKUP(B909,Tools!A:C,3,0)","v":{"$error":"#N/A"}},{"$f":"Orders!C909/VLOOKUP(B909,Tools!A:C,3,0)","v":{"$error":"#N/A"}},{"$f":"Orders!D909/VLOOKUP(B909,Tools!A:C,3,0)","v":{"$error":"#N/A"}}]
[{"$f":"Orders!A910","v":0},{"$f":"VLOOKUP(A910,'Product-tool'!A:B,2,0)","v":{"$error":"#N/A"}},{"$f":"Orders!B910/VLOOKUP(B910,Tools!A:C,3,0)","v":{"$error":"#N/A"}},{"$f":"Orders!C910/VLOOKUP(B910,Tools!A:C,3,0)","v":{"$error":"#N/A"}},{"$f":"Orders!D910/VLOOKUP(B910,Tools!A:C,3,0)","v":{"$error":"#N/A"}}]
[{"$f":"Orders!A911","v":0},{"$f":"VLOOKUP(A911,'Product-tool'!A:B,2,0)","v":{"$error":"#N/A"}},{"$f":"Orders!B911/VLOOKUP(B911,Tools!A:C,3,0)","v":{"$error":"#N/A"}},{"$f":"Orders!C911/VLOOKUP(B911,Tools!A:C,3,0)","v":{"$error":"#N/A"}},{"$f":"Orders!D911/VLOOKUP(B911,Tools!A:C,3,0)","v":{"$error":"#N/A"}}]
[{"$f":"Orders!A912","v":0},{"$f":"VLOOKUP(A912,'Product-tool'!A:B,2,0)","v":{"$error":"#N/A"}},{"$f":"Orders!B912/VLOOKUP(B912,Tools!A:C,3,0)","v":{"$error":"#N/A"}},{"$f":"Orders!C912/VLOOKUP(B912,Tools!A:C,3,0)","v":{"$error":"#N/A"}},{"$f":"Orders!D912/VLOOKUP(B912,Tools!A:C,3,0)","v":{"$error":"#N/A"}}]
[{"$f":"Orders!A913","v":0},{"$f":"VLOOKUP(A913,'Product-tool'!A:B,2,0)","v":{"$error":"#N/A"}},{"$f":"Orders!B913/VLOOKUP(B913,Tools!A:C,3,0)","v":{"$error":"#N/A"}},{"$f":"Orders!C913/VLOOKUP(B913,Tools!A:C,3,0)","v":{"$error":"#N/A"}},{"$f":"Orders!D913/VLOOKUP(B913,Tools!A:C,3,0)","v":{"$error":"#N/A"}}]
[{"$f":"Orders!A914","v":0},{"$f":"VLOOKUP(A914,'Product-tool'!A:B,2,0)","v":{"$error":"#N/A"}},{"$f":"Orders!B914/VLOOKUP(B914,Tools!A:C,3,0)","v":{"$error":"#N/A"}},{"$f":"Orders!C914/VLOOKUP(B914,Tools!A:C,3,0)","v":{"$error":"#N/A"}},{"$f":"Orders!D914/VLOOKUP(B914,Tools!A:C,3,0)","v":{"$error":"#N/A"}}]
[{"$f":"Orders!A915","v":0},{"$f":"VLOOKUP(A915,'Product-tool'!A:B,2,0)","v":{"$error":"#N/A"}},{"$f":"Orders!B915/VLOOKUP(B915,Tools!A:C,3,0)","v":{"$error":"#N/A"}},{"$f":"Orders!C915/VLOOKUP(B915,Tools!A:C,3,0)","v":{"$error":"#N/A"}},{"$f":"Orders!D915/VLOOKUP(B915,Tools!A:C,3,0)","v":{"$error":"#N/A"}}]
[{"$f":"Orders!A916","v":0},{"$f":"VLOOKUP(A916,'Product-tool'!A:B,2,0)","v":{"$error":"#N/A"}},{"$f":"Orders!B916/VLOOKUP(B916,Tools!A:C,3,0)","v":{"$error":"#N/A"}},{"$f":"Orders!C916/VLOOKUP(B916,Tools!A:C,3,0)","v":{"$error":"#N/A"}},{"$f":"Orders!D916/VLOOKUP(B916,Tools!A:C,3,0)","v":{"$error":"#N/A"}}]
[{"$f":"Orders!A917","v":0},{"$f":"VLOOKUP(A917,'Product-tool'!A:B,2,0)","v":{"$error":"#N/A"}},{"$f":"Orders!B917/VLOOKUP(B917,Tools!A:C,3,0)","v":{"$error":"#N/A"}},{"$f":"Orders!C917/VLOOKUP(B917,Tools!A:C,3,0)","v":{"$error":"#N/A"}},{"$f":"Orders!D917/VLOOKUP(B917,Tools!A:C,3,0)","v":{"$error":"#N/A"}}]
[{"$f":"Orders!A918","v":0},{"$f":"VLOOKUP(A918,'Product-tool'!A:B,2,0)","v":{"$error":"#N/A"}},{"$f":"Orders!B918/VLOOKUP(B918,Tools!A:C,3,0)","v":{"$error":"#N/A"}},{"$f":"Orders!C918/VLOOKUP(B918,Tools!A:C,3,0)","v":{"$error":"#N/A"}},{"$f":"Orders!D918/VLOOKUP(B918,Tools!A:C,3,0)","v":{"$error":"#N/A"}}]
[{"$f":"Orders!A919","v":0},{"$f":"VLOOKUP(A919,'Product-tool'!A:B,2,0)","v":{"$error":"#N/A"}},{"$f":"Orders!B919/VLOOKUP(B919,Tools!A:C,3,0)","v":{"$error":"#N/A"}},{"$f":"Orders!C919/VLOOKUP(B919,Tools!A:C,3,0)","v":{"$error":"#N/A"}},{"$f":"Orders!D919/VLOOKUP(B919,Tools!A:C,3,0)","v":{"$error":"#N/A"}}]
[{"$f":"Orders!A920","v":0},{"$f":"VLOOKUP(A920,'Product-tool'!A:B,2,0)","v":{"$error":"#N/A"}},{"$f":"Orders!B920/VLOOKUP(B920,Tools!A:C,3,0)","v":{"$error":"#N/A"}},{"$f":"Orders!C920/VLOOKUP(B920,Tools!A:C,3,0)","v":{"$error":"#N/A"}},{"$f":"Orders!D920/VLOOKUP(B920,Tools!A:C,3,0)","v":{"$error":"#N/A"}}]
[{"$f":"Orders!A921","v":0},{"$f":"VLOOKUP(A921,'Product-tool'!A:B,2,0)","v":{"$error":"#N/A"}},{"$f":"Orders!B921/VLOOKUP(B921,Tools!A:C,3,0)","v":{"$error":"#N/A"}},{"$f":"Orders!C921/VLOOKUP(B921,Tools!A:C,3,0)","v":{"$error":"#N/A"}},{"$f":"Orders!D921/VLOOKUP(B921,Tools!A:C,3,0)","v":{"$error":"#N/A"}}]
[{"$f":"Orders!A922","v":0},{"$f":"VLOOKUP(A922,'Product-tool'!A:B,2,0)","v":{"$error":"#N/A"}},{"$f":"Orders!B922/VLOOKUP(B922,Tools!A:C,3,0)","v":{"$error":"#N/A"}},{"$f":"Orders!C922/VLOOKUP(B922,Tools!A:C,3,0)","v":{"$error":"#N/A"}},{"$f":"Orders!D922/VLOOKUP(B922,Tools!A:C,3,0)","v":{"$error":"#N/A"}}]
[{"$f":"Orders!A923","v":0},{"$f":"VLOOKUP(A923,'Product-tool'!A:B,2,0)","v":{"$error":"#N/A"}},{"$f":"Orders!B923/VLOOKUP(B923,Tools!A:C,3,0)","v":{"$error":"#N/A"}},{"$f":"Orders!C923/VLOOKUP(B923,Tools!A:C,3,0)","v":{"$error":"#N/A"}},{"$f":"Orders!D923/VLOOKUP(B923,Tools!A:C,3,0)","v":{"$error":"#N/A"}}]
[{"$f":"Orders!A924","v":0},{"$f":"VLOOKUP(A924,'Product-tool'!A:B,2,0)","v":{"$error":"#N/A"}},{"$f":"Orders!B924/VLOOKUP(B924,Tools!A:C,3,0)","v":{"$error":"#N/A"}},{"$f":"Orders!C924/VLOOKUP(B924,Tools!A:C,3,0)","v":{"$error":"#N/A"}},{"$f":"Orders!D924/VLOOKUP(B924,Tools!A:C,3,0)","v":{"$error":"#N/A"}}]
[{"$f":"Orders!A925","v":0},{"$f":"VLOOKUP(A925,'Product-tool'!A:B,2,0)","v":{"$error":"#N/A"}},{"$f":"Orders!B925/VLOOKUP(B925,Tools!A:C,3,0)","v":{"$error":"#N/A"}},{"$f":"Orders!C925/VLOOKUP(B925,Tools!A:C,3,0)","v":{"$error":"#N/A"}},{"$f":"Orders!D925/VLOOKUP(B925,Tools!A:C,3,0)","v":{"$error":"#N/A"}}]
[{"$f":"Orders!A926","v":0},{"$f":"VLOOKUP(A926,'Product-tool'!A:B,2,0)","v":{"$error":"#N/A"}},{"$f":"Orders!B926/VLOOKUP(B926,Tools!A:C,3,0)","v":{"$error":"#N/A"}},{"$f":"Orders!C926/VLOOKUP(B926,Tools!A:C,3,0)","v":{"$error":"#N/A"}},{"$f":"Orders!D926/VLOOKUP(B926,Tools!A:C,3,0)","v":{"$error":"#N/A"}}]
[{"$f":"Orders!A927","v":0},{"$f":"VLOOKUP(A927,'Product-tool'!A:B,2,0)","v":{"$error":"#N/A"}},{"$f":"Orders!B927/VLOOKUP(B927,Tools!A:C,3,0)","v":{"$error":"#N/A"}},{"$f":"Orders!C927/VLOOKUP(B927,Tools!A:C,3,0)","v":{"$error":"#N/A"}},{"$f":"Orders!D927/VLOOKUP(B927,Tools!A:C,3,0)","v":{"$error":"#N/A"}}]
[{"$f":"Orders!A928","v":0},{"$f":"VLOOKUP(A928,'Product-tool'!A:B,2,0)","v":{"$error":"#N/A"}},{"$f":"Orders!B928/VLOOKUP(B928,Tools!A:C,3,0)","v":{"$error":"#N/A"}},{"$f":"Orders!C928/VLOOKUP(B928,Tools!A:C,3,0)","v":{"$error":"#N/A"}},{"$f":"Orders!D928/VLOOKUP(B928,Tools!A:C,3,0)","v":{"$error":"#N/A"}}]
[{"$f":"Orders!A929","v":0},{"$f":"VLOOKUP(A929,'Product-tool'!A:B,2,0)","v":{"$error":"#N/A"}},{"$f":"Orders!B929/VLOOKUP(B929,Tools!A:C,3,0)","v":{"$error":"#N/A"}},{"$f":"Orders!C929/VLOOKUP(B929,Tools!A:C,3,0)","v":{"$error":"#N/A"}},{"$f":"Orders!D929/VLOOKUP(B929,Tools!A:C,3,0)","v":{"$error":"#N/A"}}]
[{"$f":"Orders!A930","v":0},{"$f":"VLOOKUP(A930,'Product-tool'!A:B,2,0)","v":{"$error":"#N/A"}},{"$f":"Orders!B930/VLOOKUP(B930,Tools!A:C,3,0)","v":{"$error":"#N/A"}},{"$f":"Orders!C930/VLOOKUP(B930,Tools!A:C,3,0)","v":{"$error":"#N/A"}},{"$f":"Orders!D930/VLOOKUP(B930,Tools!A:C,3,0)","v":{"$error":"#N/A"}}]
[{"$f":"Orders!A931","v":0},{"$f":"VLOOKUP(A931,'Product-tool'!A:B,2,0)","v":{"$error":"#N/A"}},{"$f":"Orders!B931/VLOOKUP(B931,Tools!A:C,3,0)","v":{"$error":"#N/A"}},{"$f":"Orders!C931/VLOOKUP(B931,Tools!A:C,3,0)","v":{"$error":"#N/A"}},{"$f":"Orders!D931/VLOOKUP(B931,Tools!A:C,3,0)","v":{"$error":"#N/A"}}]
[{"$f":"Orders!A932","v":0},{"$f":"VLOOKUP(A932,'Product-tool'!A:B,2,0)","v":{"$error":"#N/A"}},{"$f":"Orders!B932/VLOOKUP(B932,Tools!A:C,3,0)","v":{"$error":"#N/A"}},{"$f":"Orders!C932/VLOOKUP(B932,Tools!A:C,3,0)","v":{"$error":"#N/A"}},{"$f":"Orders!D932/VLOOKUP(B932,Tools!A:C,3,0)","v":{"$error":"#N/A"}}]
[{"$f":"Orders!A933","v":0},{"$f":"VLOOKUP(A933,'Product-tool'!A:B,2,0)","v":{"$error":"#N/A"}},{"$f":"Orders!B933/VLOOKUP(B933,Tools!A:C,3,0)","v":{"$error":"#N/A"}},{"$f":"Orders!C933/VLOOKUP(B933,Tools!A:C,3,0)","v":{"$error":"#N/A"}},{"$f":"Orders!D933/VLOOKUP(B933,Tools!A:C,3,0)","v":{"$error":"#N/A"}}]
[{"$f":"Orders!A934","v":0},{"$f":"VLOOKUP(A934,'Product-tool'!A:B,2,0)","v":{"$error":"#N/A"}},{"$f":"Orders!B934/VLOOKUP(B934,Tools!A:C,3,0)","v":{"$error":"#N/A"}},{"$f":"Orders!C934/VLOOKUP(B934,Tools!A:C,3,0)","v":{"$error":"#N/A"}},{"$f":"Orders!D934/VLOOKUP(B934,Tools!A:C,3,0)","v":{"$error":"#N/A"}}]
[{"$f":"Orders!A935","v":0},{"$f":"VLOOKUP(A935,'Product-tool'!A:B,2,0)","v":{"$error":"#N/A"}},{"$f":"Orders!B935/VLOOKUP(B935,Tools!A:C,3,0)","v":{"$error":"#N/A"}},{"$f":"Orders!C935/VLOOKUP(B935,Tools!A:C,3,0)","v":{"$error":"#N/A"}},{"$f":"Orders!D935/VLOOKUP(B935,Tools!A:C,3,0)","v":{"$error":"#N/A"}}]
[{"$f":"Orders!A936","v":0},{"$f":"VLOOKUP(A936,'Product-tool'!A:B,2,0)","v":{"$error":"#N/A"}},{"$f":"Orders!B936/VLOOKUP(B936,Tools!A:C,3,0)","v":{"$error":"#N/A"}},{"$f":"Orders!C936/VLOOKUP(B936,Tools!A:C,3,0)","v":{"$error":"#N/A"}},{"$f":"Orders!D936/VLOOKUP(B936,Tools!A:C,3,0)","v":{"$error":"#N/A"}}]
[{"$f":"Orders!A937","v":0},{"$f":"VLOOKUP(A937,'Product-tool'!A:B,2,0)","v":{"$error":"#N/A"}},{"$f":"Orders!B937/VLOOKUP(B937,Tools!A:C,3,0)","v":{"$error":"#N/A"}},{"$f":"Orders!C937/VLOOKUP(B937,Tools!A:C,3,0)","v":{"$error":"#N/A"}},{"$f":"Orders!D937/VLOOKUP(B937,Tools!A:C,3,0)","v":{"$error":"#N/A"}}]
[{"$f":"Orders!A938","v":0},{"$f":"VLOOKUP(A938,'Product-tool'!A:B,2,0)","v":{"$error":"#N/A"}},{"$f":"Orders!B938/VLOOKUP(B938,Tools!A:C,3,0)","v":{"$error":"#N/A"}},{"$f":"Orders!C938/VLOOKUP(B938,Tools!A:C,3,0)","v":{"$error":"#N/A"}},{"$f":"Orders!D938/VLOOKUP(B938,Tools!A:C,3,0)","v":{"$error":"#N/A"}}]
[{"$f":"Orders!A939","v":0},{"$f":"VLOOKUP(A939,'Product-tool'!A:B,2,0)","v":{"$error":"#N/A"}},{"$f":"Orders!B939/VLOOKUP(B939,Tools!A:C,3,0)","v":{"$error":"#N/A"}},{"$f":"Orders!C939/VLOOKUP(B939,Tools!A:C,3,0)","v":{"$error":"#N/A"}},{"$f":"Orders!D939/VLOOKUP(B939,Tools!A:C,3,0)","v":{"$error":"#N/A"}}]
[{"$f":"Orders!A940","v":0},{"$f":"VLOOKUP(A940,'Product-tool'!A:B,2,0)","v":{"$error":"#N/A"}},{"$f":"Orders!B940/VLOOKUP(B940,Tools!A:C,3,0)","v":{"$error":"#N/A"}},{"$f":"Orders!C940/VLOOKUP(B940,Tools!A:C,3,0)","v":{"$error":"#N/A"}},{"$f":"Orders!D940/VLOOKUP(B940,Tools!A:C,3,0)","v":{"$error":"#N/A"}}]
[{"$f":"Orders!A941","v":0},{"$f":"VLOOKUP(A941,'Product-tool'!A:B,2,0)","v":{"$error":"#N/A"}},{"$f":"Orders!B941/VLOOKUP(B941,Tools!A:C,3,0)","v":{"$error":"#N/A"}},{"$f":"Orders!C941/VLOOKUP(B941,Tools!A:C,3,0)","v":{"$error":"#N/A"}},{"$f":"Orders!D941/VLOOKUP(B941,Tools!A:C,3,0)","v":{"$error":"#N/A"}}]
[{"$f":"Orders!A942","v":0},{"$f":"VLOOKUP(A942,'Product-tool'!A:B,2,0)","v":{"$error":"#N/A"}},{"$f":"Orders!B942/VLOOKUP(B942,Tools!A:C,3,0)","v":{"$error":"#N/A"}},{"$f":"Orders!C942/VLOOKUP(B942,Tools!A:C,3,0)","v":{"$error":"#N/A"}},{"$f":"Orders!D942/VLOOKUP(B942,Tools!A:C,3,0)","v":{"$error":"#N/A"}}]
[{"$f":"Orders!A943","v":0},{"$f":"VLOOKUP(A943,'Product-tool'!A:B,2,0)","v":{"$error":"#N/A"}},{"$f":"Orders!B943/VLOOKUP(B943,Tools!A:C,3,0)","v":{"$error":"#N/A"}},{"$f":"Orders!C943/VLOOKUP(B943,Tools!A:C,3,0)","v":{"$error":"#N/A"}},{"$f":"Orders!D943/VLOOKUP(B943,Tools!A:C,3,0)","v":{"$error":"#N/A"}}]
[{"$f":"Orders!A944","v":0},{"$f":"VLOOKUP(A944,'Product-tool'!A:B,2,0)","v":{"$error":"#N/A"}},{"$f":"Orders!B944/VLOOKUP(B944,Tools!A:C,3,0)","v":{"$error":"#N/A"}},{"$f":"Orders!C944/VLOOKUP(B944,Tools!A:C,3,0)","v":{"$error":"#N/A"}},{"$f":"Orders!D944/VLOOKUP(B944,Tools!A:C,3,0)","v":{"$error":"#N/A"}}]
[{"$f":"Orders!A945","v":0},{"$f":"VLOOKUP(A945,'Product-tool'!A:B,2,0)","v":{"$error":"#N/A"}},{"$f":"Orders!B945/VLOOKUP(B945,Tools!A:C,3,0)","v":{"$error":"#N/A"}},{"$f":"Orders!C945/VLOOKUP(B945,Tools!A:C,3,0)","v":{"$error":"#N/A"}},{"$f":"Orders!D945/VLOOKUP(B945,Tools!A:C,3,0)","v":{"$error":"#N/A"}}]
[{"$f":"Orders!A946","v":0},{"$f":"VLOOKUP(A946,'Product-tool'!A:B,2,0)","v":{"$error":"#N/A"}},{"$f":"Orders!B946/VLOOKUP(B946,Tools!A:C,3,0)","v":{"$error":"#N/A"}},{"$f":"Orders!C946/VLOOKUP(B946,Tools!A:C,3,0)","v":{"$error":"#N/A"}},{"$f":"Orders!D946/VLOOKUP(B946,Tools!A:C,3,0)","v":{"$error":"#N/A"}}]
[{"$f":"Orders!A947","v":0},{"$f":"VLOOKUP(A947,'Product-tool'!A:B,2,0)","v":{"$error":"#N/A"}},{"$f":"Orders!B947/VLOOKUP(B947,Tools!A:C,3,0)","v":{"$error":"#N/A"}},{"$f":"Orders!C947/VLOOKUP(B947,Tools!A:C,3,0)","v":{"$error":"#N/A"}},{"$f":"Orders!D947/VLOOKUP(B947,Tools!A:C,3,0)","v":{"$error":"#N/A"}}]
[{"$f":"Orders!A948","v":0},{"$f":"VLOOKUP(A948,'Product-tool'!A:B,2,0)","v":{"$error":"#N/A"}},{"$f":"Orders!B948/VLOOKUP(B948,Tools!A:C,3,0)","v":{"$error":"#N/A"}},{"$f":"Orders!C948/VLOOKUP(B948,Tools!A:C,3,0)","v":{"$error":"#N/A"}},{"$f":"Orders!D948/VLOOKUP(B948,Tools!A:C,3,0)","v":{"$error":"#N/A"}}]
[{"$f":"Orders!A949","v":0},{"$f":"VLOOKUP(A949,'Product-tool'!A:B,2,0)","v":{"$error":"#N/A"}},{"$f":"Orders!B949/VLOOKUP(B949,Tools!A:C,3,0)","v":{"$error":"#N/A"}},{"$f":"Orders!C949/VLOOKUP(B949,Tools!A:C,3,0)","v":{"$error":"#N/A"}},{"$f":"Orders!D949/VLOOKUP(B949,Tools!A:C,3,0)","v":{"$error":"#N/A"}}]
[{"$f":"Orders!A950","v":0},{"$f":"VLOOKUP(A950,'Product-tool'!A:B,2,0)","v":{"$error":"#N/A"}},{"$f":"Orders!B950/VLOOKUP(B950,Tools!A:C,3,0)","v":{"$error":"#N/A"}},{"$f":"Orders!C950/VLOOKUP(B950,Tools!A:C,3,0)","v":{"$error":"#N/A"}},{"$f":"Orders!D950/VLOOKUP(B950,Tools!A:C,3,0)","v":{"$error":"#N/A"}}]
[{"$f":"Orders!A951","v":0},{"$f":"VLOOKUP(A951,'Product-tool'!A:B,2,0)","v":{"$error":"#N/A"}},{"$f":"Orders!B951/VLOOKUP(B951,Tools!A:C,3,0)","v":{"$error":"#N/A"}},{"$f":"Orders!C951/VLOOKUP(B951,Tools!A:C,3,0)","v":{"$error":"#N/A"}},{"$f":"Orders!D951/VLOOKUP(B951,Tools!A:C,3,0)","v":{"$error":"#N/A"}}]
[{"$f":"Orders!A952","v":0},{"$f":"VLOOKUP(A952,'Product-tool'!A:B,2,0)","v":{"$error":"#N/A"}},{"$f":"Orders!B952/VLOOKUP(B952,Tools!A:C,3,0)","v":{"$error":"#N/A"}},{"$f":"Orders!C952/VLOOKUP(B952,Tools!A:C,3,0)","v":{"$error":"#N/A"}},{"$f":"Orders!D952/VLOOKUP(B952,Tools!A:C,3,0)","v":{"$error":"#N/A"}}]
[{"$f":"Orders!A953","v":0},{"$f":"VLOOKUP(A953,'Product-tool'!A:B,2,0)","v":{"$error":"#N/A"}},{"$f":"Orders!B953/VLOOKUP(B953,Tools!A:C,3,0)","v":{"$error":"#N/A"}},{"$f":"Orders!C953/VLOOKUP(B953,Tools!A:C,3,0)","v":{"$error":"#N/A"}},{"$f":"Orders!D953/VLOOKUP(B953,Tools!A:C,3,0)","v":{"$error":"#N/A"}}]
[{"$f":"Orders!A954","v":0},{"$f":"VLOOKUP(A954,'Product-tool'!A:B,2,0)","v":{"$error":"#N/A"}},{"$f":"Orders!B954/VLOOKUP(B954,Tools!A:C,3,0)","v":{"$error":"#N/A"}},{"$f":"Orders!C954/VLOOKUP(B954,Tools!A:C,3,0)","v":{"$error":"#N/A"}},{"$f":"Orders!D954/VLOOKUP(B954,Tools!A:C,3,0)","v":{"$error":"#N/A"}}]
[{"$f":"Orders!A955","v":0},{"$f":"VLOOKUP(A955,'Product-tool'!A:B,2,0)","v":{"$error":"#N/A"}},{"$f":"Orders!B955/VLOOKUP(B955,Tools!A:C,3,0)","v":{"$error":"#N/A"}},{"$f":"Orders!C955/VLOOKUP(B955,Tools!A:C,3,0)","v":{"$error":"#N/A"}},{"$f":"Orders!D955/VLOOKUP(B955,Tools!A:C,3,0)","v":{"$error":"#N/A"}}]
[{"$f":"Orders!A956","v":0},{"$f":"VLOOKUP(A956,'Product-tool'!A:B,2,0)","v":{"$error":"#N/A"}},{"$f":"Orders!B956/VLOOKUP(B956,Tools!A:C,3,0)","v":{"$error":"#N/A"}},{"$f":"Orders!C956/VLOOKUP(B956,Tools!A:C,3,0)","v":{"$error":"#N/A"}},{"$f":"Orders!D956/VLOOKUP(B956,Tools!A:C,3,0)","v":{"$error":"#N/A"}}]
[{"$f":"Orders!A957","v":0},{"$f":"VLOOKUP(A957,'Product-tool'!A:B,2,0)","v":{"$error":"#N/A"}},{"$f":"Orders!B957/VLOOKUP(B957,Tools!A:C,3,0)","v":{"$error":"#N/A"}},{"$f":"Orders!C957/VLOOKUP(B957,Tools!A:C,3,0)","v":{"$error":"#N/A"}},{"$f":"Orders!D957/VLOOKUP(B957,Tools!A:C,3,0)","v":{"$error":"#N/A"}}]
[{"$f":"Orders!A958","v":0},{"$f":"VLOOKUP(A958,'Product-tool'!A:B,2,0)","v":{"$error":"#N/A"}},{"$f":"Orders!B958/VLOOKUP(B958,Tools!A:C,3,0)","v":{"$error":"#N/A"}},{"$f":"Orders!C958/VLOOKUP(B958,Tools!A:C,3,0)","v":{"$error":"#N/A"}},{"$f":"Orders!D958/VLOOKUP(B958,Tools!A:C,3,0)","v":{"$error":"#N/A"}}]
[{"$f":"Orders!A959","v":0},{"$f":"VLOOKUP(A959,'Product-tool'!A:B,2,0)","v":{"$error":"#N/A"}},{"$f":"Orders!B959/VLOOKUP(B959,Tools!A:C,3,0)","v":{"$error":"#N/A"}},{"$f":"Orders!C959/VLOOKUP(B959,Tools!A:C,3,0)","v":{"$error":"#N/A"}},{"$f":"Orders!D959/VLOOKUP(B959,Tools!A:C,3,0)","v":{"$error":"#N/A"}}]
[{"$f":"Orders!A960","v":0},{"$f":"VLOOKUP(A960,'Product-tool'!A:B,2,0)","v":{"$error":"#N/A"}},{"$f":"Orders!B960/VLOOKUP(B960,Tools!A:C,3,0)","v":{"$error":"#N/A"}},{"$f":"Orders!C960/VLOOKUP(B960,Tools!A:C,3,0)","v":{"$error":"#N/A"}},{"$f":"Orders!D960/VLOOKUP(B960,Tools!A:C,3,0)","v":{"$error":"#N/A"}}]
[{"$f":"Orders!A961","v":0},{"$f":"VLOOKUP(A961,'Product-tool'!A:B,2,0)","v":{"$error":"#N/A"}},{"$f":"Orders!B961/VLOOKUP(B961,Tools!A:C,3,0)","v":{"$error":"#N/A"}},{"$f":"Orders!C961/VLOOKUP(B961,Tools!A:C,3,0)","v":{"$error":"#N/A"}},{"$f":"Orders!D961/VLOOKUP(B961,Tools!A:C,3,0)","v":{"$error":"#N/A"}}]
[{"$f":"Orders!A962","v":0},{"$f":"VLOOKUP(A962,'Product-tool'!A:B,2,0)","v":{"$error":"#N/A"}},{"$f":"Orders!B962/VLOOKUP(B962,Tools!A:C,3,0)","v":{"$error":"#N/A"}},{"$f":"Orders!C962/VLOOKUP(B962,Tools!A:C,3,0)","v":{"$error":"#N/A"}},{"$f":"Orders!D962/VLOOKUP(B962,Tools!A:C,3,0)","v":{"$error":"#N/A"}}]
[{"$f":"Orders!A963","v":0},{"$f":"VLOOKUP(A963,'Product-tool'!A:B,2,0)","v":{"$error":"#N/A"}},{"$f":"Orders!B963/VLOOKUP(B963,Tools!A:C,3,0)","v":{"$error":"#N/A"}},{"$f":"Orders!C963/VLOOKUP(B963,Tools!A:C,3,0)","v":{"$error":"#N/A"}},{"$f":"Orders!D963/VLOOKUP(B963,Tools!A:C,3,0)","v":{"$error":"#N/A"}}]
[{"$f":"Orders!A964","v":0},{"$f":"VLOOKUP(A964,'Product-tool'!A:B,2,0)","v":{"$error":"#N/A"}},{"$f":"Orders!B964/VLOOKUP(B964,Tools!A:C,3,0)","v":{"$error":"#N/A"}},{"$f":"Orders!C964/VLOOKUP(B964,Tools!A:C,3,0)","v":{"$error":"#N/A"}},{"$f":"Orders!D964/VLOOKUP(B964,Tools!A:C,3,0)","v":{"$error":"#N/A"}}]
[{"$f":"Orders!A965","v":0},{"$f":"VLOOKUP(A965,'Product-tool'!A:B,2,0)","v":{"$error":"#N/A"}},{"$f":"Orders!B965/VLOOKUP(B965,Tools!A:C,3,0)","v":{"$error":"#N/A"}},{"$f":"Orders!C965/VLOOKUP(B965,Tools!A:C,3,0)","v":{"$error":"#N/A"}},{"$f":"Orders!D965/VLOOKUP(B965,Tools!A:C,3,0)","v":{"$error":"#N/A"}}]
[{"$f":"Orders!A966","v":0},{"$f":"VLOOKUP(A966,'Product-tool'!A:B,2,0)","v":{"$error":"#N/A"}},{"$f":"Orders!B966/VLOOKUP(B966,Tools!A:C,3,0)","v":{"$error":"#N/A"}},{"$f":"Orders!C966/VLOOKUP(B966,Tools!A:C,3,0)","v":{"$error":"#N/A"}},{"$f":"Orders!D966/VLOOKUP(B966,Tools!A:C,3,0)","v":{"$error":"#N/A"}}]
[{"$f":"Orders!A967","v":0},{"$f":"VLOOKUP(A967,'Product-tool'!A:B,2,0)","v":{"$error":"#N/A"}},{"$f":"Orders!B967/VLOOKUP(B967,Tools!A:C,3,0)","v":{"$error":"#N/A"}},{"$f":"Orders!C967/VLOOKUP(B967,Tools!A:C,3,0)","v":{"$error":"#N/A"}},{"$f":"Orders!D967/VLOOKUP(B967,Tools!A:C,3,0)","v":{"$error":"#N/A"}}]
[{"$f":"Orders!A968","v":0},{"$f":"VLOOKUP(A968,'Product-tool'!A:B,2,0)","v":{"$error":"#N/A"}},{"$f":"Orders!B968/VLOOKUP(B968,Tools!A:C,3,0)","v":{"$error":"#N/A"}},{"$f":"Orders!C968/VLOOKUP(B968,Tools!A:C,3,0)","v":{"$error":"#N/A"}},{"$f":"Orders!D968/VLOOKUP(B968,Tools!A:C,3,0)","v":{"$error":"#N/A"}}]
[{"$f":"Orders!A969","v":0},{"$f":"VLOOKUP(A969,'Product-tool'!A:B,2,0)","v":{"$error":"#N/A"}},{"$f":"Orders!B969/VLOOKUP(B969,Tools!A:C,3,0)","v":{"$error":"#N/A"}},{"$f":"Orders!C969/VLOOKUP(B969,Tools!A:C,3,0)","v":{"$error":"#N/A"}},{"$f":"Orders!D969/VLOOKUP(B969,Tools!A:C,3,0)","v":{"$error":"#N/A"}}]
[{"$f":"Orders!A970","v":0},{"$f":"VLOOKUP(A970,'Product-tool'!A:B,2,0)","v":{"$error":"#N/A"}},{"$f":"Orders!B970/VLOOKUP(B970,Tools!A:C,3,0)","v":{"$error":"#N/A"}},{"$f":"Orders!C970/VLOOKUP(B970,Tools!A:C,3,0)","v":{"$error":"#N/A"}},{"$f":"Orders!D970/VLOOKUP(B970,Tools!A:C,3,0)","v":{"$error":"#N/A"}}]
[{"$f":"Orders!A971","v":0},{"$f":"VLOOKUP(A971,'Product-tool'!A:B,2,0)","v":{"$error":"#N/A"}},{"$f":"Orders!B971/VLOOKUP(B971,Tools!A:C,3,0)","v":{"$error":"#N/A"}},{"$f":"Orders!C971/VLOOKUP(B971,Tools!A:C,3,0)","v":{"$error":"#N/A"}},{"$f":"Orders!D971/VLOOKUP(B971,Tools!A:C,3,0)","v":{"$error":"#N/A"}}]
[{"$f":"Orders!A972","v":0},{"$f":"VLOOKUP(A972,'Product-tool'!A:B,2,0)","v":{"$error":"#N/A"}},{"$f":"Orders!B972/VLOOKUP(B972,Tools!A:C,3,0)","v":{"$error":"#N/A"}},{"$f":"Orders!C972/VLOOKUP(B972,Tools!A:C,3,0)","v":{"$error":"#N/A"}},{"$f":"Orders!D972/VLOOKUP(B972,Tools!A:C,3,0)","v":{"$error":"#N/A"}}]
[{"$f":"Orders!A973","v":0},{"$f":"VLOOKUP(A973,'Product-tool'!A:B,2,0)","v":{"$error":"#N/A"}},{"$f":"Orders!B973/VLOOKUP(B973,Tools!A:C,3,0)","v":{"$error":"#N/A"}},{"$f":"Orders!C973/VLOOKUP(B973,Tools!A:C,3,0)","v":{"$error":"#N/A"}},{"$f":"Orders!D973/VLOOKUP(B973,Tools!A:C,3,0)","v":{"$error":"#N/A"}}]
[{"$f":"Orders!A974","v":0},{"$f":"VLOOKUP(A974,'Product-tool'!A:B,2,0)","v":{"$error":"#N/A"}},{"$f":"Orders!B974/VLOOKUP(B974,Tools!A:C,3,0)","v":{"$error":"#N/A"}},{"$f":"Orders!C974/VLOOKUP(B974,Tools!A:C,3,0)","v":{"$error":"#N/A"}},{"$f":"Orders!D974/VLOOKUP(B974,Tools!A:C,3,0)","v":{"$error":"#N/A"}}]
[{"$f":"Orders!A975","v":0},{"$f":"VLOOKUP(A975,'Product-tool'!A:B,2,0)","v":{"$error":"#N/A"}},{"$f":"Orders!B975/VLOOKUP(B975,Tools!A:C,3,0)","v":{"$error":"#N/A"}},{"$f":"Orders!C975/VLOOKUP(B975,Tools!A:C,3,0)","v":{"$error":"#N/A"}},{"$f":"Orders!D975/VLOOKUP(B975,Tools!A:C,3,0)","v":{"$error":"#N/A"}}]
[{"$f":"Orders!A976","v":0},{"$f":"VLOOKUP(A976,'Product-tool'!A:B,2,0)","v":{"$error":"#N/A"}},{"$f":"Orders!B976/VLOOKUP(B976,Tools!A:C,3,0)","v":{"$error":"#N/A"}},{"$f":"Orders!C976/VLOOKUP(B976,Tools!A:C,3,0)","v":{"$error":"#N/A"}},{"$f":"Orders!D976/VLOOKUP(B976,Tools!A:C,3,0)","v":{"$error":"#N/A"}}]
[{"$f":"Orders!A977","v":0},{"$f":"VLOOKUP(A977,'Product-tool'!A:B,2,0)","v":{"$error":"#N/A"}},{"$f":"Orders!B977/VLOOKUP(B977,Tools!A:C,3,0)","v":{"$error":"#N/A"}},{"$f":"Orders!C977/VLOOKUP(B977,Tools!A:C,3,0)","v":{"$error":"#N/A"}},{"$f":"Orders!D977/VLOOKUP(B977,Tools!A:C,3,0)","v":{"$error":"#N/A"}}]
[{"$f":"Orders!A978","v":0},{"$f":"VLOOKUP(A978,'Product-tool'!A:B,2,0)","v":{"$error":"#N/A"}},{"$f":"Orders!B978/VLOOKUP(B978,Tools!A:C,3,0)","v":{"$error":"#N/A"}},{"$f":"Orders!C978/VLOOKUP(B978,Tools!A:C,3,0)","v":{"$error":"#N/A"}},{"$f":"Orders!D978/VLOOKUP(B978,Tools!A:C,3,0)","v":{"$error":"#N/A"}}]
[{"$f":"Orders!A979","v":0},{"$f":"VLOOKUP(A979,'Product-tool'!A:B,2,0)","v":{"$error":"#N/A"}},{"$f":"Orders!B979/VLOOKUP(B979,Tools!A:C,3,0)","v":{"$error":"#N/A"}},{"$f":"Orders!C979/VLOOKUP(B979,Tools!A:C,3,0)","v":{"$error":"#N/A"}},{"$f":"Orders!D979/VLOOKUP(B979,Tools!A:C,3,0)","v":{"$error":"#N/A"}}]
[{"$f":"Orders!A980","v":0},{"$f":"VLOOKUP(A980,'Product-tool'!A:B,2,0)","v":{"$error":"#N/A"}},{"$f":"Orders!B980/VLOOKUP(B980,Tools!A:C,3,0)","v":{"$error":"#N/A"}},{"$f":"Orders!C980/VLOOKUP(B980,Tools!A:C,3,0)","v":{"$error":"#N/A"}},{"$f":"Orders!D980/VLOOKUP(B980,Tools!A:C,3,0)","v":{"$error":"#N/A"}}]
[{"$f":"Orders!A981","v":0},{"$f":"VLOOKUP(A981,'Product-tool'!A:B,2,0)","v":{"$error":"#N/A"}},{"$f":"Orders!B981/VLOOKUP(B981,Tools!A:C,3,0)","v":{"$error":"#N/A"}},{"$f":"Orders!C981/VLOOKUP(B981,Tools!A:C,3,0)","v":{"$error":"#N/A"}},{"$f":"Orders!D981/VLOOKUP(B981,Tools!A:C,3,0)","v":{"$error":"#N/A"}}]
[{"$f":"Orders!A982","v":0},{"$f":"VLOOKUP(A982,'Product-tool'!A:B,2,0)","v":{"$error":"#N/A"}},{"$f":"Orders!B982/VLOOKUP(B982,Tools!A:C,3,0)","v":{"$error":"#N/A"}},{"$f":"Orders!C982/VLOOKUP(B982,Tools!A:C,3,0)","v":{"$error":"#N/A"}},{"$f":"Orders!D982/VLOOKUP(B982,Tools!A:C,3,0)","v":{"$error":"#N/A"}}]
[{"$f":"Orders!A983","v":0},{"$f":"VLOOKUP(A983,'Product-tool'!A:B,2,0)","v":{"$error":"#N/A"}},{"$f":"Orders!B983/VLOOKUP(B983,Tools!A:C,3,0)","v":{"$error":"#N/A"}},{"$f":"Orders!C983/VLOOKUP(B983,Tools!A:C,3,0)","v":{"$error":"#N/A"}},{"$f":"Orders!D983/VLOOKUP(B983,Tools!A:C,3,0)","v":{"$error":"#N/A"}}]
[{"$f":"Orders!A984","v":0},{"$f":"VLOOKUP(A984,'Product-tool'!A:B,2,0)","v":{"$error":"#N/A"}},{"$f":"Orders!B984/VLOOKUP(B984,Tools!A:C,3,0)","v":{"$error":"#N/A"}},{"$f":"Orders!C984/VLOOKUP(B984,Tools!A:C,3,0)","v":{"$error":"#N/A"}},{"$f":"Orders!D984/VLOOKUP(B984,Tools!A:C,3,0)","v":{"$error":"#N/A"}}]
[{"$f":"Orders!A985","v":0},{"$f":"VLOOKUP(A985,'Product-tool'!A:B,2,0)","v":{"$error":"#N/A"}},{"$f":"Orders!B985/VLOOKUP(B985,Tools!A:C,3,0)","v":{"$error":"#N/A"}},{"$f":"Orders!C985/VLOOKUP(B985,Tools!A:C,3,0)","v":{"$error":"#N/A"}},{"$f":"Orders!D985/VLOOKUP(B985,Tools!A:C,3,0)","v":{"$error":"#N/A"}}]
[{"$f":"Orders!A986","v":0},{"$f":"VLOOKUP(A986,'Product-tool'!A:B,2,0)","v":{"$error":"#N/A"}},{"$f":"Orders!B986/VLOOKUP(B986,Tools!A:C,3,0)","v":{"$error":"#N/A"}},{"$f":"Orders!C986/VLOOKUP(B986,Tools!A:C,3,0)","v":{"$error":"#N/A"}},{"$f":"Orders!D986/VLOOKUP(B986,Tools!A:C,3,0)","v":{"$error":"#N/A"}}]
[{"$f":"Orders!A987","v":0},{"$f":"VLOOKUP(A987,'Product-tool'!A:B,2,0)","v":{"$error":"#N/A"}},{"$f":"Orders!B987/VLOOKUP(B987,Tools!A:C,3,0)","v":{"$error":"#N/A"}},{"$f":"Orders!C987/VLOOKUP(B987,Tools!A:C,3,0)","v":{"$error":"#N/A"}},{"$f":"Orders!D987/VLOOKUP(B987,Tools!A:C,3,0)","v":{"$error":"#N/A"}}]
[{"$f":"Orders!A988","v":0},{"$f":"VLOOKUP(A988,'Product-tool'!A:B,2,0)","v":{"$error":"#N/A"}},{"$f":"Orders!B988/VLOOKUP(B988,Tools!A:C,3,0)","v":{"$error":"#N/A"}},{"$f":"Orders!C988/VLOOKUP(B988,Tools!A:C,3,0)","v":{"$error":"#N/A"}},{"$f":"Orders!D988/VLOOKUP(B988,Tools!A:C,3,0)","v":{"$error":"#N/A"}}]
[{"$f":"Orders!A989","v":0},{"$f":"VLOOKUP(A989,'Product-tool'!A:B,2,0)","v":{"$error":"#N/A"}},{"$f":"Orders!B989/VLOOKUP(B989,Tools!A:C,3,0)","v":{"$error":"#N/A"}},{"$f":"Orders!C989/VLOOKUP(B989,Tools!A:C,3,0)","v":{"$error":"#N/A"}},{"$f":"Orders!D989/VLOOKUP(B989,Tools!A:C,3,0)","v":{"$error":"#N/A"}}]
[{"$f":"Orders!A990","v":0},{"$f":"VLOOKUP(A990,'Product-tool'!A:B,2,0)","v":{"$error":"#N/A"}},{"$f":"Orders!B990/VLOOKUP(B990,Tools!A:C,3,0)","v":{"$error":"#N/A"}},{"$f":"Orders!C990/VLOOKUP(B990,Tools!A:C,3,0)","v":{"$error":"#N/A"}},{"$f":"Orders!D990/VLOOKUP(B990,Tools!A:C,3,0)","v":{"$error":"#N/A"}}]
[{"$f":"Orders!A991","v":0},{"$f":"VLOOKUP(A991,'Product-tool'!A:B,2,0)","v":{"$error":"#N/A"}},{"$f":"Orders!B991/VLOOKUP(B991,Tools!A:C,3,0)","v":{"$error":"#N/A"}},{"$f":"Orders!C991/VLOOKUP(B991,Tools!A:C,3,0)","v":{"$error":"#N/A"}},{"$f":"Orders!D991/VLOOKUP(B991,Tools!A:C,3,0)","v":{"$error":"#N/A"}}]
[{"$f":"Orders!A992","v":0},{"$f":"VLOOKUP(A992,'Product-tool'!A:B,2,0)","v":{"$error":"#N/A"}},{"$f":"Orders!B992/VLOOKUP(B992,Tools!A:C,3,0)","v":{"$error":"#N/A"}},{"$f":"Orders!C992/VLOOKUP(B992,Tools!A:C,3,0)","v":{"$error":"#N/A"}},{"$f":"Orders!D992/VLOOKUP(B992,Tools!A:C,3,0)","v":{"$error":"#N/A"}}]
[{"$f":"Orders!A993","v":0},{"$f":"VLOOKUP(A993,'Product-tool'!A:B,2,0)","v":{"$error":"#N/A"}},{"$f":"Orders!B993/VLOOKUP(B993,Tools!A:C,3,0)","v":{"$error":"#N/A"}},{"$f":"Orders!C993/VLOOKUP(B993,Tools!A:C,3,0)","v":{"$error":"#N/A"}},{"$f":"Orders!D993/VLOOKUP(B993,Tools!A:C,3,0)","v":{"$error":"#N/A"}}]
[{"$f":"Orders!A994","v":0},{"$f":"VLOOKUP(A994,'Product-tool'!A:B,2,0)","v":{"$error":"#N/A"}},{"$f":"Orders!B994/VLOOKUP(B994,Tools!A:C,3,0)","v":{"$error":"#N/A"}},{"$f":"Orders!C994/VLOOKUP(B994,Tools!A:C,3,0)","v":{"$error":"#N/A"}},{"$f":"Orders!D994/VLOOKUP(B994,Tools!A:C,3,0)","v":{"$error":"#N/A"}}]
[{"$f":"Orders!A995","v":0},{"$f":"VLOOKUP(A995,'Product-tool'!A:B,2,0)","v":{"$error":"#N/A"}},{"$f":"Orders!B995/VLOOKUP(B995,Tools!A:C,3,0)","v":{"$error":"#N/A"}},{"$f":"Orders!C995/VLOOKUP(B995,Tools!A:C,3,0)","v":{"$error":"#N/A"}},{"$f":"Orders!D995/VLOOKUP(B995,Tools!A:C,3,0)","v":{"$error":"#N/A"}}]
[{"$f":"Orders!A996","v":0},{"$f":"VLOOKUP(A996,'Product-tool'!A:B,2,0)","v":{"$error":"#N/A"}},{"$f":"Orders!B996/VLOOKUP(B996,Tools!A:C,3,0)","v":{"$error":"#N/A"}},{"$f":"Orders!C996/VLOOKUP(B996,Tools!A:C,3,0)","v":{"$error":"#N/A"}},{"$f":"Orders!D996/VLOOKUP(B996,Tools!A:C,3,0)","v":{"$error":"#N/A"}}]
[{"$f":"Orders!A997","v":0},{"$f":"VLOOKUP(A997,'Product-tool'!A:B,2,0)","v":{"$error":"#N/A"}},{"$f":"Orders!B997/VLOOKUP(B997,Tools!A:C,3,0)","v":{"$error":"#N/A"}},{"$f":"Orders!C997/VLOOKUP(B997,Tools!A:C,3,0)","v":{"$error":"#N/A"}},{"$f":"Orders!D997/VLOOKUP(B997,Tools!A:C,3,0)","v":{"$error":"#N/A"}}]
[{"$f":"Orders!A998","v":0},{"$f":"VLOOKUP(A998,'Product-tool'!A:B,2,0)","v":{"$error":"#N/A"}},{"$f":"Orders!B998/VLOOKUP(B998,Tools!A:C,3,0)","v":{"$error":"#N/A"}},{"$f":"Orders!C998/VLOOKUP(B998,Tools!A:C,3,0)","v":{"$error":"#N/A"}},{"$f":"Orders!D998/VLOOKUP(B998,Tools!A:C,3,0)","v":{"$error":"#N/A"}}]
[{"$f":"Orders!A999","v":0},{"$f":"VLOOKUP(A999,'Product-tool'!A:B,2,0)","v":{"$error":"#N/A"}},{"$f":"Orders!B999/VLOOKUP(B999,Tools!A:C,3,0)","v":{"$error":"#N/A"}},{"$f":"Orders!C999/VLOOKUP(B999,Tools!A:C,3,0)","v":{"$error":"#N/A"}},{"$f":"Orders!D999/VLOOKUP(B999,Tools!A:C,3,0)","v":{"$error":"#N/A"}}]
[{"$f":"Orders!A1000","v":0},{"$f":"VLOOKUP(A1000,'Product-tool'!A:B,2,0)","v":{"$error":"#N/A"}},{"$f":"Orders!B1000/VLOOKUP(B1000,Tools!A:C,3,0)","v":{"$error":"#N/A"}},{"$f":"Orders!C1000/VLOOKUP(B1000,Tools!A:C,3,0)","v":{"$error":"#N/A"}},{"$f":"Orders!D1000/VLOOKUP(B1000,Tools!A:C,3,0)","v":{"$error":"#N/A"}}]
[{"$f":"Orders!A1001","v":0},{"$f":"VLOOKUP(A1001,'Product-tool'!A:B,2,0)","v":{"$error":"#N/A"}},{"$f":"Orders!B1001/VLOOKUP(B1001,Tools!A:C,3,0)","v":{"$error":"#N/A"}},{"$f":"Orders!C1001/VLOOKUP(B1001,Tools!A:C,3,0)","v":{"$error":"#N/A"}},{"$f":"Orders!D1001/VLOOKUP(B1001,Tools!A:C,3,0)","v":{"$error":"#N/A"}}]
[{"$f":"Orders!A1002","v":0},{"$f":"VLOOKUP(A1002,'Product-tool'!A:B,2,0)","v":{"$error":"#N/A"}},{"$f":"Orders!B1002/VLOOKUP(B1002,Tools!A:C,3,0)","v":{"$error":"#N/A"}},{"$f":"Orders!C1002/VLOOKUP(B1002,Tools!A:C,3,0)","v":{"$error":"#N/A"}},{"$f":"Orders!D1002/VLOOKUP(B1002,Tools!A:C,3,0)","v":{"$error":"#N/A"}}]
[{"$f":"Orders!A1003","v":0},{"$f":"VLOOKUP(A1003,'Product-tool'!A:B,2,0)","v":{"$error":"#N/A"}},{"$f":"Orders!B1003/VLOOKUP(B1003,Tools!A:C,3,0)","v":{"$error":"#N/A"}},{"$f":"Orders!C1003/VLOOKUP(B1003,Tools!A:C,3,0)","v":{"$error":"#N/A"}},{"$f":"Orders!D1003/VLOOKUP(B1003,Tools!A:C,3,0)","v":{"$error":"#N/A"}}]
[{"$f":"Orders!A1004","v":0},{"$f":"VLOOKUP(A1004,'Product-tool'!A:B,2,0)","v":{"$error":"#N/A"}},{"$f":"Orders!B1004/VLOOKUP(B1004,Tools!A:C,3,0)","v":{"$error":"#N/A"}},{"$f":"Orders!C1004/VLOOKUP(B1004,Tools!A:C,3,0)","v":{"$error":"#N/A"}},{"$f":"Orders!D1004/VLOOKUP(B1004,Tools!A:C,3,0)","v":{"$error":"#N/A"}}]
[{"$f":"Orders!A1005","v":0},{"$f":"VLOOKUP(A1005,'Product-tool'!A:B,2,0)","v":{"$error":"#N/A"}},{"$f":"Orders!B1005/VLOOKUP(B1005,Tools!A:C,3,0)","v":{"$error":"#N/A"}},{"$f":"Orders!C1005/VLOOKUP(B1005,Tools!A:C,3,0)","v":{"$error":"#N/A"}},{"$f":"Orders!D1005/VLOOKUP(B1005,Tools!A:C,3,0)","v":{"$error":"#N/A"}}]
[{"$f":"Orders!A1006","v":0},{"$f":"VLOOKUP(A1006,'Product-tool'!A:B,2,0)","v":{"$error":"#N/A"}},{"$f":"Orders!B1006/VLOOKUP(B1006,Tools!A:C,3,0)","v":{"$error":"#N/A"}},{"$f":"Orders!C1006/VLOOKUP(B1006,Tools!A:C,3,0)","v":{"$error":"#N/A"}},{"$f":"Orders!D1006/VLOOKUP(B1006,Tools!A:C,3,0)","v":{"$error":"#N/A"}}]
[{"$f":"Orders!A1007","v":0},{"$f":"VLOOKUP(A1007,'Product-tool'!A:B,2,0)","v":{"$error":"#N/A"}},{"$f":"Orders!B1007/VLOOKUP(B1007,Tools!A:C,3,0)","v":{"$error":"#N/A"}},{"$f":"Orders!C1007/VLOOKUP(B1007,Tools!A:C,3,0)","v":{"$error":"#N/A"}},{"$f":"Orders!D1007/VLOOKUP(B1007,Tools!A:C,3,0)","v":{"$error":"#N/A"}}]
[{"$f":"Orders!A1008","v":0},{"$f":"VLOOKUP(A1008,'Product-tool'!A:B,2,0)","v":{"$error":"#N/A"}},{"$f":"Orders!B1008/VLOOKUP(B1008,Tools!A:C,3,0)","v":{"$error":"#N/A"}},{"$f":"Orders!C1008/VLOOKUP(B1008,Tools!A:C,3,0)","v":{"$error":"#N/A"}},{"$f":"Orders!D1008/VLOOKUP(B1008,Tools!A:C,3,0)","v":{"$error":"#N/A"}}]
[{"$f":"Orders!A1009","v":0},{"$f":"VLOOKUP(A1009,'Product-tool'!A:B,2,0)","v":{"$error":"#N/A"}},{"$f":"Orders!B1009/VLOOKUP(B1009,Tools!A:C,3,0)","v":{"$error":"#N/A"}},{"$f":"Orders!C1009/VLOOKUP(B1009,Tools!A:C,3,0)","v":{"$error":"#N/A"}},{"$f":"Orders!D1009/VLOOKUP(B1009,Tools!A:C,3,0)","v":{"$error":"#N/A"}}]
[{"$f":"Orders!A1010","v":0},{"$f":"VLOOKUP(A1010,'Product-tool'!A:B,2,0)","v":{"$error":"#N/A"}},{"$f":"Orders!B1010/VLOOKUP(B1010,Tools!A:C,3,0)","v":{"$error":"#N/A"}},{"$f":"Orders!C1010/VLOOKUP(B1010,Tools!A:C,3,0)","v":{"$error":"#N/A"}},{"$f":"Orders!D1010/VLOOKUP(B1010,Tools!A:C,3,0)","v":{"$error":"#N/A"}}]
[{"$f":"Orders!A1011","v":0},{"$f":"VLOOKUP(A1011,'Product-tool'!A:B,2,0)","v":{"$error":"#N/A"}},{"$f":"Orders!B1011/VLOOKUP(B1011,Tools!A:C,3,0)","v":{"$error":"#N/A"}},{"$f":"Orders!C1011/VLOOKUP(B1011,Tools!A:C,3,0)","v":{"$error":"#N/A"}},{"$f":"Orders!D1011/VLOOKUP(B1011,Tools!A:C,3,0)","v":{"$error":"#N/A"}}]
[{"$f":"Orders!A1012","v":0},{"$f":"VLOOKUP(A1012,'Product-tool'!A:B,2,0)","v":{"$error":"#N/A"}},{"$f":"Orders!B1012/VLOOKUP(B1012,Tools!A:C,3,0)","v":{"$error":"#N/A"}},{"$f":"Orders!C1012/VLOOKUP(B1012,Tools!A:C,3,0)","v":{"$error":"#N/A"}},{"$f":"Orders!D1012/VLOOKUP(B1012,Tools!A:C,3,0)","v":{"$error":"#N/A"}}]
[{"$f":"Orders!A1013","v":0},{"$f":"VLOOKUP(A1013,'Product-tool'!A:B,2,0)","v":{"$error":"#N/A"}},{"$f":"Orders!B1013/VLOOKUP(B1013,Tools!A:C,3,0)","v":{"$error":"#N/A"}},{"$f":"Orders!C1013/VLOOKUP(B1013,Tools!A:C,3,0)","v":{"$error":"#N/A"}},{"$f":"Orders!D1013/VLOOKUP(B1013,Tools!A:C,3,0)","v":{"$error":"#N/A"}}]
[{"$f":"Orders!A1014","v":0},{"$f":"VLOOKUP(A1014,'Product-tool'!A:B,2,0)","v":{"$error":"#N/A"}},{"$f":"Orders!B1014/VLOOKUP(B1014,Tools!A:C,3,0)","v":{"$error":"#N/A"}},{"$f":"Orders!C1014/VLOOKUP(B1014,Tools!A:C,3,0)","v":{"$error":"#N/A"}},{"$f":"Orders!D1014/VLOOKUP(B1014,Tools!A:C,3,0)","v":{"$error":"#N/A"}}]
[{"$f":"Orders!A1015","v":0},{"$f":"VLOOKUP(A1015,'Product-tool'!A:B,2,0)","v":{"$error":"#N/A"}},{"$f":"Orders!B1015/VLOOKUP(B1015,Tools!A:C,3,0)","v":{"$error":"#N/A"}},{"$f":"Orders!C1015/VLOOKUP(B1015,Tools!A:C,3,0)","v":{"$error":"#N/A"}},{"$f":"Orders!D1015/VLOOKUP(B1015,Tools!A:C,3,0)","v":{"$error":"#N/A"}}]
[{"$f":"Orders!A1016","v":0},{"$f":"VLOOKUP(A1016,'Product-tool'!A:B,2,0)","v":{"$error":"#N/A"}},{"$f":"Orders!B1016/VLOOKUP(B1016,Tools!A:C,3,0)","v":{"$error":"#N/A"}},{"$f":"Orders!C1016/VLOOKUP(B1016,Tools!A:C,3,0)","v":{"$error":"#N/A"}},{"$f":"Orders!D1016/VLOOKUP(B1016,Tools!A:C,3,0)","v":{"$error":"#N/A"}}]
[{"$f":"Orders!A1017","v":0},{"$f":"VLOOKUP(A1017,'Product-tool'!A:B,2,0)","v":{"$error":"#N/A"}},{"$f":"Orders!B1017/VLOOKUP(B1017,Tools!A:C,3,0)","v":{"$error":"#N/A"}},{"$f":"Orders!C1017/VLOOKUP(B1017,Tools!A:C,3,0)","v":{"$error":"#N/A"}},{"$f":"Orders!D1017/VLOOKUP(B1017,Tools!A:C,3,0)","v":{"$error":"#N/A"}}]
[{"$f":"Orders!A1018","v":0},{"$f":"VLOOKUP(A1018,'Product-tool'!A:B,2,0)","v":{"$error":"#N/A"}},{"$f":"Orders!B1018/VLOOKUP(B1018,Tools!A:C,3,0)","v":{"$error":"#N/A"}},{"$f":"Orders!C1018/VLOOKUP(B1018,Tools!A:C,3,0)","v":{"$error":"#N/A"}},{"$f":"Orders!D1018/VLOOKUP(B1018,Tools!A:C,3,0)","v":{"$error":"#N/A"}}]
[{"$f":"Orders!A1019","v":0},{"$f":"VLOOKUP(A1019,'Product-tool'!A:B,2,0)","v":{"$error":"#N/A"}},{"$f":"Orders!B1019/VLOOKUP(B1019,Tools!A:C,3,0)","v":{"$error":"#N/A"}},{"$f":"Orders!C1019/VLOOKUP(B1019,Tools!A:C,3,0)","v":{"$error":"#N/A"}},{"$f":"Orders!D1019/VLOOKUP(B1019,Tools!A:C,3,0)","v":{"$error":"#N/A"}}]
[{"$f":"Orders!A1020","v":0},{"$f":"VLOOKUP(A1020,'Product-tool'!A:B,2,0)","v":{"$error":"#N/A"}},{"$f":"Orders!B1020/VLOOKUP(B1020,Tools!A:C,3,0)","v":{"$error":"#N/A"}},{"$f":"Orders!C1020/VLOOKUP(B1020,Tools!A:C,3,0)","v":{"$error":"#N/A"}},{"$f":"Orders!D1020/VLOOKUP(B1020,Tools!A:C,3,0)","v":{"$error":"#N/A"}}]
[{"$f":"Orders!A1021","v":0},{"$f":"VLOOKUP(A1021,'Product-tool'!A:B,2,0)","v":{"$error":"#N/A"}},{"$f":"Orders!B1021/VLOOKUP(B1021,Tools!A:C,3,0)","v":{"$error":"#N/A"}},{"$f":"Orders!C1021/VLOOKUP(B1021,Tools!A:C,3,0)","v":{"$error":"#N/A"}},{"$f":"Orders!D1021/VLOOKUP(B1021,Tools!A:C,3,0)","v":{"$error":"#N/A"}}]
[{"$f":"Orders!A1022","v":0},{"$f":"VLOOKUP(A1022,'Product-tool'!A:B,2,0)","v":{"$error":"#N/A"}},{"$f":"Orders!B1022/VLOOKUP(B1022,Tools!A:C,3,0)","v":{"$error":"#N/A"}},{"$f":"Orders!C1022/VLOOKUP(B1022,Tools!A:C,3,0)","v":{"$error":"#N/A"}},{"$f":"Orders!D1022/VLOOKUP(B1022,Tools!A:C,3,0)","v":{"$error":"#N/A"}}]
[{"$f":"Orders!A1023","v":0},{"$f":"VLOOKUP(A1023,'Product-tool'!A:B,2,0)","v":{"$error":"#N/A"}},{"$f":"Orders!B1023/VLOOKUP(B1023,Tools!A:C,3,0)","v":{"$error":"#N/A"}},{"$f":"Orders!C1023/VLOOKUP(B1023,Tools!A:C,3,0)","v":{"$error":"#N/A"}},{"$f":"Orders!D1023/VLOOKUP(B1023,Tools!A:C,3,0)","v":{"$error":"#N/A"}}]
[{"$f":"Orders!A1024","v":0},{"$f":"VLOOKUP(A1024,'Product-tool'!A:B,2,0)","v":{"$error":"#N/A"}},{"$f":"Orders!B1024/VLOOKUP(B1024,Tools!A:C,3,0)","v":{"$error":"#N/A"}},{"$f":"Orders!C1024/VLOOKUP(B1024,Tools!A:C,3,0)","v":{"$error":"#N/A"}},{"$f":"Orders!D1024/VLOOKUP(B1024,Tools!A:C,3,0)","v":{"$error":"#N/A"}}]
[{"$f":"Orders!A1025","v":0},{"$f":"VLOOKUP(A1025,'Product-tool'!A:B,2,0)","v":{"$error":"#N/A"}},{"$f":"Orders!B1025/VLOOKUP(B1025,Tools!A:C,3,0)","v":{"$error":"#N/A"}},{"$f":"Orders!C1025/VLOOKUP(B1025,Tools!A:C,3,0)","v":{"$error":"#N/A"}},{"$f":"Orders!D1025/VLOOKUP(B1025,Tools!A:C,3,0)","v":{"$error":"#N/A"}}]
[{"$f":"Orders!A1026","v":0},{"$f":"VLOOKUP(A1026,'Product-tool'!A:B,2,0)","v":{"$error":"#N/A"}},{"$f":"Orders!B1026/VLOOKUP(B1026,Tools!A:C,3,0)","v":{"$error":"#N/A"}},{"$f":"Orders!C1026/VLOOKUP(B1026,Tools!A:C,3,0)","v":{"$error":"#N/A"}},{"$f":"Orders!D1026/VLOOKUP(B1026,Tools!A:C,3,0)","v":{"$error":"#N/A"}}]
[{"$f":"Orders!A1027","v":0},{"$f":"VLOOKUP(A1027,'Product-tool'!A:B,2,0)","v":{"$error":"#N/A"}},{"$f":"Orders!B1027/VLOOKUP(B1027,Tools!A:C,3,0)","v":{"$error":"#N/A"}},{"$f":"Orders!C1027/VLOOKUP(B1027,Tools!A:C,3,0)","v":{"$error":"#N/A"}},{"$f":"Orders!D1027/VLOOKUP(B1027,Tools!A:C,3,0)","v":{"$error":"#N/A"}}]
[{"$f":"Orders!A1028","v":0},{"$f":"VLOOKUP(A1028,'Product-tool'!A:B,2,0)","v":{"$error":"#N/A"}},{"$f":"Orders!B1028/VLOOKUP(B1028,Tools!A:C,3,0)","v":{"$error":"#N/A"}},{"$f":"Orders!C1028/VLOOKUP(B1028,Tools!A:C,3,0)","v":{"$error":"#N/A"}},{"$f":"Orders!D1028/VLOOKUP(B1028,Tools!A:C,3,0)","v":{"$error":"#N/A"}}]
[{"$f":"Orders!A1029","v":0},{"$f":"VLOOKUP(A1029,'Product-tool'!A:B,2,0)","v":{"$error":"#N/A"}},{"$f":"Orders!B1029/VLOOKUP(B1029,Tools!A:C,3,0)","v":{"$error":"#N/A"}},{"$f":"Orders!C1029/VLOOKUP(B1029,Tools!A:C,3,0)","v":{"$error":"#N/A"}},{"$f":"Orders!D1029/VLOOKUP(B1029,Tools!A:C,3,0)","v":{"$error":"#N/A"}}]
[{"$f":"Orders!A1030","v":0},{"$f":"VLOOKUP(A1030,'Product-tool'!A:B,2,0)","v":{"$error":"#N/A"}},{"$f":"Orders!B1030/VLOOKUP(B1030,Tools!A:C,3,0)","v":{"$error":"#N/A"}},{"$f":"Orders!C1030/VLOOKUP(B1030,Tools!A:C,3,0)","v":{"$error":"#N/A"}},{"$f":"Orders!D1030/VLOOKUP(B1030,Tools!A:C,3,0)","v":{"$error":"#N/A"}}]
[{"$f":"Orders!A1031","v":0},{"$f":"VLOOKUP(A1031,'Product-tool'!A:B,2,0)","v":{"$error":"#N/A"}},{"$f":"Orders!B1031/VLOOKUP(B1031,Tools!A:C,3,0)","v":{"$error":"#N/A"}},{"$f":"Orders!C1031/VLOOKUP(B1031,Tools!A:C,3,0)","v":{"$error":"#N/A"}},{"$f":"Orders!D1031/VLOOKUP(B1031,Tools!A:C,3,0)","v":{"$error":"#N/A"}}]
[{"$f":"Orders!A1032","v":0},{"$f":"VLOOKUP(A1032,'Product-tool'!A:B,2,0)","v":{"$error":"#N/A"}},{"$f":"Orders!B1032/VLOOKUP(B1032,Tools!A:C,3,0)","v":{"$error":"#N/A"}},{"$f":"Orders!C1032/VLOOKUP(B1032,Tools!A:C,3,0)","v":{"$error":"#N/A"}},{"$f":"Orders!D1032/VLOOKUP(B1032,Tools!A:C,3,0)","v":{"$error":"#N/A"}}]
[{"$f":"Orders!A1033","v":0},{"$f":"VLOOKUP(A1033,'Product-tool'!A:B,2,0)","v":{"$error":"#N/A"}},{"$f":"Orders!B1033/VLOOKUP(B1033,Tools!A:C,3,0)","v":{"$error":"#N/A"}},{"$f":"Orders!C1033/VLOOKUP(B1033,Tools!A:C,3,0)","v":{"$error":"#N/A"}},{"$f":"Orders!D1033/VLOOKUP(B1033,Tools!A:C,3,0)","v":{"$error":"#N/A"}}]
[{"$f":"Orders!A1034","v":0},{"$f":"VLOOKUP(A1034,'Product-tool'!A:B,2,0)","v":{"$error":"#N/A"}},{"$f":"Orders!B1034/VLOOKUP(B1034,Tools!A:C,3,0)","v":{"$error":"#N/A"}},{"$f":"Orders!C1034/VLOOKUP(B1034,Tools!A:C,3,0)","v":{"$error":"#N/A"}},{"$f":"Orders!D1034/VLOOKUP(B1034,Tools!A:C,3,0)","v":{"$error":"#N/A"}}]
[{"$f":"Orders!A1035","v":0},{"$f":"VLOOKUP(A1035,'Product-tool'!A:B,2,0)","v":{"$error":"#N/A"}},{"$f":"Orders!B1035/VLOOKUP(B1035,Tools!A:C,3,0)","v":{"$error":"#N/A"}},{"$f":"Orders!C1035/VLOOKUP(B1035,Tools!A:C,3,0)","v":{"$error":"#N/A"}},{"$f":"Orders!D1035/VLOOKUP(B1035,Tools!A:C,3,0)","v":{"$error":"#N/A"}}]
[{"$f":"Orders!A1036","v":0},{"$f":"VLOOKUP(A1036,'Product-tool'!A:B,2,0)","v":{"$error":"#N/A"}},{"$f":"Orders!B1036/VLOOKUP(B1036,Tools!A:C,3,0)","v":{"$error":"#N/A"}},{"$f":"Orders!C1036/VLOOKUP(B1036,Tools!A:C,3,0)","v":{"$error":"#N/A"}},{"$f":"Orders!D1036/VLOOKUP(B1036,Tools!A:C,3,0)","v":{"$error":"#N/A"}}]
[{"$f":"Orders!A1037","v":0},{"$f":"VLOOKUP(A1037,'Product-tool'!A:B,2,0)","v":{"$error":"#N/A"}},{"$f":"Orders!B1037/VLOOKUP(B1037,Tools!A:C,3,0)","v":{"$error":"#N/A"}},{"$f":"Orders!C1037/VLOOKUP(B1037,Tools!A:C,3,0)","v":{"$error":"#N/A"}},{"$f":"Orders!D1037/VLOOKUP(B1037,Tools!A:C,3,0)","v":{"$error":"#N/A"}}]
[{"$f":"Orders!A1038","v":0},{"$f":"VLOOKUP(A1038,'Product-tool'!A:B,2,0)","v":{"$error":"#N/A"}},{"$f":"Orders!B1038/VLOOKUP(B1038,Tools!A:C,3,0)","v":{"$error":"#N/A"}},{"$f":"Orders!C1038/VLOOKUP(B1038,Tools!A:C,3,0)","v":{"$error":"#N/A"}},{"$f":"Orders!D1038/VLOOKUP(B1038,Tools!A:C,3,0)","v":{"$error":"#N/A"}}]
[{"$f":"Orders!A1039","v":0},{"$f":"VLOOKUP(A1039,'Product-tool'!A:B,2,0)","v":{"$error":"#N/A"}},{"$f":"Orders!B1039/VLOOKUP(B1039,Tools!A:C,3,0)","v":{"$error":"#N/A"}},{"$f":"Orders!C1039/VLOOKUP(B1039,Tools!A:C,3,0)","v":{"$error":"#N/A"}},{"$f":"Orders!D1039/VLOOKUP(B1039,Tools!A:C,3,0)","v":{"$error":"#N/A"}}]
[{"$f":"Orders!A1040","v":0},{"$f":"VLOOKUP(A1040,'Product-tool'!A:B,2,0)","v":{"$error":"#N/A"}},{"$f":"Orders!B1040/VLOOKUP(B1040,Tools!A:C,3,0)","v":{"$error":"#N/A"}},{"$f":"Orders!C1040/VLOOKUP(B1040,Tools!A:C,3,0)","v":{"$error":"#N/A"}},{"$f":"Orders!D1040/VLOOKUP(B1040,Tools!A:C,3,0)","v":{"$error":"#N/A"}}]
[{"$f":"Orders!A1041","v":0},{"$f":"VLOOKUP(A1041,'Product-tool'!A:B,2,0)","v":{"$error":"#N/A"}},{"$f":"Orders!B1041/VLOOKUP(B1041,Tools!A:C,3,0)","v":{"$error":"#N/A"}},{"$f":"Orders!C1041/VLOOKUP(B1041,Tools!A:C,3,0)","v":{"$error":"#N/A"}},{"$f":"Orders!D1041/VLOOKUP(B1041,Tools!A:C,3,0)","v":{"$error":"#N/A"}}]
[{"$f":"Orders!A1042","v":0},{"$f":"VLOOKUP(A1042,'Product-tool'!A:B,2,0)","v":{"$error":"#N/A"}},{"$f":"Orders!B1042/VLOOKUP(B1042,Tools!A:C,3,0)","v":{"$error":"#N/A"}},{"$f":"Orders!C1042/VLOOKUP(B1042,Tools!A:C,3,0)","v":{"$error":"#N/A"}},{"$f":"Orders!D1042/VLOOKUP(B1042,Tools!A:C,3,0)","v":{"$error":"#N/A"}}]
[{"$f":"Orders!A1043","v":0},{"$f":"VLOOKUP(A1043,'Product-tool'!A:B,2,0)","v":{"$error":"#N/A"}},{"$f":"Orders!B1043/VLOOKUP(B1043,Tools!A:C,3,0)","v":{"$error":"#N/A"}},{"$f":"Orders!C1043/VLOOKUP(B1043,Tools!A:C,3,0)","v":{"$error":"#N/A"}},{"$f":"Orders!D1043/VLOOKUP(B1043,Tools!A:C,3,0)","v":{"$error":"#N/A"}}]
[{"$f":"Orders!A1044","v":0},{"$f":"VLOOKUP(A1044,'Product-tool'!A:B,2,0)","v":{"$error":"#N/A"}},{"$f":"Orders!B1044/VLOOKUP(B1044,Tools!A:C,3,0)","v":{"$error":"#N/A"}},{"$f":"Orders!C1044/VLOOKUP(B1044,Tools!A:C,3,0)","v":{"$error":"#N/A"}},{"$f":"Orders!D1044/VLOOKUP(B1044,Tools!A:C,3,0)","v":{"$error":"#N/A"}}]
[{"$f":"Orders!A1045","v":0},{"$f":"VLOOKUP(A1045,'Product-tool'!A:B,2,0)","v":{"$error":"#N/A"}},{"$f":"Orders!B1045/VLOOKUP(B1045,Tools!A:C,3,0)","v":{"$error":"#N/A"}},{"$f":"Orders!C1045/VLOOKUP(B1045,Tools!A:C,3,0)","v":{"$error":"#N/A"}},{"$f":"Orders!D1045/VLOOKUP(B1045,Tools!A:C,3,0)","v":{"$error":"#N/A"}}]
[{"$f":"Orders!A1046","v":0},{"$f":"VLOOKUP(A1046,'Product-tool'!A:B,2,0)","v":{"$error":"#N/A"}},{"$f":"Orders!B1046/VLOOKUP(B1046,Tools!A:C,3,0)","v":{"$error":"#N/A"}},{"$f":"Orders!C1046/VLOOKUP(B1046,Tools!A:C,3,0)","v":{"$error":"#N/A"}},{"$f":"Orders!D1046/VLOOKUP(B1046,Tools!A:C,3,0)","v":{"$error":"#N/A"}}]
[{"$f":"Orders!A1047","v":0},{"$f":"VLOOKUP(A1047,'Product-tool'!A:B,2,0)","v":{"$error":"#N/A"}},{"$f":"Orders!B1047/VLOOKUP(B1047,Tools!A:C,3,0)","v":{"$error":"#N/A"}},{"$f":"Orders!C1047/VLOOKUP(B1047,Tools!A:C,3,0)","v":{"$error":"#N/A"}},{"$f":"Orders!D1047/VLOOKUP(B1047,Tools!A:C,3,0)","v":{"$error":"#N/A"}}]
[{"$f":"Orders!A1048","v":0},{"$f":"VLOOKUP(A1048,'Product-tool'!A:B,2,0)","v":{"$error":"#N/A"}},{"$f":"Orders!B1048/VLOOKUP(B1048,Tools!A:C,3,0)","v":{"$error":"#N/A"}},{"$f":"Orders!C1048/VLOOKUP(B1048,Tools!A:C,3,0)","v":{"$error":"#N/A"}},{"$f":"Orders!D1048/VLOOKUP(B1048,Tools!A:C,3,0)","v":{"$error":"#N/A"}}]
[{"$f":"Orders!A1049","v":0},{"$f":"VLOOKUP(A1049,'Product-tool'!A:B,2,0)","v":{"$error":"#N/A"}},{"$f":"Orders!B1049/VLOOKUP(B1049,Tools!A:C,3,0)","v":{"$error":"#N/A"}},{"$f":"Orders!C1049/VLOOKUP(B1049,Tools!A:C,3,0)","v":{"$error":"#N/A"}},{"$f":"Orders!D1049/VLOOKUP(B1049,Tools!A:C,3,0)","v":{"$error":"#N/A"}}]
[{"$f":"Orders!A1050","v":0},{"$f":"VLOOKUP(A1050,'Product-tool'!A:B,2,0)","v":{"$error":"#N/A"}},{"$f":"Orders!B1050/VLOOKUP(B1050,Tools!A:C,3,0)","v":{"$error":"#N/A"}},{"$f":"Orders!C1050/VLOOKUP(B1050,Tools!A:C,3,0)","v":{"$error":"#N/A"}},{"$f":"Orders!D1050/VLOOKUP(B1050,Tools!A:C,3,0)","v":{"$error":"#N/A"}}]
[{"$f":"Orders!A1051","v":0},{"$f":"VLOOKUP(A1051,'Product-tool'!A:B,2,0)","v":{"$error":"#N/A"}},{"$f":"Orders!B1051/VLOOKUP(B1051,Tools!A:C,3,0)","v":{"$error":"#N/A"}},{"$f":"Orders!C1051/VLOOKUP(B1051,Tools!A:C,3,0)","v":{"$error":"#N/A"}},{"$f":"Orders!D1051/VLOOKUP(B1051,Tools!A:C,3,0)","v":{"$error":"#N/A"}}]
[{"$f":"Orders!A1052","v":0},{"$f":"VLOOKUP(A1052,'Product-tool'!A:B,2,0)","v":{"$error":"#N/A"}},{"$f":"Orders!B1052/VLOOKUP(B1052,Tools!A:C,3,0)","v":{"$error":"#N/A"}},{"$f":"Orders!C1052/VLOOKUP(B1052,Tools!A:C,3,0)","v":{"$error":"#N/A"}},{"$f":"Orders!D1052/VLOOKUP(B1052,Tools!A:C,3,0)","v":{"$error":"#N/A"}}]
[{"$f":"Orders!A1053","v":0},{"$f":"VLOOKUP(A1053,'Product-tool'!A:B,2,0)","v":{"$error":"#N/A"}},{"$f":"Orders!B1053/VLOOKUP(B1053,Tools!A:C,3,0)","v":{"$error":"#N/A"}},{"$f":"Orders!C1053/VLOOKUP(B1053,Tools!A:C,3,0)","v":{"$error":"#N/A"}},{"$f":"Orders!D1053/VLOOKUP(B1053,Tools!A:C,3,0)","v":{"$error":"#N/A"}}]
[{"$f":"Orders!A1054","v":0},{"$f":"VLOOKUP(A1054,'Product-tool'!A:B,2,0)","v":{"$error":"#N/A"}},{"$f":"Orders!B1054/VLOOKUP(B1054,Tools!A:C,3,0)","v":{"$error":"#N/A"}},{"$f":"Orders!C1054/VLOOKUP(B1054,Tools!A:C,3,0)","v":{"$error":"#N/A"}},{"$f":"Orders!D1054/VLOOKUP(B1054,Tools!A:C,3,0)","v":{"$error":"#N/A"}}]
[{"$f":"Orders!A1055","v":0},{"$f":"VLOOKUP(A1055,'Product-tool'!A:B,2,0)","v":{"$error":"#N/A"}},{"$f":"Orders!B1055/VLOOKUP(B1055,Tools!A:C,3,0)","v":{"$error":"#N/A"}},{"$f":"Orders!C1055/VLOOKUP(B1055,Tools!A:C,3,0)","v":{"$error":"#N/A"}},{"$f":"Orders!D1055/VLOOKUP(B1055,Tools!A:C,3,0)","v":{"$error":"#N/A"}}]
[{"$f":"Orders!A1056","v":0},{"$f":"VLOOKUP(A1056,'Product-tool'!A:B,2,0)","v":{"$error":"#N/A"}},{"$f":"Orders!B1056/VLOOKUP(B1056,Tools!A:C,3,0)","v":{"$error":"#N/A"}},{"$f":"Orders!C1056/VLOOKUP(B1056,Tools!A:C,3,0)","v":{"$error":"#N/A"}},{"$f":"Orders!D1056/VLOOKUP(B1056,Tools!A:C,3,0)","v":{"$error":"#N/A"}}]
[{"$f":"Orders!A1057","v":0},{"$f":"VLOOKUP(A1057,'Product-tool'!A:B,2,0)","v":{"$error":"#N/A"}},{"$f":"Orders!B1057/VLOOKUP(B1057,Tools!A:C,3,0)","v":{"$error":"#N/A"}},{"$f":"Orders!C1057/VLOOKUP(B1057,Tools!A:C,3,0)","v":{"$error":"#N/A"}},{"$f":"Orders!D1057/VLOOKUP(B1057,Tools!A:C,3,0)","v":{"$error":"#N/A"}}]
[{"$f":"Orders!A1058","v":0},{"$f":"VLOOKUP(A1058,'Product-tool'!A:B,2,0)","v":{"$error":"#N/A"}},{"$f":"Orders!B1058/VLOOKUP(B1058,Tools!A:C,3,0)","v":{"$error":"#N/A"}},{"$f":"Orders!C1058/VLOOKUP(B1058,Tools!A:C,3,0)","v":{"$error":"#N/A"}},{"$f":"Orders!D1058/VLOOKUP(B1058,Tools!A:C,3,0)","v":{"$error":"#N/A"}}]
[{"$f":"Orders!A1059","v":0},{"$f":"VLOOKUP(A1059,'Product-tool'!A:B,2,0)","v":{"$error":"#N/A"}},{"$f":"Orders!B1059/VLOOKUP(B1059,Tools!A:C,3,0)","v":{"$error":"#N/A"}},{"$f":"Orders!C1059/VLOOKUP(B1059,Tools!A:C,3,0)","v":{"$error":"#N/A"}},{"$f":"Orders!D1059/VLOOKUP(B1059,Tools!A:C,3,0)","v":{"$error":"#N/A"}}]
[{"$f":"Orders!A1060","v":0},{"$f":"VLOOKUP(A1060,'Product-tool'!A:B,2,0)","v":{"$error":"#N/A"}},{"$f":"Orders!B1060/VLOOKUP(B1060,Tools!A:C,3,0)","v":{"$error":"#N/A"}},{"$f":"Orders!C1060/VLOOKUP(B1060,Tools!A:C,3,0)","v":{"$error":"#N/A"}},{"$f":"Orders!D1060/VLOOKUP(B1060,Tools!A:C,3,0)","v":{"$error":"#N/A"}}]
[{"$f":"Orders!A1061","v":0},{"$f":"VLOOKUP(A1061,'Product-tool'!A:B,2,0)","v":{"$error":"#N/A"}},{"$f":"Orders!B1061/VLOOKUP(B1061,Tools!A:C,3,0)","v":{"$error":"#N/A"}},{"$f":"Orders!C1061/VLOOKUP(B1061,Tools!A:C,3,0)","v":{"$error":"#N/A"}},{"$f":"Orders!D1061/VLOOKUP(B1061,Tools!A:C,3,0)","v":{"$error":"#N/A"}}]
[{"$f":"Orders!A1062","v":0},{"$f":"VLOOKUP(A1062,'Product-tool'!A:B,2,0)","v":{"$error":"#N/A"}},{"$f":"Orders!B1062/VLOOKUP(B1062,Tools!A:C,3,0)","v":{"$error":"#N/A"}},{"$f":"Orders!C1062/VLOOKUP(B1062,Tools!A:C,3,0)","v":{"$error":"#N/A"}},{"$f":"Orders!D1062/VLOOKUP(B1062,Tools!A:C,3,0)","v":{"$error":"#N/A"}}]
[{"$f":"Orders!A1063","v":0},{"$f":"VLOOKUP(A1063,'Product-tool'!A:B,2,0)","v":{"$error":"#N/A"}},{"$f":"Orders!B1063/VLOOKUP(B1063,Tools!A:C,3,0)","v":{"$error":"#N/A"}},{"$f":"Orders!C1063/VLOOKUP(B1063,Tools!A:C,3,0)","v":{"$error":"#N/A"}},{"$f":"Orders!D1063/VLOOKUP(B1063,Tools!A:C,3,0)","v":{"$error":"#N/A"}}]
[{"$f":"Orders!A1064","v":0},{"$f":"VLOOKUP(A1064,'Product-tool'!A:B,2,0)","v":{"$error":"#N/A"}},{"$f":"Orders!B1064/VLOOKUP(B1064,Tools!A:C,3,0)","v":{"$error":"#N/A"}},{"$f":"Orders!C1064/VLOOKUP(B1064,Tools!A:C,3,0)","v":{"$error":"#N/A"}},{"$f":"Orders!D1064/VLOOKUP(B1064,Tools!A:C,3,0)","v":{"$error":"#N/A"}}]
[{"$f":"Orders!A1065","v":0},{"$f":"VLOOKUP(A1065,'Product-tool'!A:B,2,0)","v":{"$error":"#N/A"}},{"$f":"Orders!B1065/VLOOKUP(B1065,Tools!A:C,3,0)","v":{"$error":"#N/A"}},{"$f":"Orders!C1065/VLOOKUP(B1065,Tools!A:C,3,0)","v":{"$error":"#N/A"}},{"$f":"Orders!D1065/VLOOKUP(B1065,Tools!A:C,3,0)","v":{"$error":"#N/A"}}]
[{"$f":"Orders!A1066","v":0},{"$f":"VLOOKUP(A1066,'Product-tool'!A:B,2,0)","v":{"$error":"#N/A"}},{"$f":"Orders!B1066/VLOOKUP(B1066,Tools!A:C,3,0)","v":{"$error":"#N/A"}},{"$f":"Orders!C1066/VLOOKUP(B1066,Tools!A:C,3,0)","v":{"$error":"#N/A"}},{"$f":"Orders!D1066/VLOOKUP(B1066,Tools!A:C,3,0)","v":{"$error":"#N/A"}}]
[{"$f":"Orders!A1067","v":0},{"$f":"VLOOKUP(A1067,'Product-tool'!A:B,2,0)","v":{"$error":"#N/A"}},{"$f":"Orders!B1067/VLOOKUP(B1067,Tools!A:C,3,0)","v":{"$error":"#N/A"}},{"$f":"Orders!C1067/VLOOKUP(B1067,Tools!A:C,3,0)","v":{"$error":"#N/A"}},{"$f":"Orders!D1067/VLOOKUP(B1067,Tools!A:C,3,0)","v":{"$error":"#N/A"}}]
[{"$f":"Orders!A1068","v":0},{"$f":"VLOOKUP(A1068,'Product-tool'!A:B,2,0)","v":{"$error":"#N/A"}},{"$f":"Orders!B1068/VLOOKUP(B1068,Tools!A:C,3,0)","v":{"$error":"#N/A"}},{"$f":"Orders!C1068/VLOOKUP(B1068,Tools!A:C,3,0)","v":{"$error":"#N/A"}},{"$f":"Orders!D1068/VLOOKUP(B1068,Tools!A:C,3,0)","v":{"$error":"#N/A"}}]
[{"$f":"Orders!A1069","v":0},{"$f":"VLOOKUP(A1069,'Product-tool'!A:B,2,0)","v":{"$error":"#N/A"}},{"$f":"Orders!B1069/VLOOKUP(B1069,Tools!A:C,3,0)","v":{"$error":"#N/A"}},{"$f":"Orders!C1069/VLOOKUP(B1069,Tools!A:C,3,0)","v":{"$error":"#N/A"}},{"$f":"Orders!D1069/VLOOKUP(B1069,Tools!A:C,3,0)","v":{"$error":"#N/A"}}]
[{"$f":"Orders!A1070","v":0},{"$f":"VLOOKUP(A1070,'Product-tool'!A:B,2,0)","v":{"$error":"#N/A"}},{"$f":"Orders!B1070/VLOOKUP(B1070,Tools!A:C,3,0)","v":{"$error":"#N/A"}},{"$f":"Orders!C1070/VLOOKUP(B1070,Tools!A:C,3,0)","v":{"$error":"#N/A"}},{"$f":"Orders!D1070/VLOOKUP(B1070,Tools!A:C,3,0)","v":{"$error":"#N/A"}}]
[{"$f":"Orders!A1071","v":0},{"$f":"VLOOKUP(A1071,'Product-tool'!A:B,2,0)","v":{"$error":"#N/A"}},{"$f":"Orders!B1071/VLOOKUP(B1071,Tools!A:C,3,0)","v":{"$error":"#N/A"}},{"$f":"Orders!C1071/VLOOKUP(B1071,Tools!A:C,3,0)","v":{"$error":"#N/A"}},{"$f":"Orders!D1071/VLOOKUP(B1071,Tools!A:C,3,0)","v":{"$error":"#N/A"}}]
[{"$f":"Orders!A1072","v":0},{"$f":"VLOOKUP(A1072,'Product-tool'!A:B,2,0)","v":{"$error":"#N/A"}},{"$f":"Orders!B1072/VLOOKUP(B1072,Tools!A:C,3,0)","v":{"$error":"#N/A"}},{"$f":"Orders!C1072/VLOOKUP(B1072,Tools!A:C,3,0)","v":{"$error":"#N/A"}},{"$f":"Orders!D1072/VLOOKUP(B1072,Tools!A:C,3,0)","v":{"$error":"#N/A"}}]
[{"$f":"Orders!A1073","v":0},{"$f":"VLOOKUP(A1073,'Product-tool'!A:B,2,0)","v":{"$error":"#N/A"}},{"$f":"Orders!B1073/VLOOKUP(B1073,Tools!A:C,3,0)","v":{"$error":"#N/A"}},{"$f":"Orders!C1073/VLOOKUP(B1073,Tools!A:C,3,0)","v":{"$error":"#N/A"}},{"$f":"Orders!D1073/VLOOKUP(B1073,Tools!A:C,3,0)","v":{"$error":"#N/A"}}]
[{"$f":"Orders!A1074","v":0},{"$f":"VLOOKUP(A1074,'Product-tool'!A:B,2,0)","v":{"$error":"#N/A"}},{"$f":"Orders!B1074/VLOOKUP(B1074,Tools!A:C,3,0)","v":{"$error":"#N/A"}},{"$f":"Orders!C1074/VLOOKUP(B1074,Tools!A:C,3,0)","v":{"$error":"#N/A"}},{"$f":"Orders!D1074/VLOOKUP(B1074,Tools!A:C,3,0)","v":{"$error":"#N/A"}}]
[{"$f":"Orders!A1075","v":0},{"$f":"VLOOKUP(A1075,'Product-tool'!A:B,2,0)","v":{"$error":"#N/A"}},{"$f":"Orders!B1075/VLOOKUP(B1075,Tools!A:C,3,0)","v":{"$error":"#N/A"}},{"$f":"Orders!C1075/VLOOKUP(B1075,Tools!A:C,3,0)","v":{"$error":"#N/A"}},{"$f":"Orders!D1075/VLOOKUP(B1075,Tools!A:C,3,0)","v":{"$error":"#N/A"}}]
[{"$f":"Orders!A1076","v":0},{"$f":"VLOOKUP(A1076,'Product-tool'!A:B,2,0)","v":{"$error":"#N/A"}},{"$f":"Orders!B1076/VLOOKUP(B1076,Tools!A:C,3,0)","v":{"$error":"#N/A"}},{"$f":"Orders!C1076/VLOOKUP(B1076,Tools!A:C,3,0)","v":{"$error":"#N/A"}},{"$f":"Orders!D1076/VLOOKUP(B1076,Tools!A:C,3,0)","v":{"$error":"#N/A"}}]
[{"$f":"Orders!A1077","v":0},{"$f":"VLOOKUP(A1077,'Product-tool'!A:B,2,0)","v":{"$error":"#N/A"}},{"$f":"Orders!B1077/VLOOKUP(B1077,Tools!A:C,3,0)","v":{"$error":"#N/A"}},{"$f":"Orders!C1077/VLOOKUP(B1077,Tools!A:C,3,0)","v":{"$error":"#N/A"}},{"$f":"Orders!D1077/VLOOKUP(B1077,Tools!A:C,3,0)","v":{"$error":"#N/A"}}]
[{"$f":"Orders!A1078","v":0},{"$f":"VLOOKUP(A1078,'Product-tool'!A:B,2,0)","v":{"$error":"#N/A"}},{"$f":"Orders!B1078/VLOOKUP(B1078,Tools!A:C,3,0)","v":{"$error":"#N/A"}},{"$f":"Orders!C1078/VLOOKUP(B1078,Tools!A:C,3,0)","v":{"$error":"#N/A"}},{"$f":"Orders!D1078/VLOOKUP(B1078,Tools!A:C,3,0)","v":{"$error":"#N/A"}}]
[{"$f":"Orders!A1079","v":0},{"$f":"VLOOKUP(A1079,'Product-tool'!A:B,2,0)","v":{"$error":"#N/A"}},{"$f":"Orders!B1079/VLOOKUP(B1079,Tools!A:C,3,0)","v":{"$error":"#N/A"}},{"$f":"Orders!C1079/VLOOKUP(B1079,Tools!A:C,3,0)","v":{"$error":"#N/A"}},{"$f":"Orders!D1079/VLOOKUP(B1079,Tools!A:C,3,0)","v":{"$error":"#N/A"}}]
[{"$f":"Orders!A1080","v":0},{"$f":"VLOOKUP(A1080,'Product-tool'!A:B,2,0)","v":{"$error":"#N/A"}},{"$f":"Orders!B1080/VLOOKUP(B1080,Tools!A:C,3,0)","v":{"$error":"#N/A"}},{"$f":"Orders!C1080/VLOOKUP(B1080,Tools!A:C,3,0)","v":{"$error":"#N/A"}},{"$f":"Orders!D1080/VLOOKUP(B1080,Tools!A:C,3,0)","v":{"$error":"#N/A"}}]
[{"$f":"Orders!A1081","v":0},{"$f":"VLOOKUP(A1081,'Product-tool'!A:B,2,0)","v":{"$error":"#N/A"}},{"$f":"Orders!B1081/VLOOKUP(B1081,Tools!A:C,3,0)","v":{"$error":"#N/A"}},{"$f":"Orders!C1081/VLOOKUP(B1081,Tools!A:C,3,0)","v":{"$error":"#N/A"}},{"$f":"Orders!D1081/VLOOKUP(B1081,Tools!A:C,3,0)","v":{"$error":"#N/A"}}]
[{"$f":"Orders!A1082","v":0},{"$f":"VLOOKUP(A1082,'Product-tool'!A:B,2,0)","v":{"$error":"#N/A"}},{"$f":"Orders!B1082/VLOOKUP(B1082,Tools!A:C,3,0)","v":{"$error":"#N/A"}},{"$f":"Orders!C1082/VLOOKUP(B1082,Tools!A:C,3,0)","v":{"$error":"#N/A"}},{"$f":"Orders!D1082/VLOOKUP(B1082,Tools!A:C,3,0)","v":{"$error":"#N/A"}}]
[{"$f":"Orders!A1083","v":0},{"$f":"VLOOKUP(A1083,'Product-tool'!A:B,2,0)","v":{"$error":"#N/A"}},{"$f":"Orders!B1083/VLOOKUP(B1083,Tools!A:C,3,0)","v":{"$error":"#N/A"}},{"$f":"Orders!C1083/VLOOKUP(B1083,Tools!A:C,3,0)","v":{"$error":"#N/A"}},{"$f":"Orders!D1083/VLOOKUP(B1083,Tools!A:C,3,0)","v":{"$error":"#N/A"}}]
[{"$f":"Orders!A1084","v":0},{"$f":"VLOOKUP(A1084,'Product-tool'!A:B,2,0)","v":{"$error":"#N/A"}},{"$f":"Orders!B1084/VLOOKUP(B1084,Tools!A:C,3,0)","v":{"$error":"#N/A"}},{"$f":"Orders!C1084/VLOOKUP(B1084,Tools!A:C,3,0)","v":{"$error":"#N/A"}},{"$f":"Orders!D1084/VLOOKUP(B1084,Tools!A:C,3,0)","v":{"$error":"#N/A"}}]
[{"$f":"Orders!A1085","v":0},{"$f":"VLOOKUP(A1085,'Product-tool'!A:B,2,0)","v":{"$error":"#N/A"}},{"$f":"Orders!B1085/VLOOKUP(B1085,Tools!A:C,3,0)","v":{"$error":"#N/A"}},{"$f":"Orders!C1085/VLOOKUP(B1085,Tools!A:C,3,0)","v":{"$error":"#N/A"}},{"$f":"Orders!D1085/VLOOKUP(B1085,Tools!A:C,3,0)","v":{"$error":"#N/A"}}]
[{"$f":"Orders!A1086","v":0},{"$f":"VLOOKUP(A1086,'Product-tool'!A:B,2,0)","v":{"$error":"#N/A"}},{"$f":"Orders!B1086/VLOOKUP(B1086,Tools!A:C,3,0)","v":{"$error":"#N/A"}},{"$f":"Orders!C1086/VLOOKUP(B1086,Tools!A:C,3,0)","v":{"$error":"#N/A"}},{"$f":"Orders!D1086/VLOOKUP(B1086,Tools!A:C,3,0)","v":{"$error":"#N/A"}}]
[{"$f":"Orders!A1087","v":0},{"$f":"VLOOKUP(A1087,'Product-tool'!A:B,2,0)","v":{"$error":"#N/A"}},{"$f":"Orders!B1087/VLOOKUP(B1087,Tools!A:C,3,0)","v":{"$error":"#N/A"}},{"$f":"Orders!C1087/VLOOKUP(B1087,Tools!A:C,3,0)","v":{"$error":"#N/A"}},{"$f":"Orders!D1087/VLOOKUP(B1087,Tools!A:C,3,0)","v":{"$error":"#N/A"}}]
[{"$f":"Orders!A1088","v":0},{"$f":"VLOOKUP(A1088,'Product-tool'!A:B,2,0)","v":{"$error":"#N/A"}},{"$f":"Orders!B1088/VLOOKUP(B1088,Tools!A:C,3,0)","v":{"$error":"#N/A"}},{"$f":"Orders!C1088/VLOOKUP(B1088,Tools!A:C,3,0)","v":{"$error":"#N/A"}},{"$f":"Orders!D1088/VLOOKUP(B1088,Tools!A:C,3,0)","v":{"$error":"#N/A"}}]
[{"$f":"Orders!A1089","v":0},{"$f":"VLOOKUP(A1089,'Product-tool'!A:B,2,0)","v":{"$error":"#N/A"}},{"$f":"Orders!B1089/VLOOKUP(B1089,Tools!A:C,3,0)","v":{"$error":"#N/A"}},{"$f":"Orders!C1089/VLOOKUP(B1089,Tools!A:C,3,0)","v":{"$error":"#N/A"}},{"$f":"Orders!D1089/VLOOKUP(B1089,Tools!A:C,3,0)","v":{"$error":"#N/A"}}]
[{"$f":"Orders!A1090","v":0},{"$f":"VLOOKUP(A1090,'Product-tool'!A:B,2,0)","v":{"$error":"#N/A"}},{"$f":"Orders!B1090/VLOOKUP(B1090,Tools!A:C,3,0)","v":{"$error":"#N/A"}},{"$f":"Orders!C1090/VLOOKUP(B1090,Tools!A:C,3,0)","v":{"$error":"#N/A"}},{"$f":"Orders!D1090/VLOOKUP(B1090,Tools!A:C,3,0)","v":{"$error":"#N/A"}}]
[{"$f":"Orders!A1091","v":0},{"$f":"VLOOKUP(A1091,'Product-tool'!A:B,2,0)","v":{"$error":"#N/A"}},{"$f":"Orders!B1091/VLOOKUP(B1091,Tools!A:C,3,0)","v":{"$error":"#N/A"}},{"$f":"Orders!C1091/VLOOKUP(B1091,Tools!A:C,3,0)","v":{"$error":"#N/A"}},{"$f":"Orders!D1091/VLOOKUP(B1091,Tools!A:C,3,0)","v":{"$error":"#N/A"}}]
[{"$f":"Orders!A1092","v":0},{"$f":"VLOOKUP(A1092,'Product-tool'!A:B,2,0)","v":{"$error":"#N/A"}},{"$f":"Orders!B1092/VLOOKUP(B1092,Tools!A:C,3,0)","v":{"$error":"#N/A"}},{"$f":"Orders!C1092/VLOOKUP(B1092,Tools!A:C,3,0)","v":{"$error":"#N/A"}},{"$f":"Orders!D1092/VLOOKUP(B1092,Tools!A:C,3,0)","v":{"$error":"#N/A"}}]
[{"$f":"Orders!A1093","v":0},{"$f":"VLOOKUP(A1093,'Product-tool'!A:B,2,0)","v":{"$error":"#N/A"}},{"$f":"Orders!B1093/VLOOKUP(B1093,Tools!A:C,3,0)","v":{"$error":"#N/A"}},{"$f":"Orders!C1093/VLOOKUP(B1093,Tools!A:C,3,0)","v":{"$error":"#N/A"}},{"$f":"Orders!D1093/VLOOKUP(B1093,Tools!A:C,3,0)","v":{"$error":"#N/A"}}]
[{"$f":"Orders!A1094","v":0},{"$f":"VLOOKUP(A1094,'Product-tool'!A:B,2,0)","v":{"$error":"#N/A"}},{"$f":"Orders!B1094/VLOOKUP(B1094,Tools!A:C,3,0)","v":{"$error":"#N/A"}},{"$f":"Orders!C1094/VLOOKUP(B1094,Tools!A:C,3,0)","v":{"$error":"#N/A"}},{"$f":"Orders!D1094/VLOOKUP(B1094,Tools!A:C,3,0)","v":{"$error":"#N/A"}}]
[{"$f":"Orders!A1095","v":0},{"$f":"VLOOKUP(A1095,'Product-tool'!A:B,2,0)","v":{"$error":"#N/A"}},{"$f":"Orders!B1095/VLOOKUP(B1095,Tools!A:C,3,0)","v":{"$error":"#N/A"}},{"$f":"Orders!C1095/VLOOKUP(B1095,Tools!A:C,3,0)","v":{"$error":"#N/A"}},{"$f":"Orders!D1095/VLOOKUP(B1095,Tools!A:C,3,0)","v":{"$error":"#N/A"}}]
[{"$f":"Orders!A1096","v":0},{"$f":"VLOOKUP(A1096,'Product-tool'!A:B,2,0)","v":{"$error":"#N/A"}},{"$f":"Orders!B1096/VLOOKUP(B1096,Tools!A:C,3,0)","v":{"$error":"#N/A"}},{"$f":"Orders!C1096/VLOOKUP(B1096,Tools!A:C,3,0)","v":{"$error":"#N/A"}},{"$f":"Orders!D1096/VLOOKUP(B1096,Tools!A:C,3,0)","v":{"$error":"#N/A"}}]
[{"$f":"Orders!A1097","v":0},{"$f":"VLOOKUP(A1097,'Product-tool'!A:B,2,0)","v":{"$error":"#N/A"}},{"$f":"Orders!B1097/VLOOKUP(B1097,Tools!A:C,3,0)","v":{"$error":"#N/A"}},{"$f":"Orders!C1097/VLOOKUP(B1097,Tools!A:C,3,0)","v":{"$error":"#N/A"}},{"$f":"Orders!D1097/VLOOKUP(B1097,Tools!A:C,3,0)","v":{"$error":"#N/A"}}]
[{"$f":"Orders!A1098","v":0},{"$f":"VLOOKUP(A1098,'Product-tool'!A:B,2,0)","v":{"$error":"#N/A"}},{"$f":"Orders!B1098/VLOOKUP(B1098,Tools!A:C,3,0)","v":{"$error":"#N/A"}},{"$f":"Orders!C1098/VLOOKUP(B1098,Tools!A:C,3,0)","v":{"$error":"#N/A"}},{"$f":"Orders!D1098/VLOOKUP(B1098,Tools!A:C,3,0)","v":{"$error":"#N/A"}}]
[{"$f":"Orders!A1099","v":0},{"$f":"VLOOKUP(A1099,'Product-tool'!A:B,2,0)","v":{"$error":"#N/A"}},{"$f":"Orders!B1099/VLOOKUP(B1099,Tools!A:C,3,0)","v":{"$error":"#N/A"}},{"$f":"Orders!C1099/VLOOKUP(B1099,Tools!A:C,3,0)","v":{"$error":"#N/A"}},{"$f":"Orders!D1099/VLOOKUP(B1099,Tools!A:C,3,0)","v":{"$error":"#N/A"}}]
[{"$f":"Orders!A1100","v":0},{"$f":"VLOOKUP(A1100,'Product-tool'!A:B,2,0)","v":{"$error":"#N/A"}},{"$f":"Orders!B1100/VLOOKUP(B1100,Tools!A:C,3,0)","v":{"$error":"#N/A"}},{"$f":"Orders!C1100/VLOOKUP(B1100,Tools!A:C,3,0)","v":{"$error":"#N/A"}},{"$f":"Orders!D1100/VLOOKUP(B1100,Tools!A:C,3,0)","v":{"$error":"#N/A"}}]
[{"$f":"Orders!A1101","v":0},{"$f":"VLOOKUP(A1101,'Product-tool'!A:B,2,0)","v":{"$error":"#N/A"}},{"$f":"Orders!B1101/VLOOKUP(B1101,Tools!A:C,3,0)","v":{"$error":"#N/A"}},{"$f":"Orders!C1101/VLOOKUP(B1101,Tools!A:C,3,0)","v":{"$error":"#N/A"}},{"$f":"Orders!D1101/VLOOKUP(B1101,Tools!A:C,3,0)","v":{"$error":"#N/A"}}]
[{"$f":"Orders!A1102","v":0},{"$f":"VLOOKUP(A1102,'Product-tool'!A:B,2,0)","v":{"$error":"#N/A"}},{"$f":"Orders!B1102/VLOOKUP(B1102,Tools!A:C,3,0)","v":{"$error":"#N/A"}},{"$f":"Orders!C1102/VLOOKUP(B1102,Tools!A:C,3,0)","v":{"$error":"#N/A"}},{"$f":"Orders!D1102/VLOOKUP(B1102,Tools!A:C,3,0)","v":{"$error":"#N/A"}}]
[{"$f":"Orders!A1103","v":0},{"$f":"VLOOKUP(A1103,'Product-tool'!A:B,2,0)","v":{"$error":"#N/A"}},{"$f":"Orders!B1103/VLOOKUP(B1103,Tools!A:C,3,0)","v":{"$error":"#N/A"}},{"$f":"Orders!C1103/VLOOKUP(B1103,Tools!A:C,3,0)","v":{"$error":"#N/A"}},{"$f":"Orders!D1103/VLOOKUP(B1103,Tools!A:C,3,0)","v":{"$error":"#N/A"}}]
[{"$f":"Orders!A1104","v":0},{"$f":"VLOOKUP(A1104,'Product-tool'!A:B,2,0)","v":{"$error":"#N/A"}},{"$f":"Orders!B1104/VLOOKUP(B1104,Tools!A:C,3,0)","v":{"$error":"#N/A"}},{"$f":"Orders!C1104/VLOOKUP(B1104,Tools!A:C,3,0)","v":{"$error":"#N/A"}},{"$f":"Orders!D1104/VLOOKUP(B1104,Tools!A:C,3,0)","v":{"$error":"#N/A"}}]
[{"$f":"Orders!A1105","v":0},{"$f":"VLOOKUP(A1105,'Product-tool'!A:B,2,0)","v":{"$error":"#N/A"}},{"$f":"Orders!B1105/VLOOKUP(B1105,Tools!A:C,3,0)","v":{"$error":"#N/A"}},{"$f":"Orders!C1105/VLOOKUP(B1105,Tools!A:C,3,0)","v":{"$error":"#N/A"}},{"$f":"Orders!D1105/VLOOKUP(B1105,Tools!A:C,3,0)","v":{"$error":"#N/A"}}]
[{"$f":"Orders!A1106","v":0},{"$f":"VLOOKUP(A1106,'Product-tool'!A:B,2,0)","v":{"$error":"#N/A"}},{"$f":"Orders!B1106/VLOOKUP(B1106,Tools!A:C,3,0)","v":{"$error":"#N/A"}},{"$f":"Orders!C1106/VLOOKUP(B1106,Tools!A:C,3,0)","v":{"$error":"#N/A"}},{"$f":"Orders!D1106/VLOOKUP(B1106,Tools!A:C,3,0)","v":{"$error":"#N/A"}}]
[{"$f":"Orders!A1107","v":0},{"$f":"VLOOKUP(A1107,'Product-tool'!A:B,2,0)","v":{"$error":"#N/A"}},{"$f":"Orders!B1107/VLOOKUP(B1107,Tools!A:C,3,0)","v":{"$error":"#N/A"}},{"$f":"Orders!C1107/VLOOKUP(B1107,Tools!A:C,3,0)","v":{"$error":"#N/A"}},{"$f":"Orders!D1107/VLOOKUP(B1107,Tools!A:C,3,0)","v":{"$error":"#N/A"}}]
[{"$f":"Orders!A1108","v":0},{"$f":"VLOOKUP(A1108,'Product-tool'!A:B,2,0)","v":{"$error":"#N/A"}},{"$f":"Orders!B1108/VLOOKUP(B1108,Tools!A:C,3,0)","v":{"$error":"#N/A"}},{"$f":"Orders!C1108/VLOOKUP(B1108,Tools!A:C,3,0)","v":{"$error":"#N/A"}},{"$f":"Orders!D1108/VLOOKUP(B1108,Tools!A:C,3,0)","v":{"$error":"#N/A"}}]
[{"$f":"Orders!A1109","v":0},{"$f":"VLOOKUP(A1109,'Product-tool'!A:B,2,0)","v":{"$error":"#N/A"}},{"$f":"Orders!B1109/VLOOKUP(B1109,Tools!A:C,3,0)","v":{"$error":"#N/A"}},{"$f":"Orders!C1109/VLOOKUP(B1109,Tools!A:C,3,0)","v":{"$error":"#N/A"}},{"$f":"Orders!D1109/VLOOKUP(B1109,Tools!A:C,3,0)","v":{"$error":"#N/A"}}]
[{"$f":"Orders!A1110","v":0},{"$f":"VLOOKUP(A1110,'Product-tool'!A:B,2,0)","v":{"$error":"#N/A"}},{"$f":"Orders!B1110/VLOOKUP(B1110,Tools!A:C,3,0)","v":{"$error":"#N/A"}},{"$f":"Orders!C1110/VLOOKUP(B1110,Tools!A:C,3,0)","v":{"$error":"#N/A"}},{"$f":"Orders!D1110/VLOOKUP(B1110,Tools!A:C,3,0)","v":{"$error":"#N/A"}}]
[{"$f":"Orders!A1111","v":0},{"$f":"VLOOKUP(A1111,'Product-tool'!A:B,2,0)","v":{"$error":"#N/A"}},{"$f":"Orders!B1111/VLOOKUP(B1111,Tools!A:C,3,0)","v":{"$error":"#N/A"}},{"$f":"Orders!C1111/VLOOKUP(B1111,Tools!A:C,3,0)","v":{"$error":"#N/A"}},{"$f":"Orders!D1111/VLOOKUP(B1111,Tools!A:C,3,0)","v":{"$error":"#N/A"}}]
[{"$f":"Orders!A1112","v":0},{"$f":"VLOOKUP(A1112,'Product-tool'!A:B,2,0)","v":{"$error":"#N/A"}},{"$f":"Orders!B1112/VLOOKUP(B1112,Tools!A:C,3,0)","v":{"$error":"#N/A"}},{"$f":"Orders!C1112/VLOOKUP(B1112,Tools!A:C,3,0)","v":{"$error":"#N/A"}},{"$f":"Orders!D1112/VLOOKUP(B1112,Tools!A:C,3,0)","v":{"$error":"#N/A"}}]
[{"$f":"Orders!A1113","v":0},{"$f":"VLOOKUP(A1113,'Product-tool'!A:B,2,0)","v":{"$error":"#N/A"}},{"$f":"Orders!B1113/VLOOKUP(B1113,Tools!A:C,3,0)","v":{"$error":"#N/A"}},{"$f":"Orders!C1113/VLOOKUP(B1113,Tools!A:C,3,0)","v":{"$error":"#N/A"}},{"$f":"Orders!D1113/VLOOKUP(B1113,Tools!A:C,3,0)","v":{"$error":"#N/A"}}]
[{"$f":"Orders!A1114","v":0},{"$f":"VLOOKUP(A1114,'Product-tool'!A:B,2,0)","v":{"$error":"#N/A"}},{"$f":"Orders!B1114/VLOOKUP(B1114,Tools!A:C,3,0)","v":{"$error":"#N/A"}},{"$f":"Orders!C1114/VLOOKUP(B1114,Tools!A:C,3,0)","v":{"$error":"#N/A"}},{"$f":"Orders!D1114/VLOOKUP(B1114,Tools!A:C,3,0)","v":{"$error":"#N/A"}}]
[{"$f":"Orders!A1115","v":0},{"$f":"VLOOKUP(A1115,'Product-tool'!A:B,2,0)","v":{"$error":"#N/A"}},{"$f":"Orders!B1115/VLOOKUP(B1115,Tools!A:C,3,0)","v":{"$error":"#N/A"}},{"$f":"Orders!C1115/VLOOKUP(B1115,Tools!A:C,3,0)","v":{"$error":"#N/A"}},{"$f":"Orders!D1115/VLOOKUP(B1115,Tools!A:C,3,0)","v":{"$error":"#N/A"}}]
[{"$f":"Orders!A1116","v":0},{"$f":"VLOOKUP(A1116,'Product-tool'!A:B,2,0)","v":{"$error":"#N/A"}},{"$f":"Orders!B1116/VLOOKUP(B1116,Tools!A:C,3,0)","v":{"$error":"#N/A"}},{"$f":"Orders!C1116/VLOOKUP(B1116,Tools!A:C,3,0)","v":{"$error":"#N/A"}},{"$f":"Orders!D1116/VLOOKUP(B1116,Tools!A:C,3,0)","v":{"$error":"#N/A"}}]
[{"$f":"Orders!A1117","v":0},{"$f":"VLOOKUP(A1117,'Product-tool'!A:B,2,0)","v":{"$error":"#N/A"}},{"$f":"Orders!B1117/VLOOKUP(B1117,Tools!A:C,3,0)","v":{"$error":"#N/A"}},{"$f":"Orders!C1117/VLOOKUP(B1117,Tools!A:C,3,0)","v":{"$error":"#N/A"}},{"$f":"Orders!D1117/VLOOKUP(B1117,Tools!A:C,3,0)","v":{"$error":"#N/A"}}]
[{"$f":"Orders!A1118","v":0},{"$f":"VLOOKUP(A1118,'Product-tool'!A:B,2,0)","v":{"$error":"#N/A"}},{"$f":"Orders!B1118/VLOOKUP(B1118,Tools!A:C,3,0)","v":{"$error":"#N/A"}},{"$f":"Orders!C1118/VLOOKUP(B1118,Tools!A:C,3,0)","v":{"$error":"#N/A"}},{"$f":"Orders!D1118/VLOOKUP(B1118,Tools!A:C,3,0)","v":{"$error":"#N/A"}}]
[{"$f":"Orders!A1119","v":0},{"$f":"VLOOKUP(A1119,'Product-tool'!A:B,2,0)","v":{"$error":"#N/A"}},{"$f":"Orders!B1119/VLOOKUP(B1119,Tools!A:C,3,0)","v":{"$error":"#N/A"}},{"$f":"Orders!C1119/VLOOKUP(B1119,Tools!A:C,3,0)","v":{"$error":"#N/A"}},{"$f":"Orders!D1119/VLOOKUP(B1119,Tools!A:C,3,0)","v":{"$error":"#N/A"}}]
[{"$f":"Orders!A1120","v":0},{"$f":"VLOOKUP(A1120,'Product-tool'!A:B,2,0)","v":{"$error":"#N/A"}},{"$f":"Orders!B1120/VLOOKUP(B1120,Tools!A:C,3,0)","v":{"$error":"#N/A"}},{"$f":"Orders!C1120/VLOOKUP(B1120,Tools!A:C,3,0)","v":{"$error":"#N/A"}},{"$f":"Orders!D1120/VLOOKUP(B1120,Tools!A:C,3,0)","v":{"$error":"#N/A"}}]
[{"$f":"Orders!A1121","v":0},{"$f":"VLOOKUP(A1121,'Product-tool'!A:B,2,0)","v":{"$error":"#N/A"}},{"$f":"Orders!B1121/VLOOKUP(B1121,Tools!A:C,3,0)","v":{"$error":"#N/A"}},{"$f":"Orders!C1121/VLOOKUP(B1121,Tools!A:C,3,0)","v":{"$error":"#N/A"}},{"$f":"Orders!D1121/VLOOKUP(B1121,Tools!A:C,3,0)","v":{"$error":"#N/A"}}]
[{"$f":"Orders!A1122","v":0},{"$f":"VLOOKUP(A1122,'Product-tool'!A:B,2,0)","v":{"$error":"#N/A"}},{"$f":"Orders!B1122/VLOOKUP(B1122,Tools!A:C,3,0)","v":{"$error":"#N/A"}},{"$f":"Orders!C1122/VLOOKUP(B1122,Tools!A:C,3,0)","v":{"$error":"#N/A"}},{"$f":"Orders!D1122/VLOOKUP(B1122,Tools!A:C,3,0)","v":{"$error":"#N/A"}}]
[{"$f":"Orders!A1123","v":0},{"$f":"VLOOKUP(A1123,'Product-tool'!A:B,2,0)","v":{"$error":"#N/A"}},{"$f":"Orders!B1123/VLOOKUP(B1123,Tools!A:C,3,0)","v":{"$error":"#N/A"}},{"$f":"Orders!C1123/VLOOKUP(B1123,Tools!A:C,3,0)","v":{"$error":"#N/A"}},{"$f":"Orders!D1123/VLOOKUP(B1123,Tools!A:C,3,0)","v":{"$error":"#N/A"}}]
[{"$f":"Orders!A1124","v":0},{"$f":"VLOOKUP(A1124,'Product-tool'!A:B,2,0)","v":{"$error":"#N/A"}},{"$f":"Orders!B1124/VLOOKUP(B1124,Tools!A:C,3,0)","v":{"$error":"#N/A"}},{"$f":"Orders!C1124/VLOOKUP(B1124,Tools!A:C,3,0)","v":{"$error":"#N/A"}},{"$f":"Orders!D1124/VLOOKUP(B1124,Tools!A:C,3,0)","v":{"$error":"#N/A"}}]
[{"$f":"Orders!A1125","v":0},{"$f":"VLOOKUP(A1125,'Product-tool'!A:B,2,0)","v":{"$error":"#N/A"}},{"$f":"Orders!B1125/VLOOKUP(B1125,Tools!A:C,3,0)","v":{"$error":"#N/A"}},{"$f":"Orders!C1125/VLOOKUP(B1125,Tools!A:C,3,0)","v":{"$error":"#N/A"}},{"$f":"Orders!D1125/VLOOKUP(B1125,Tools!A:C,3,0)","v":{"$error":"#N/A"}}]
[{"$f":"Orders!A1126","v":0},{"$f":"VLOOKUP(A1126,'Product-tool'!A:B,2,0)","v":{"$error":"#N/A"}},{"$f":"Orders!B1126/VLOOKUP(B1126,Tools!A:C,3,0)","v":{"$error":"#N/A"}},{"$f":"Orders!C1126/VLOOKUP(B1126,Tools!A:C,3,0)","v":{"$error":"#N/A"}},{"$f":"Orders!D1126/VLOOKUP(B1126,Tools!A:C,3,0)","v":{"$error":"#N/A"}}]
[{"$f":"Orders!A1127","v":0},{"$f":"VLOOKUP(A1127,'Product-tool'!A:B,2,0)","v":{"$error":"#N/A"}},{"$f":"Orders!B1127/VLOOKUP(B1127,Tools!A:C,3,0)","v":{"$error":"#N/A"}},{"$f":"Orders!C1127/VLOOKUP(B1127,Tools!A:C,3,0)","v":{"$error":"#N/A"}},{"$f":"Orders!D1127/VLOOKUP(B1127,Tools!A:C,3,0)","v":{"$error":"#N/A"}}]
[{"$f":"Orders!A1128","v":0},{"$f":"VLOOKUP(A1128,'Product-tool'!A:B,2,0)","v":{"$error":"#N/A"}},{"$f":"Orders!B1128/VLOOKUP(B1128,Tools!A:C,3,0)","v":{"$error":"#N/A"}},{"$f":"Orders!C1128/VLOOKUP(B1128,Tools!A:C,3,0)","v":{"$error":"#N/A"}},{"$f":"Orders!D1128/VLOOKUP(B1128,Tools!A:C,3,0)","v":{"$error":"#N/A"}}]
[{"$f":"Orders!A1129","v":0},{"$f":"VLOOKUP(A1129,'Product-tool'!A:B,2,0)","v":{"$error":"#N/A"}},{"$f":"Orders!B1129/VLOOKUP(B1129,Tools!A:C,3,0)","v":{"$error":"#N/A"}},{"$f":"Orders!C1129/VLOOKUP(B1129,Tools!A:C,3,0)","v":{"$error":"#N/A"}},{"$f":"Orders!D1129/VLOOKUP(B1129,Tools!A:C,3,0)","v":{"$error":"#N/A"}}]
[{"$f":"Orders!A1130","v":0},{"$f":"VLOOKUP(A1130,'Product-tool'!A:B,2,0)","v":{"$error":"#N/A"}},{"$f":"Orders!B1130/VLOOKUP(B1130,Tools!A:C,3,0)","v":{"$error":"#N/A"}},{"$f":"Orders!C1130/VLOOKUP(B1130,Tools!A:C,3,0)","v":{"$error":"#N/A"}},{"$f":"Orders!D1130/VLOOKUP(B1130,Tools!A:C,3,0)","v":{"$error":"#N/A"}}]
[{"$f":"Orders!A1131","v":0},{"$f":"VLOOKUP(A1131,'Product-tool'!A:B,2,0)","v":{"$error":"#N/A"}},{"$f":"Orders!B1131/VLOOKUP(B1131,Tools!A:C,3,0)","v":{"$error":"#N/A"}},{"$f":"Orders!C1131/VLOOKUP(B1131,Tools!A:C,3,0)","v":{"$error":"#N/A"}},{"$f":"Orders!D1131/VLOOKUP(B1131,Tools!A:C,3,0)","v":{"$error":"#N/A"}}]
[{"$f":"Orders!A1132","v":0},{"$f":"VLOOKUP(A1132,'Product-tool'!A:B,2,0)","v":{"$error":"#N/A"}},{"$f":"Orders!B1132/VLOOKUP(B1132,Tools!A:C,3,0)","v":{"$error":"#N/A"}},{"$f":"Orders!C1132/VLOOKUP(B1132,Tools!A:C,3,0)","v":{"$error":"#N/A"}},{"$f":"Orders!D1132/VLOOKUP(B1132,Tools!A:C,3,0)","v":{"$error":"#N/A"}}]
[{"$f":"Orders!A1133","v":0},{"$f":"VLOOKUP(A1133,'Product-tool'!A:B,2,0)","v":{"$error":"#N/A"}},{"$f":"Orders!B1133/VLOOKUP(B1133,Tools!A:C,3,0)","v":{"$error":"#N/A"}},{"$f":"Orders!C1133/VLOOKUP(B1133,Tools!A:C,3,0)","v":{"$error":"#N/A"}},{"$f":"Orders!D1133/VLOOKUP(B1133,Tools!A:C,3,0)","v":{"$error":"#N/A"}}]
[{"$f":"Orders!A1134","v":0},{"$f":"VLOOKUP(A1134,'Product-tool'!A:B,2,0)","v":{"$error":"#N/A"}},{"$f":"Orders!B1134/VLOOKUP(B1134,Tools!A:C,3,0)","v":{"$error":"#N/A"}},{"$f":"Orders!C1134/VLOOKUP(B1134,Tools!A:C,3,0)","v":{"$error":"#N/A"}},{"$f":"Orders!D1134/VLOOKUP(B1134,Tools!A:C,3,0)","v":{"$error":"#N/A"}}]
[{"$f":"Orders!A1135","v":0},{"$f":"VLOOKUP(A1135,'Product-tool'!A:B,2,0)","v":{"$error":"#N/A"}},{"$f":"Orders!B1135/VLOOKUP(B1135,Tools!A:C,3,0)","v":{"$error":"#N/A"}},{"$f":"Orders!C1135/VLOOKUP(B1135,Tools!A:C,3,0)","v":{"$error":"#N/A"}},{"$f":"Orders!D1135/VLOOKUP(B1135,Tools!A:C,3,0)","v":{"$error":"#N/A"}}]
[{"$f":"Orders!A1136","v":0},{"$f":"VLOOKUP(A1136,'Product-tool'!A:B,2,0)","v":{"$error":"#N/A"}},{"$f":"Orders!B1136/VLOOKUP(B1136,Tools!A:C,3,0)","v":{"$error":"#N/A"}},{"$f":"Orders!C1136/VLOOKUP(B1136,Tools!A:C,3,0)","v":{"$error":"#N/A"}},{"$f":"Orders!D1136/VLOOKUP(B1136,Tools!A:C,3,0)","v":{"$error":"#N/A"}}]
[{"$f":"Orders!A1137","v":0},{"$f":"VLOOKUP(A1137,'Product-tool'!A:B,2,0)","v":{"$error":"#N/A"}},{"$f":"Orders!B1137/VLOOKUP(B1137,Tools!A:C,3,0)","v":{"$error":"#N/A"}},{"$f":"Orders!C1137/VLOOKUP(B1137,Tools!A:C,3,0)","v":{"$error":"#N/A"}},{"$f":"Orders!D1137/VLOOKUP(B1137,Tools!A:C,3,0)","v":{"$error":"#N/A"}}]
[{"$f":"Orders!A1138","v":0},{"$f":"VLOOKUP(A1138,'Product-tool'!A:B,2,0)","v":{"$error":"#N/A"}},{"$f":"Orders!B1138/VLOOKUP(B1138,Tools!A:C,3,0)","v":{"$error":"#N/A"}},{"$f":"Orders!C1138/VLOOKUP(B1138,Tools!A:C,3,0)","v":{"$error":"#N/A"}},{"$f":"Orders!D1138/VLOOKUP(B1138,Tools!A:C,3,0)","v":{"$error":"#N/A"}}]
[{"$f":"Orders!A1139","v":0},{"$f":"VLOOKUP(A1139,'Product-tool'!A:B,2,0)","v":{"$error":"#N/A"}},{"$f":"Orders!B1139/VLOOKUP(B1139,Tools!A:C,3,0)","v":{"$error":"#N/A"}},{"$f":"Orders!C1139/VLOOKUP(B1139,Tools!A:C,3,0)","v":{"$error":"#N/A"}},{"$f":"Orders!D1139/VLOOKUP(B1139,Tools!A:C,3,0)","v":{"$error":"#N/A"}}]
[{"$f":"Orders!A1140","v":0},{"$f":"VLOOKUP(A1140,'Product-tool'!A:B,2,0)","v":{"$error":"#N/A"}},{"$f":"Orders!B1140/VLOOKUP(B1140,Tools!A:C,3,0)","v":{"$error":"#N/A"}},{"$f":"Orders!C1140/VLOOKUP(B1140,Tools!A:C,3,0)","v":{"$error":"#N/A"}},{"$f":"Orders!D1140/VLOOKUP(B1140,Tools!A:C,3,0)","v":{"$error":"#N/A"}}]
[{"$f":"Orders!A1141","v":0},{"$f":"VLOOKUP(A1141,'Product-tool'!A:B,2,0)","v":{"$error":"#N/A"}},{"$f":"Orders!B1141/VLOOKUP(B1141,Tools!A:C,3,0)","v":{"$error":"#N/A"}},{"$f":"Orders!C1141/VLOOKUP(B1141,Tools!A:C,3,0)","v":{"$error":"#N/A"}},{"$f":"Orders!D1141/VLOOKUP(B1141,Tools!A:C,3,0)","v":{"$error":"#N/A"}}]
[{"$f":"Orders!A1142","v":0},{"$f":"VLOOKUP(A1142,'Product-tool'!A:B,2,0)","v":{"$error":"#N/A"}},{"$f":"Orders!B1142/VLOOKUP(B1142,Tools!A:C,3,0)","v":{"$error":"#N/A"}},{"$f":"Orders!C1142/VLOOKUP(B1142,Tools!A:C,3,0)","v":{"$error":"#N/A"}},{"$f":"Orders!D1142/VLOOKUP(B1142,Tools!A:C,3,0)","v":{"$error":"#N/A"}}]
[{"$f":"Orders!A1143","v":0},{"$f":"VLOOKUP(A1143,'Product-tool'!A:B,2,0)","v":{"$error":"#N/A"}},{"$f":"Orders!B1143/VLOOKUP(B1143,Tools!A:C,3,0)","v":{"$error":"#N/A"}},{"$f":"Orders!C1143/VLOOKUP(B1143,Tools!A:C,3,0)","v":{"$error":"#N/A"}},{"$f":"Orders!D1143/VLOOKUP(B1143,Tools!A:C,3,0)","v":{"$error":"#N/A"}}]
[{"$f":"Orders!A1144","v":0},{"$f":"VLOOKUP(A1144,'Product-tool'!A:B,2,0)","v":{"$error":"#N/A"}},{"$f":"Orders!B1144/VLOOKUP(B1144,Tools!A:C,3,0)","v":{"$error":"#N/A"}},{"$f":"Orders!C1144/VLOOKUP(B1144,Tools!A:C,3,0)","v":{"$error":"#N/A"}},{"$f":"Orders!D1144/VLOOKUP(B1144,Tools!A:C,3,0)","v":{"$error":"#N/A"}}]
[{"$f":"Orders!A1145","v":0},{"$f":"VLOOKUP(A1145,'Product-tool'!A:B,2,0)","v":{"$error":"#N/A"}},{"$f":"Orders!B1145/VLOOKUP(B1145,Tools!A:C,3,0)","v":{"$error":"#N/A"}},{"$f":"Orders!C1145/VLOOKUP(B1145,Tools!A:C,3,0)","v":{"$error":"#N/A"}},{"$f":"Orders!D1145/VLOOKUP(B1145,Tools!A:C,3,0)","v":{"$error":"#N/A"}}]
[{"$f":"Orders!A1146","v":0},{"$f":"VLOOKUP(A1146,'Product-tool'!A:B,2,0)","v":{"$error":"#N/A"}},{"$f":"Orders!B1146/VLOOKUP(B1146,Tools!A:C,3,0)","v":{"$error":"#N/A"}},{"$f":"Orders!C1146/VLOOKUP(B1146,Tools!A:C,3,0)","v":{"$error":"#N/A"}},{"$f":"Orders!D1146/VLOOKUP(B1146,Tools!A:C,3,0)","v":{"$error":"#N/A"}}]
[{"$f":"Orders!A1147","v":0},{"$f":"VLOOKUP(A1147,'Product-tool'!A:B,2,0)","v":{"$error":"#N/A"}},{"$f":"Orders!B1147/VLOOKUP(B1147,Tools!A:C,3,0)","v":{"$error":"#N/A"}},{"$f":"Orders!C1147/VLOOKUP(B1147,Tools!A:C,3,0)","v":{"$error":"#N/A"}},{"$f":"Orders!D1147/VLOOKUP(B1147,Tools!A:C,3,0)","v":{"$error":"#N/A"}}]
[{"$f":"Orders!A1148","v":0},{"$f":"VLOOKUP(A1148,'Product-tool'!A:B,2,0)","v":{"$error":"#N/A"}},{"$f":"Orders!B1148/VLOOKUP(B1148,Tools!A:C,3,0)","v":{"$error":"#N/A"}},{"$f":"Orders!C1148/VLOOKUP(B1148,Tools!A:C,3,0)","v":{"$error":"#N/A"}},{"$f":"Orders!D1148/VLOOKUP(B1148,Tools!A:C,3,0)","v":{"$error":"#N/A"}}]
[{"$f":"Orders!A1149","v":0},{"$f":"VLOOKUP(A1149,'Product-tool'!A:B,2,0)","v":{"$error":"#N/A"}},{"$f":"Orders!B1149/VLOOKUP(B1149,Tools!A:C,3,0)","v":{"$error":"#N/A"}},{"$f":"Orders!C1149/VLOOKUP(B1149,Tools!A:C,3,0)","v":{"$error":"#N/A"}},{"$f":"Orders!D1149/VLOOKUP(B1149,Tools!A:C,3,0)","v":{"$error":"#N/A"}}]
[{"$f":"Orders!A1150","v":0},{"$f":"VLOOKUP(A1150,'Product-tool'!A:B,2,0)","v":{"$error":"#N/A"}},{"$f":"Orders!B1150/VLOOKUP(B1150,Tools!A:C,3,0)","v":{"$error":"#N/A"}},{"$f":"Orders!C1150/VLOOKUP(B1150,Tools!A:C,3,0)","v":{"$error":"#N/A"}},{"$f":"Orders!D1150/VLOOKUP(B1150,Tools!A:C,3,0)","v":{"$error":"#N/A"}}]
[{"$f":"Orders!A1151","v":0},{"$f":"VLOOKUP(A1151,'Product-tool'!A:B,2,0)","v":{"$error":"#N/A"}},{"$f":"Orders!B1151/VLOOKUP(B1151,Tools!A:C,3,0)","v":{"$error":"#N/A"}},{"$f":"Orders!C1151/VLOOKUP(B1151,Tools!A:C,3,0)","v":{"$error":"#N/A"}},{"$f":"Orders!D1151/VLOOKUP(B1151,Tools!A:C,3,0)","v":{"$error":"#N/A"}}]
[{"$f":"Orders!A1152","v":0},{"$f":"VLOOKUP(A1152,'Product-tool'!A:B,2,0)","v":{"$error":"#N/A"}},{"$f":"Orders!B1152/VLOOKUP(B1152,Tools!A:C,3,0)","v":{"$error":"#N/A"}},{"$f":"Orders!C1152/VLOOKUP(B1152,Tools!A:C,3,0)","v":{"$error":"#N/A"}},{"$f":"Orders!D1152/VLOOKUP(B1152,Tools!A:C,3,0)","v":{"$error":"#N/A"}}]
[{"$f":"Orders!A1153","v":0},{"$f":"VLOOKUP(A1153,'Product-tool'!A:B,2,0)","v":{"$error":"#N/A"}},{"$f":"Orders!B1153/VLOOKUP(B1153,Tools!A:C,3,0)","v":{"$error":"#N/A"}},{"$f":"Orders!C1153/VLOOKUP(B1153,Tools!A:C,3,0)","v":{"$error":"#N/A"}},{"$f":"Orders!D1153/VLOOKUP(B1153,Tools!A:C,3,0)","v":{"$error":"#N/A"}}]
[{"$f":"Orders!A1154","v":0},{"$f":"VLOOKUP(A1154,'Product-tool'!A:B,2,0)","v":{"$error":"#N/A"}},{"$f":"Orders!B1154/VLOOKUP(B1154,Tools!A:C,3,0)","v":{"$error":"#N/A"}},{"$f":"Orders!C1154/VLOOKUP(B1154,Tools!A:C,3,0)","v":{"$error":"#N/A"}},{"$f":"Orders!D1154/VLOOKUP(B1154,Tools!A:C,3,0)","v":{"$error":"#N/A"}}]
[{"$f":"Orders!A1155","v":0},{"$f":"VLOOKUP(A1155,'Product-tool'!A:B,2,0)","v":{"$error":"#N/A"}},{"$f":"Orders!B1155/VLOOKUP(B1155,Tools!A:C,3,0)","v":{"$error":"#N/A"}},{"$f":"Orders!C1155/VLOOKUP(B1155,Tools!A:C,3,0)","v":{"$error":"#N/A"}},{"$f":"Orders!D1155/VLOOKUP(B1155,Tools!A:C,3,0)","v":{"$error":"#N/A"}}]
[{"$f":"Orders!A1156","v":0},{"$f":"VLOOKUP(A1156,'Product-tool'!A:B,2,0)","v":{"$error":"#N/A"}},{"$f":"Orders!B1156/VLOOKUP(B1156,Tools!A:C,3,0)","v":{"$error":"#N/A"}},{"$f":"Orders!C1156/VLOOKUP(B1156,Tools!A:C,3,0)","v":{"$error":"#N/A"}},{"$f":"Orders!D1156/VLOOKUP(B1156,Tools!A:C,3,0)","v":{"$error":"#N/A"}}]
[{"$f":"Orders!A1157","v":0},{"$f":"VLOOKUP(A1157,'Product-tool'!A:B,2,0)","v":{"$error":"#N/A"}},{"$f":"Orders!B1157/VLOOKUP(B1157,Tools!A:C,3,0)","v":{"$error":"#N/A"}},{"$f":"Orders!C1157/VLOOKUP(B1157,Tools!A:C,3,0)","v":{"$error":"#N/A"}},{"$f":"Orders!D1157/VLOOKUP(B1157,Tools!A:C,3,0)","v":{"$error":"#N/A"}}]
[{"$f":"Orders!A1158","v":0},{"$f":"VLOOKUP(A1158,'Product-tool'!A:B,2,0)","v":{"$error":"#N/A"}},{"$f":"Orders!B1158/VLOOKUP(B1158,Tools!A:C,3,0)","v":{"$error":"#N/A"}},{"$f":"Orders!C1158/VLOOKUP(B1158,Tools!A:C,3,0)","v":{"$error":"#N/A"}},{"$f":"Orders!D1158/VLOOKUP(B1158,Tools!A:C,3,0)","v":{"$error":"#N/A"}}]
[{"$f":"Orders!A1159","v":0},{"$f":"VLOOKUP(A1159,'Product-tool'!A:B,2,0)","v":{"$error":"#N/A"}},{"$f":"Orders!B1159/VLOOKUP(B1159,Tools!A:C,3,0)","v":{"$error":"#N/A"}},{"$f":"Orders!C1159/VLOOKUP(B1159,Tools!A:C,3,0)","v":{"$error":"#N/A"}},{"$f":"Orders!D1159/VLOOKUP(B1159,Tools!A:C,3,0)","v":{"$error":"#N/A"}}]
[{"$f":"Orders!A1160","v":0},{"$f":"VLOOKUP(A1160,'Product-tool'!A:B,2,0)","v":{"$error":"#N/A"}},{"$f":"Orders!B1160/VLOOKUP(B1160,Tools!A:C,3,0)","v":{"$error":"#N/A"}},{"$f":"Orders!C1160/VLOOKUP(B1160,Tools!A:C,3,0)","v":{"$error":"#N/A"}},{"$f":"Orders!D1160/VLOOKUP(B1160,Tools!A:C,3,0)","v":{"$error":"#N/A"}}]
[{"$f":"Orders!A1161","v":0},{"$f":"VLOOKUP(A1161,'Product-tool'!A:B,2,0)","v":{"$error":"#N/A"}},{"$f":"Orders!B1161/VLOOKUP(B1161,Tools!A:C,3,0)","v":{"$error":"#N/A"}},{"$f":"Orders!C1161/VLOOKUP(B1161,Tools!A:C,3,0)","v":{"$error":"#N/A"}},{"$f":"Orders!D1161/VLOOKUP(B1161,Tools!A:C,3,0)","v":{"$error":"#N/A"}}]
[{"$f":"Orders!A1162","v":0},{"$f":"VLOOKUP(A1162,'Product-tool'!A:B,2,0)","v":{"$error":"#N/A"}},{"$f":"Orders!B1162/VLOOKUP(B1162,Tools!A:C,3,0)","v":{"$error":"#N/A"}},{"$f":"Orders!C1162/VLOOKUP(B1162,Tools!A:C,3,0)","v":{"$error":"#N/A"}},{"$f":"Orders!D1162/VLOOKUP(B1162,Tools!A:C,3,0)","v":{"$error":"#N/A"}}]
[{"$f":"Orders!A1163","v":0},{"$f":"VLOOKUP(A1163,'Product-tool'!A:B,2,0)","v":{"$error":"#N/A"}},{"$f":"Orders!B1163/VLOOKUP(B1163,Tools!A:C,3,0)","v":{"$error":"#N/A"}},{"$f":"Orders!C1163/VLOOKUP(B1163,Tools!A:C,3,0)","v":{"$error":"#N/A"}},{"$f":"Orders!D1163/VLOOKUP(B1163,Tools!A:C,3,0)","v":{"$error":"#N/A"}}]
[{"$f":"Orders!A1164","v":0},{"$f":"VLOOKUP(A1164,'Product-tool'!A:B,2,0)","v":{"$error":"#N/A"}},{"$f":"Orders!B1164/VLOOKUP(B1164,Tools!A:C,3,0)","v":{"$error":"#N/A"}},{"$f":"Orders!C1164/VLOOKUP(B1164,Tools!A:C,3,0)","v":{"$error":"#N/A"}},{"$f":"Orders!D1164/VLOOKUP(B1164,Tools!A:C,3,0)","v":{"$error":"#N/A"}}]
[{"$f":"Orders!A1165","v":0},{"$f":"VLOOKUP(A1165,'Product-tool'!A:B,2,0)","v":{"$error":"#N/A"}},{"$f":"Orders!B1165/VLOOKUP(B1165,Tools!A:C,3,0)","v":{"$error":"#N/A"}},{"$f":"Orders!C1165/VLOOKUP(B1165,Tools!A:C,3,0)","v":{"$error":"#N/A"}},{"$f":"Orders!D1165/VLOOKUP(B1165,Tools!A:C,3,0)","v":{"$error":"#N/A"}}]
[{"$f":"Orders!A1166","v":0},{"$f":"VLOOKUP(A1166,'Product-tool'!A:B,2,0)","v":{"$error":"#N/A"}},{"$f":"Orders!B1166/VLOOKUP(B1166,Tools!A:C,3,0)","v":{"$error":"#N/A"}},{"$f":"Orders!C1166/VLOOKUP(B1166,Tools!A:C,3,0)","v":{"$error":"#N/A"}},{"$f":"Orders!D1166/VLOOKUP(B1166,Tools!A:C,3,0)","v":{"$error":"#N/A"}}]
[{"$f":"Orders!A1167","v":0},{"$f":"VLOOKUP(A1167,'Product-tool'!A:B,2,0)","v":{"$error":"#N/A"}},{"$f":"Orders!B1167/VLOOKUP(B1167,Tools!A:C,3,0)","v":{"$error":"#N/A"}},{"$f":"Orders!C1167/VLOOKUP(B1167,Tools!A:C,3,0)","v":{"$error":"#N/A"}},{"$f":"Orders!D1167/VLOOKUP(B1167,Tools!A:C,3,0)","v":{"$error":"#N/A"}}]
[{"$f":"Orders!A1168","v":0},{"$f":"VLOOKUP(A1168,'Product-tool'!A:B,2,0)","v":{"$error":"#N/A"}},{"$f":"Orders!B1168/VLOOKUP(B1168,Tools!A:C,3,0)","v":{"$error":"#N/A"}},{"$f":"Orders!C1168/VLOOKUP(B1168,Tools!A:C,3,0)","v":{"$error":"#N/A"}},{"$f":"Orders!D1168/VLOOKUP(B1168,Tools!A:C,3,0)","v":{"$error":"#N/A"}}]
[{"$f":"Orders!A1169","v":0},{"$f":"VLOOKUP(A1169,'Product-tool'!A:B,2,0)","v":{"$error":"#N/A"}},{"$f":"Orders!B1169/VLOOKUP(B1169,Tools!A:C,3,0)","v":{"$error":"#N/A"}},{"$f":"Orders!C1169/VLOOKUP(B1169,Tools!A:C,3,0)","v":{"$error":"#N/A"}},{"$f":"Orders!D1169/VLOOKUP(B1169,Tools!A:C,3,0)","v":{"$error":"#N/A"}}]
[{"$f":"Orders!A1170","v":0},{"$f":"VLOOKUP(A1170,'Product-tool'!A:B,2,0)","v":{"$error":"#N/A"}},{"$f":"Orders!B1170/VLOOKUP(B1170,Tools!A:C,3,0)","v":{"$error":"#N/A"}},{"$f":"Orders!C1170/VLOOKUP(B1170,Tools!A:C,3,0)","v":{"$error":"#N/A"}},{"$f":"Orders!D1170/VLOOKUP(B1170,Tools!A:C,3,0)","v":{"$error":"#N/A"}}]
[{"$f":"Orders!A1171","v":0},{"$f":"VLOOKUP(A1171,'Product-tool'!A:B,2,0)","v":{"$error":"#N/A"}},{"$f":"Orders!B1171/VLOOKUP(B1171,Tools!A:C,3,0)","v":{"$error":"#N/A"}},{"$f":"Orders!C1171/VLOOKUP(B1171,Tools!A:C,3,0)","v":{"$error":"#N/A"}},{"$f":"Orders!D1171/VLOOKUP(B1171,Tools!A:C,3,0)","v":{"$error":"#N/A"}}]
[{"$f":"Orders!A1172","v":0},{"$f":"VLOOKUP(A1172,'Product-tool'!A:B,2,0)","v":{"$error":"#N/A"}},{"$f":"Orders!B1172/VLOOKUP(B1172,Tools!A:C,3,0)","v":{"$error":"#N/A"}},{"$f":"Orders!C1172/VLOOKUP(B1172,Tools!A:C,3,0)","v":{"$error":"#N/A"}},{"$f":"Orders!D1172/VLOOKUP(B1172,Tools!A:C,3,0)","v":{"$error":"#N/A"}}]
[{"$f":"Orders!A1173","v":0},{"$f":"VLOOKUP(A1173,'Product-tool'!A:B,2,0)","v":{"$error":"#N/A"}},{"$f":"Orders!B1173/VLOOKUP(B1173,Tools!A:C,3,0)","v":{"$error":"#N/A"}},{"$f":"Orders!C1173/VLOOKUP(B1173,Tools!A:C,3,0)","v":{"$error":"#N/A"}},{"$f":"Orders!D1173/VLOOKUP(B1173,Tools!A:C,3,0)","v":{"$error":"#N/A"}}]
[{"$f":"Orders!A1174","v":0},{"$f":"VLOOKUP(A1174,'Product-tool'!A:B,2,0)","v":{"$error":"#N/A"}},{"$f":"Orders!B1174/VLOOKUP(B1174,Tools!A:C,3,0)","v":{"$error":"#N/A"}},{"$f":"Orders!C1174/VLOOKUP(B1174,Tools!A:C,3,0)","v":{"$error":"#N/A"}},{"$f":"Orders!D1174/VLOOKUP(B1174,Tools!A:C,3,0)","v":{"$error":"#N/A"}}]
[{"$f":"Orders!A1175","v":0},{"$f":"VLOOKUP(A1175,'Product-tool'!A:B,2,0)","v":{"$error":"#N/A"}},{"$f":"Orders!B1175/VLOOKUP(B1175,Tools!A:C,3,0)","v":{"$error":"#N/A"}},{"$f":"Orders!C1175/VLOOKUP(B1175,Tools!A:C,3,0)","v":{"$error":"#N/A"}},{"$f":"Orders!D1175/VLOOKUP(B1175,Tools!A:C,3,0)","v":{"$error":"#N/A"}}]
[{"$f":"Orders!A1176","v":0},{"$f":"VLOOKUP(A1176,'Product-tool'!A:B,2,0)","v":{"$error":"#N/A"}},{"$f":"Orders!B1176/VLOOKUP(B1176,Tools!A:C,3,0)","v":{"$error":"#N/A"}},{"$f":"Orders!C1176/VLOOKUP(B1176,Tools!A:C,3,0)","v":{"$error":"#N/A"}},{"$f":"Orders!D1176/VLOOKUP(B1176,Tools!A:C,3,0)","v":{"$error":"#N/A"}}]
[{"$f":"Orders!A1177","v":0},{"$f":"VLOOKUP(A1177,'Product-tool'!A:B,2,0)","v":{"$error":"#N/A"}},{"$f":"Orders!B1177/VLOOKUP(B1177,Tools!A:C,3,0)","v":{"$error":"#N/A"}},{"$f":"Orders!C1177/VLOOKUP(B1177,Tools!A:C,3,0)","v":{"$error":"#N/A"}},{"$f":"Orders!D1177/VLOOKUP(B1177,Tools!A:C,3,0)","v":{"$error":"#N/A"}}]
[{"$f":"Orders!A1178","v":0},{"$f":"VLOOKUP(A1178,'Product-tool'!A:B,2,0)","v":{"$error":"#N/A"}},{"$f":"Orders!B1178/VLOOKUP(B1178,Tools!A:C,3,0)","v":{"$error":"#N/A"}},{"$f":"Orders!C1178/VLOOKUP(B1178,Tools!A:C,3,0)","v":{"$error":"#N/A"}},{"$f":"Orders!D1178/VLOOKUP(B1178,Tools!A:C,3,0)","v":{"$error":"#N/A"}}]
[{"$f":"Orders!A1179","v":0},{"$f":"VLOOKUP(A1179,'Product-tool'!A:B,2,0)","v":{"$error":"#N/A"}},{"$f":"Orders!B1179/VLOOKUP(B1179,Tools!A:C,3,0)","v":{"$error":"#N/A"}},{"$f":"Orders!C1179/VLOOKUP(B1179,Tools!A:C,3,0)","v":{"$error":"#N/A"}},{"$f":"Orders!D1179/VLOOKUP(B1179,Tools!A:C,3,0)","v":{"$error":"#N/A"}}]
[{"$f":"Orders!A1180","v":0},{"$f":"VLOOKUP(A1180,'Product-tool'!A:B,2,0)","v":{"$error":"#N/A"}},{"$f":"Orders!B1180/VLOOKUP(B1180,Tools!A:C,3,0)","v":{"$error":"#N/A"}},{"$f":"Orders!C1180/VLOOKUP(B1180,Tools!A:C,3,0)","v":{"$error":"#N/A"}},{"$f":"Orders!D1180/VLOOKUP(B1180,Tools!A:C,3,0)","v":{"$error":"#N/A"}}]
[{"$f":"Orders!A1181","v":0},{"$f":"VLOOKUP(A1181,'Product-tool'!A:B,2,0)","v":{"$error":"#N/A"}},{"$f":"Orders!B1181/VLOOKUP(B1181,Tools!A:C,3,0)","v":{"$error":"#N/A"}},{"$f":"Orders!C1181/VLOOKUP(B1181,Tools!A:C,3,0)","v":{"$error":"#N/A"}},{"$f":"Orders!D1181/VLOOKUP(B1181,Tools!A:C,3,0)","v":{"$error":"#N/A"}}]
[{"$f":"Orders!A1182","v":0},{"$f":"VLOOKUP(A1182,'Product-tool'!A:B,2,0)","v":{"$error":"#N/A"}},{"$f":"Orders!B1182/VLOOKUP(B1182,Tools!A:C,3,0)","v":{"$error":"#N/A"}},{"$f":"Orders!C1182/VLOOKUP(B1182,Tools!A:C,3,0)","v":{"$error":"#N/A"}},{"$f":"Orders!D1182/VLOOKUP(B1182,Tools!A:C,3,0)","v":{"$error":"#N/A"}}]
[{"$f":"Orders!A1183","v":0},{"$f":"VLOOKUP(A1183,'Product-tool'!A:B,2,0)","v":{"$error":"#N/A"}},{"$f":"Orders!B1183/VLOOKUP(B1183,Tools!A:C,3,0)","v":{"$error":"#N/A"}},{"$f":"Orders!C1183/VLOOKUP(B1183,Tools!A:C,3,0)","v":{"$error":"#N/A"}},{"$f":"Orders!D1183/VLOOKUP(B1183,Tools!A:C,3,0)","v":{"$error":"#N/A"}}]
[{"$f":"Orders!A1184","v":0},{"$f":"VLOOKUP(A1184,'Product-tool'!A:B,2,0)","v":{"$error":"#N/A"}},{"$f":"Orders!B1184/VLOOKUP(B1184,Tools!A:C,3,0)","v":{"$error":"#N/A"}},{"$f":"Orders!C1184/VLOOKUP(B1184,Tools!A:C,3,0)","v":{"$error":"#N/A"}},{"$f":"Orders!D1184/VLOOKUP(B1184,Tools!A:C,3,0)","v":{"$error":"#N/A"}}]
[{"$f":"Orders!A1185","v":0},{"$f":"VLOOKUP(A1185,'Product-tool'!A:B,2,0)","v":{"$error":"#N/A"}},{"$f":"Orders!B1185/VLOOKUP(B1185,Tools!A:C,3,0)","v":{"$error":"#N/A"}},{"$f":"Orders!C1185/VLOOKUP(B1185,Tools!A:C,3,0)","v":{"$error":"#N/A"}},{"$f":"Orders!D1185/VLOOKUP(B1185,Tools!A:C,3,0)","v":{"$error":"#N/A"}}]
[{"$f":"Orders!A1186","v":0},{"$f":"VLOOKUP(A1186,'Product-tool'!A:B,2,0)","v":{"$error":"#N/A"}},{"$f":"Orders!B1186/VLOOKUP(B1186,Tools!A:C,3,0)","v":{"$error":"#N/A"}},{"$f":"Orders!C1186/VLOOKUP(B1186,Tools!A:C,3,0)","v":{"$error":"#N/A"}},{"$f":"Orders!D1186/VLOOKUP(B1186,Tools!A:C,3,0)","v":{"$error":"#N/A"}}]
[{"$f":"Orders!A1187","v":0},{"$f":"VLOOKUP(A1187,'Product-tool'!A:B,2,0)","v":{"$error":"#N/A"}},{"$f":"Orders!B1187/VLOOKUP(B1187,Tools!A:C,3,0)","v":{"$error":"#N/A"}},{"$f":"Orders!C1187/VLOOKUP(B1187,Tools!A:C,3,0)","v":{"$error":"#N/A"}},{"$f":"Orders!D1187/VLOOKUP(B1187,Tools!A:C,3,0)","v":{"$error":"#N/A"}}]
[{"$f":"Orders!A1188","v":0},{"$f":"VLOOKUP(A1188,'Product-tool'!A:B,2,0)","v":{"$error":"#N/A"}},{"$f":"Orders!B1188/VLOOKUP(B1188,Tools!A:C,3,0)","v":{"$error":"#N/A"}},{"$f":"Orders!C1188/VLOOKUP(B1188,Tools!A:C,3,0)","v":{"$error":"#N/A"}},{"$f":"Orders!D1188/VLOOKUP(B1188,Tools!A:C,3,0)","v":{"$error":"#N/A"}}]
[{"$f":"Orders!A1189","v":0},{"$f":"VLOOKUP(A1189,'Product-tool'!A:B,2,0)","v":{"$error":"#N/A"}},{"$f":"Orders!B1189/VLOOKUP(B1189,Tools!A:C,3,0)","v":{"$error":"#N/A"}},{"$f":"Orders!C1189/VLOOKUP(B1189,Tools!A:C,3,0)","v":{"$error":"#N/A"}},{"$f":"Orders!D1189/VLOOKUP(B1189,Tools!A:C,3,0)","v":{"$error":"#N/A"}}]
[{"$f":"Orders!A1190","v":0},{"$f":"VLOOKUP(A1190,'Product-tool'!A:B,2,0)","v":{"$error":"#N/A"}},{"$f":"Orders!B1190/VLOOKUP(B1190,Tools!A:C,3,0)","v":{"$error":"#N/A"}},{"$f":"Orders!C1190/VLOOKUP(B1190,Tools!A:C,3,0)","v":{"$error":"#N/A"}},{"$f":"Orders!D1190/VLOOKUP(B1190,Tools!A:C,3,0)","v":{"$error":"#N/A"}}]
[{"$f":"Orders!A1191","v":0},{"$f":"VLOOKUP(A1191,'Product-tool'!A:B,2,0)","v":{"$error":"#N/A"}},{"$f":"Orders!B1191/VLOOKUP(B1191,Tools!A:C,3,0)","v":{"$error":"#N/A"}},{"$f":"Orders!C1191/VLOOKUP(B1191,Tools!A:C,3,0)","v":{"$error":"#N/A"}},{"$f":"Orders!D1191/VLOOKUP(B1191,Tools!A:C,3,0)","v":{"$error":"#N/A"}}]
[{"$f":"Orders!A1192","v":0},{"$f":"VLOOKUP(A1192,'Product-tool'!A:B,2,0)","v":{"$error":"#N/A"}},{"$f":"Orders!B1192/VLOOKUP(B1192,Tools!A:C,3,0)","v":{"$error":"#N/A"}},{"$f":"Orders!C1192/VLOOKUP(B1192,Tools!A:C,3,0)","v":{"$error":"#N/A"}},{"$f":"Orders!D1192/VLOOKUP(B1192,Tools!A:C,3,0)","v":{"$error":"#N/A"}}]
[{"$f":"Orders!A1193","v":0},{"$f":"VLOOKUP(A1193,'Product-tool'!A:B,2,0)","v":{"$error":"#N/A"}},{"$f":"Orders!B1193/VLOOKUP(B1193,Tools!A:C,3,0)","v":{"$error":"#N/A"}},{"$f":"Orders!C1193/VLOOKUP(B1193,Tools!A:C,3,0)","v":{"$error":"#N/A"}},{"$f":"Orders!D1193/VLOOKUP(B1193,Tools!A:C,3,0)","v":{"$error":"#N/A"}}]
[{"$f":"Orders!A1194","v":0},{"$f":"VLOOKUP(A1194,'Product-tool'!A:B,2,0)","v":{"$error":"#N/A"}},{"$f":"Orders!B1194/VLOOKUP(B1194,Tools!A:C,3,0)","v":{"$error":"#N/A"}},{"$f":"Orders!C1194/VLOOKUP(B1194,Tools!A:C,3,0)","v":{"$error":"#N/A"}},{"$f":"Orders!D1194/VLOOKUP(B1194,Tools!A:C,3,0)","v":{"$error":"#N/A"}}]
[{"$f":"Orders!A1195","v":0},{"$f":"VLOOKUP(A1195,'Product-tool'!A:B,2,0)","v":{"$error":"#N/A"}},{"$f":"Orders!B1195/VLOOKUP(B1195,Tools!A:C,3,0)","v":{"$error":"#N/A"}},{"$f":"Orders!C1195/VLOOKUP(B1195,Tools!A:C,3,0)","v":{"$error":"#N/A"}},{"$f":"Orders!D1195/VLOOKUP(B1195,Tools!A:C,3,0)","v":{"$error":"#N/A"}}]
[{"$f":"Orders!A1196","v":0},{"$f":"VLOOKUP(A1196,'Product-tool'!A:B,2,0)","v":{"$error":"#N/A"}},{"$f":"Orders!B1196/VLOOKUP(B1196,Tools!A:C,3,0)","v":{"$error":"#N/A"}},{"$f":"Orders!C1196/VLOOKUP(B1196,Tools!A:C,3,0)","v":{"$error":"#N/A"}},{"$f":"Orders!D1196/VLOOKUP(B1196,Tools!A:C,3,0)","v":{"$error":"#N/A"}}]
[{"$f":"Orders!A1197","v":0},{"$f":"VLOOKUP(A1197,'Product-tool'!A:B,2,0)","v":{"$error":"#N/A"}},{"$f":"Orders!B1197/VLOOKUP(B1197,Tools!A:C,3,0)","v":{"$error":"#N/A"}},{"$f":"Orders!C1197/VLOOKUP(B1197,Tools!A:C,3,0)","v":{"$error":"#N/A"}},{"$f":"Orders!D1197/VLOOKUP(B1197,Tools!A:C,3,0)","v":{"$error":"#N/A"}}]
[{"$f":"Orders!A1198","v":0},{"$f":"VLOOKUP(A1198,'Product-tool'!A:B,2,0)","v":{"$error":"#N/A"}},{"$f":"Orders!B1198/VLOOKUP(B1198,Tools!A:C,3,0)","v":{"$error":"#N/A"}},{"$f":"Orders!C1198/VLOOKUP(B1198,Tools!A:C,3,0)","v":{"$error":"#N/A"}},{"$f":"Orders!D1198/VLOOKUP(B1198,Tools!A:C,3,0)","v":{"$error":"#N/A"}}]
[{"$f":"Orders!A1199","v":0},{"$f":"VLOOKUP(A1199,'Product-tool'!A:B,2,0)","v":{"$error":"#N/A"}},{"$f":"Orders!B1199/VLOOKUP(B1199,Tools!A:C,3,0)","v":{"$error":"#N/A"}},{"$f":"Orders!C1199/VLOOKUP(B1199,Tools!A:C,3,0)","v":{"$error":"#N/A"}},{"$f":"Orders!D1199/VLOOKUP(B1199,Tools!A:C,3,0)","v":{"$error":"#N/A"}}]
[{"$f":"Orders!A1200","v":0},{"$f":"VLOOKUP(A1200,'Product-tool'!A:B,2,0)","v":{"$error":"#N/A"}},{"$f":"Orders!B1200/VLOOKUP(B1200,Tools!A:C,3,0)","v":{"$error":"#N/A"}},{"$f":"Orders!C1200/VLOOKUP(B1200,Tools!A:C,3,0)","v":{"$error":"#N/A"}},{"$f":"Orders!D1200/VLOOKUP(B1200,Tools!A:C,3,0)","v":{"$error":"#N/A"}}]
[{"$f":"Orders!A1201","v":0},{"$f":"VLOOKUP(A1201,'Product-tool'!A:B,2,0)","v":{"$error":"#N/A"}},{"$f":"Orders!B1201/VLOOKUP(B1201,Tools!A:C,3,0)","v":{"$error":"#N/A"}},{"$f":"Orders!C1201/VLOOKUP(B1201,Tools!A:C,3,0)","v":{"$error":"#N/A"}},{"$f":"Orders!D1201/VLOOKUP(B1201,Tools!A:C,3,0)","v":{"$error":"#N/A"}}]
[{"$f":"Orders!A1202","v":0},{"$f":"VLOOKUP(A1202,'Product-tool'!A:B,2,0)","v":{"$error":"#N/A"}},{"$f":"Orders!B1202/VLOOKUP(B1202,Tools!A:C,3,0)","v":{"$error":"#N/A"}},{"$f":"Orders!C1202/VLOOKUP(B1202,Tools!A:C,3,0)","v":{"$error":"#N/A"}},{"$f":"Orders!D1202/VLOOKUP(B1202,Tools!A:C,3,0)","v":{"$error":"#N/A"}}]
[{"$f":"Orders!A1203","v":0},{"$f":"VLOOKUP(A1203,'Product-tool'!A:B,2,0)","v":{"$error":"#N/A"}},{"$f":"Orders!B1203/VLOOKUP(B1203,Tools!A:C,3,0)","v":{"$error":"#N/A"}},{"$f":"Orders!C1203/VLOOKUP(B1203,Tools!A:C,3,0)","v":{"$error":"#N/A"}},{"$f":"Orders!D1203/VLOOKUP(B1203,Tools!A:C,3,0)","v":{"$error":"#N/A"}}]
[{"$f":"Orders!A1204","v":0},{"$f":"VLOOKUP(A1204,'Product-tool'!A:B,2,0)","v":{"$error":"#N/A"}},{"$f":"Orders!B1204/VLOOKUP(B1204,Tools!A:C,3,0)","v":{"$error":"#N/A"}},{"$f":"Orders!C1204/VLOOKUP(B1204,Tools!A:C,3,0)","v":{"$error":"#N/A"}},{"$f":"Orders!D1204/VLOOKUP(B1204,Tools!A:C,3,0)","v":{"$error":"#N/A"}}]
[{"$f":"Orders!A1205","v":0},{"$f":"VLOOKUP(A1205,'Product-tool'!A:B,2,0)","v":{"$error":"#N/A"}},{"$f":"Orders!B1205/VLOOKUP(B1205,Tools!A:C,3,0)","v":{"$error":"#N/A"}},{"$f":"Orders!C1205/VLOOKUP(B1205,Tools!A:C,3,0)","v":{"$error":"#N/A"}},{"$f":"Orders!D1205/VLOOKUP(B1205,Tools!A:C,3,0)","v":{"$error":"#N/A"}}]
[{"$f":"Orders!A1206","v":0},{"$f":"VLOOKUP(A1206,'Product-tool'!A:B,2,0)","v":{"$error":"#N/A"}},{"$f":"Orders!B1206/VLOOKUP(B1206,Tools!A:C,3,0)","v":{"$error":"#N/A"}},{"$f":"Orders!C1206/VLOOKUP(B1206,Tools!A:C,3,0)","v":{"$error":"#N/A"}},{"$f":"Orders!D1206/VLOOKUP(B1206,Tools!A:C,3,0)","v":{"$error":"#N/A"}}]
[{"$f":"Orders!A1207","v":0},{"$f":"VLOOKUP(A1207,'Product-tool'!A:B,2,0)","v":{"$error":"#N/A"}},{"$f":"Orders!B1207/VLOOKUP(B1207,Tools!A:C,3,0)","v":{"$error":"#N/A"}},{"$f":"Orders!C1207/VLOOKUP(B1207,Tools!A:C,3,0)","v":{"$error":"#N/A"}},{"$f":"Orders!D1207/VLOOKUP(B1207,Tools!A:C,3,0)","v":{"$error":"#N/A"}}]
[{"$f":"Orders!A1208","v":0},{"$f":"VLOOKUP(A1208,'Product-tool'!A:B,2,0)","v":{"$error":"#N/A"}},{"$f":"Orders!B1208/VLOOKUP(B1208,Tools!A:C,3,0)","v":{"$error":"#N/A"}},{"$f":"Orders!C1208/VLOOKUP(B1208,Tools!A:C,3,0)","v":{"$error":"#N/A"}},{"$f":"Orders!D1208/VLOOKUP(B1208,Tools!A:C,3,0)","v":{"$error":"#N/A"}}]
[{"$f":"Orders!A1209","v":0},{"$f":"VLOOKUP(A1209,'Product-tool'!A:B,2,0)","v":{"$error":"#N/A"}},{"$f":"Orders!B1209/VLOOKUP(B1209,Tools!A:C,3,0)","v":{"$error":"#N/A"}},{"$f":"Orders!C1209/VLOOKUP(B1209,Tools!A:C,3,0)","v":{"$error":"#N/A"}},{"$f":"Orders!D1209/VLOOKUP(B1209,Tools!A:C,3,0)","v":{"$error":"#N/A"}}]
[{"$f":"Orders!A1210","v":0},{"$f":"VLOOKUP(A1210,'Product-tool'!A:B,2,0)","v":{"$error":"#N/A"}},{"$f":"Orders!B1210/VLOOKUP(B1210,Tools!A:C,3,0)","v":{"$error":"#N/A"}},{"$f":"Orders!C1210/VLOOKUP(B1210,Tools!A:C,3,0)","v":{"$error":"#N/A"}},{"$f":"Orders!D1210/VLOOKUP(B1210,Tools!A:C,3,0)","v":{"$error":"#N/A"}}]
[{"$f":"Orders!A1211","v":0},{"$f":"VLOOKUP(A1211,'Product-tool'!A:B,2,0)","v":{"$error":"#N/A"}},{"$f":"Orders!B1211/VLOOKUP(B1211,Tools!A:C,3,0)","v":{"$error":"#N/A"}},{"$f":"Orders!C1211/VLOOKUP(B1211,Tools!A:C,3,0)","v":{"$error":"#N/A"}},{"$f":"Orders!D1211/VLOOKUP(B1211,Tools!A:C,3,0)","v":{"$error":"#N/A"}}]
[{"$f":"Orders!A1212","v":0},{"$f":"VLOOKUP(A1212,'Product-tool'!A:B,2,0)","v":{"$error":"#N/A"}},{"$f":"Orders!B1212/VLOOKUP(B1212,Tools!A:C,3,0)","v":{"$error":"#N/A"}},{"$f":"Orders!C1212/VLOOKUP(B1212,Tools!A:C,3,0)","v":{"$error":"#N/A"}},{"$f":"Orders!D1212/VLOOKUP(B1212,Tools!A:C,3,0)","v":{"$error":"#N/A"}}]
[{"$f":"Orders!A1213","v":0},{"$f":"VLOOKUP(A1213,'Product-tool'!A:B,2,0)","v":{"$error":"#N/A"}},{"$f":"Orders!B1213/VLOOKUP(B1213,Tools!A:C,3,0)","v":{"$error":"#N/A"}},{"$f":"Orders!C1213/VLOOKUP(B1213,Tools!A:C,3,0)","v":{"$error":"#N/A"}},{"$f":"Orders!D1213/VLOOKUP(B1213,Tools!A:C,3,0)","v":{"$error":"#N/A"}}]
[{"$f":"Orders!A1214","v":0},{"$f":"VLOOKUP(A1214,'Product-tool'!A:B,2,0)","v":{"$error":"#N/A"}},{"$f":"Orders!B1214/VLOOKUP(B1214,Tools!A:C,3,0)","v":{"$error":"#N/A"}},{"$f":"Orders!C1214/VLOOKUP(B1214,Tools!A:C,3,0)","v":{"$error":"#N/A"}},{"$f":"Orders!D1214/VLOOKUP(B1214,Tools!A:C,3,0)","v":{"$error":"#N/A"}}]
[{"$f":"Orders!A1215","v":0},{"$f":"VLOOKUP(A1215,'Product-tool'!A:B,2,0)","v":{"$error":"#N/A"}},{"$f":"Orders!B1215/VLOOKUP(B1215,Tools!A:C,3,0)","v":{"$error":"#N/A"}},{"$f":"Orders!C1215/VLOOKUP(B1215,Tools!A:C,3,0)","v":{"$error":"#N/A"}},{"$f":"Orders!D1215/VLOOKUP(B1215,Tools!A:C,3,0)","v":{"$error":"#N/A"}}]
[{"$f":"Orders!A1216","v":0},{"$f":"VLOOKUP(A1216,'Product-tool'!A:B,2,0)","v":{"$error":"#N/A"}},{"$f":"Orders!B1216/VLOOKUP(B1216,Tools!A:C,3,0)","v":{"$error":"#N/A"}},{"$f":"Orders!C1216/VLOOKUP(B1216,Tools!A:C,3,0)","v":{"$error":"#N/A"}},{"$f":"Orders!D1216/VLOOKUP(B1216,Tools!A:C,3,0)","v":{"$error":"#N/A"}}]
[{"$f":"Orders!A1217","v":0},{"$f":"VLOOKUP(A1217,'Product-tool'!A:B,2,0)","v":{"$error":"#N/A"}},{"$f":"Orders!B1217/VLOOKUP(B1217,Tools!A:C,3,0)","v":{"$error":"#N/A"}},{"$f":"Orders!C1217/VLOOKUP(B1217,Tools!A:C,3,0)","v":{"$error":"#N/A"}},{"$f":"Orders!D1217/VLOOKUP(B1217,Tools!A:C,3,0)","v":{"$error":"#N/A"}}]
[{"$f":"Orders!A1218","v":0},{"$f":"VLOOKUP(A1218,'Product-tool'!A:B,2,0)","v":{"$error":"#N/A"}},{"$f":"Orders!B1218/VLOOKUP(B1218,Tools!A:C,3,0)","v":{"$error":"#N/A"}},{"$f":"Orders!C1218/VLOOKUP(B1218,Tools!A:C,3,0)","v":{"$error":"#N/A"}},{"$f":"Orders!D1218/VLOOKUP(B1218,Tools!A:C,3,0)","v":{"$error":"#N/A"}}]
[{"$f":"Orders!A1219","v":0},{"$f":"VLOOKUP(A1219,'Product-tool'!A:B,2,0)","v":{"$error":"#N/A"}},{"$f":"Orders!B1219/VLOOKUP(B1219,Tools!A:C,3,0)","v":{"$error":"#N/A"}},{"$f":"Orders!C1219/VLOOKUP(B1219,Tools!A:C,3,0)","v":{"$error":"#N/A"}},{"$f":"Orders!D1219/VLOOKUP(B1219,Tools!A:C,3,0)","v":{"$error":"#N/A"}}]
[{"$f":"Orders!A1220","v":0},{"$f":"VLOOKUP(A1220,'Product-tool'!A:B,2,0)","v":{"$error":"#N/A"}},{"$f":"Orders!B1220/VLOOKUP(B1220,Tools!A:C,3,0)","v":{"$error":"#N/A"}},{"$f":"Orders!C1220/VLOOKUP(B1220,Tools!A:C,3,0)","v":{"$error":"#N/A"}},{"$f":"Orders!D1220/VLOOKUP(B1220,Tools!A:C,3,0)","v":{"$error":"#N/A"}}]
[{"$f":"Orders!A1221","v":0},{"$f":"VLOOKUP(A1221,'Product-tool'!A:B,2,0)","v":{"$error":"#N/A"}},{"$f":"Orders!B1221/VLOOKUP(B1221,Tools!A:C,3,0)","v":{"$error":"#N/A"}},{"$f":"Orders!C1221/VLOOKUP(B1221,Tools!A:C,3,0)","v":{"$error":"#N/A"}},{"$f":"Orders!D1221/VLOOKUP(B1221,Tools!A:C,3,0)","v":{"$error":"#N/A"}}]
[{"$f":"Orders!A1222","v":0},{"$f":"VLOOKUP(A1222,'Product-tool'!A:B,2,0)","v":{"$error":"#N/A"}},{"$f":"Orders!B1222/VLOOKUP(B1222,Tools!A:C,3,0)","v":{"$error":"#N/A"}},{"$f":"Orders!C1222/VLOOKUP(B1222,Tools!A:C,3,0)","v":{"$error":"#N/A"}},{"$f":"Orders!D1222/VLOOKUP(B1222,Tools!A:C,3,0)","v":{"$error":"#N/A"}}]
[{"$f":"Orders!A1223","v":0},{"$f":"VLOOKUP(A1223,'Product-tool'!A:B,2,0)","v":{"$error":"#N/A"}},{"$f":"Orders!B1223/VLOOKUP(B1223,Tools!A:C,3,0)","v":{"$error":"#N/A"}},{"$f":"Orders!C1223/VLOOKUP(B1223,Tools!A:C,3,0)","v":{"$error":"#N/A"}},{"$f":"Orders!D1223/VLOOKUP(B1223,Tools!A:C,3,0)","v":{"$error":"#N/A"}}]
[{"$f":"Orders!A1224","v":0},{"$f":"VLOOKUP(A1224,'Product-tool'!A:B,2,0)","v":{"$error":"#N/A"}},{"$f":"Orders!B1224/VLOOKUP(B1224,Tools!A:C,3,0)","v":{"$error":"#N/A"}},{"$f":"Orders!C1224/VLOOKUP(B1224,Tools!A:C,3,0)","v":{"$error":"#N/A"}},{"$f":"Orders!D1224/VLOOKUP(B1224,Tools!A:C,3,0)","v":{"$error":"#N/A"}}]
[{"$f":"Orders!A1225","v":0},{"$f":"VLOOKUP(A1225,'Product-tool'!A:B,2,0)","v":{"$error":"#N/A"}},{"$f":"Orders!B1225/VLOOKUP(B1225,Tools!A:C,3,0)","v":{"$error":"#N/A"}},{"$f":"Orders!C1225/VLOOKUP(B1225,Tools!A:C,3,0)","v":{"$error":"#N/A"}},{"$f":"Orders!D1225/VLOOKUP(B1225,Tools!A:C,3,0)","v":{"$error":"#N/A"}}]
[{"$f":"Orders!A1226","v":0},{"$f":"VLOOKUP(A1226,'Product-tool'!A:B,2,0)","v":{"$error":"#N/A"}},{"$f":"Orders!B1226/VLOOKUP(B1226,Tools!A:C,3,0)","v":{"$error":"#N/A"}},{"$f":"Orders!C1226/VLOOKUP(B1226,Tools!A:C,3,0)","v":{"$error":"#N/A"}},{"$f":"Orders!D1226/VLOOKUP(B1226,Tools!A:C,3,0)","v":{"$error":"#N/A"}}]
[{"$f":"Orders!A1227","v":0},{"$f":"VLOOKUP(A1227,'Product-tool'!A:B,2,0)","v":{"$error":"#N/A"}},{"$f":"Orders!B1227/VLOOKUP(B1227,Tools!A:C,3,0)","v":{"$error":"#N/A"}},{"$f":"Orders!C1227/VLOOKUP(B1227,Tools!A:C,3,0)","v":{"$error":"#N/A"}},{"$f":"Orders!D1227/VLOOKUP(B1227,Tools!A:C,3,0)","v":{"$error":"#N/A"}}]
[{"$f":"Orders!A1228","v":0},{"$f":"VLOOKUP(A1228,'Product-tool'!A:B,2,0)","v":{"$error":"#N/A"}},{"$f":"Orders!B1228/VLOOKUP(B1228,Tools!A:C,3,0)","v":{"$error":"#N/A"}},{"$f":"Orders!C1228/VLOOKUP(B1228,Tools!A:C,3,0)","v":{"$error":"#N/A"}},{"$f":"Orders!D1228/VLOOKUP(B1228,Tools!A:C,3,0)","v":{"$error":"#N/A"}}]
[{"$f":"Orders!A1229","v":0},{"$f":"VLOOKUP(A1229,'Product-tool'!A:B,2,0)","v":{"$error":"#N/A"}},{"$f":"Orders!B1229/VLOOKUP(B1229,Tools!A:C,3,0)","v":{"$error":"#N/A"}},{"$f":"Orders!C1229/VLOOKUP(B1229,Tools!A:C,3,0)","v":{"$error":"#N/A"}},{"$f":"Orders!D1229/VLOOKUP(B1229,Tools!A:C,3,0)","v":{"$error":"#N/A"}}]
[{"$f":"Orders!A1230","v":0},{"$f":"VLOOKUP(A1230,'Product-tool'!A:B,2,0)","v":{"$error":"#N/A"}},{"$f":"Orders!B1230/VLOOKUP(B1230,Tools!A:C,3,0)","v":{"$error":"#N/A"}},{"$f":"Orders!C1230/VLOOKUP(B1230,Tools!A:C,3,0)","v":{"$error":"#N/A"}},{"$f":"Orders!D1230/VLOOKUP(B1230,Tools!A:C,3,0)","v":{"$error":"#N/A"}}]
[{"$f":"Orders!A1231","v":0},{"$f":"VLOOKUP(A1231,'Product-tool'!A:B,2,0)","v":{"$error":"#N/A"}},{"$f":"Orders!B1231/VLOOKUP(B1231,Tools!A:C,3,0)","v":{"$error":"#N/A"}},{"$f":"Orders!C1231/VLOOKUP(B1231,Tools!A:C,3,0)","v":{"$error":"#N/A"}},{"$f":"Orders!D1231/VLOOKUP(B1231,Tools!A:C,3,0)","v":{"$error":"#N/A"}}]
[{"$f":"Orders!A1232","v":0},{"$f":"VLOOKUP(A1232,'Product-tool'!A:B,2,0)","v":{"$error":"#N/A"}},{"$f":"Orders!B1232/VLOOKUP(B1232,Tools!A:C,3,0)","v":{"$error":"#N/A"}},{"$f":"Orders!C1232/VLOOKUP(B1232,Tools!A:C,3,0)","v":{"$error":"#N/A"}},{"$f":"Orders!D1232/VLOOKUP(B1232,Tools!A:C,3,0)","v":{"$error":"#N/A"}}]
[{"$f":"Orders!A1233","v":0},{"$f":"VLOOKUP(A1233,'Product-tool'!A:B,2,0)","v":{"$error":"#N/A"}},{"$f":"Orders!B1233/VLOOKUP(B1233,Tools!A:C,3,0)","v":{"$error":"#N/A"}},{"$f":"Orders!C1233/VLOOKUP(B1233,Tools!A:C,3,0)","v":{"$error":"#N/A"}},{"$f":"Orders!D1233/VLOOKUP(B1233,Tools!A:C,3,0)","v":{"$error":"#N/A"}}]
[{"$f":"Orders!A1234","v":0},{"$f":"VLOOKUP(A1234,'Product-tool'!A:B,2,0)","v":{"$error":"#N/A"}},{"$f":"Orders!B1234/VLOOKUP(B1234,Tools!A:C,3,0)","v":{"$error":"#N/A"}},{"$f":"Orders!C1234/VLOOKUP(B1234,Tools!A:C,3,0)","v":{"$error":"#N/A"}},{"$f":"Orders!D1234/VLOOKUP(B1234,Tools!A:C,3,0)","v":{"$error":"#N/A"}}]
[{"$f":"Orders!A1235","v":0},{"$f":"VLOOKUP(A1235,'Product-tool'!A:B,2,0)","v":{"$error":"#N/A"}},{"$f":"Orders!B1235/VLOOKUP(B1235,Tools!A:C,3,0)","v":{"$error":"#N/A"}},{"$f":"Orders!C1235/VLOOKUP(B1235,Tools!A:C,3,0)","v":{"$error":"#N/A"}},{"$f":"Orders!D1235/VLOOKUP(B1235,Tools!A:C,3,0)","v":{"$error":"#N/A"}}]
[{"$f":"Orders!A1236","v":0},{"$f":"VLOOKUP(A1236,'Product-tool'!A:B,2,0)","v":{"$error":"#N/A"}},{"$f":"Orders!B1236/VLOOKUP(B1236,Tools!A:C,3,0)","v":{"$error":"#N/A"}},{"$f":"Orders!C1236/VLOOKUP(B1236,Tools!A:C,3,0)","v":{"$error":"#N/A"}},{"$f":"Orders!D1236/VLOOKUP(B1236,Tools!A:C,3,0)","v":{"$error":"#N/A"}}]
[{"$f":"Orders!A1237","v":0},{"$f":"VLOOKUP(A1237,'Product-tool'!A:B,2,0)","v":{"$error":"#N/A"}},{"$f":"Orders!B1237/VLOOKUP(B1237,Tools!A:C,3,0)","v":{"$error":"#N/A"}},{"$f":"Orders!C1237/VLOOKUP(B1237,Tools!A:C,3,0)","v":{"$error":"#N/A"}},{"$f":"Orders!D1237/VLOOKUP(B1237,Tools!A:C,3,0)","v":{"$error":"#N/A"}}]
[{"$f":"Orders!A1238","v":0},{"$f":"VLOOKUP(A1238,'Product-tool'!A:B,2,0)","v":{"$error":"#N/A"}},{"$f":"Orders!B1238/VLOOKUP(B1238,Tools!A:C,3,0)","v":{"$error":"#N/A"}},{"$f":"Orders!C1238/VLOOKUP(B1238,Tools!A:C,3,0)","v":{"$error":"#N/A"}},{"$f":"Orders!D1238/VLOOKUP(B1238,Tools!A:C,3,0)","v":{"$error":"#N/A"}}]
[{"$f":"Orders!A1239","v":0},{"$f":"VLOOKUP(A1239,'Product-tool'!A:B,2,0)","v":{"$error":"#N/A"}},{"$f":"Orders!B1239/VLOOKUP(B1239,Tools!A:C,3,0)","v":{"$error":"#N/A"}},{"$f":"Orders!C1239/VLOOKUP(B1239,Tools!A:C,3,0)","v":{"$error":"#N/A"}},{"$f":"Orders!D1239/VLOOKUP(B1239,Tools!A:C,3,0)","v":{"$error":"#N/A"}}]
[{"$f":"Orders!A1240","v":0},{"$f":"VLOOKUP(A1240,'Product-tool'!A:B,2,0)","v":{"$error":"#N/A"}},{"$f":"Orders!B1240/VLOOKUP(B1240,Tools!A:C,3,0)","v":{"$error":"#N/A"}},{"$f":"Orders!C1240/VLOOKUP(B1240,Tools!A:C,3,0)","v":{"$error":"#N/A"}},{"$f":"Orders!D1240/VLOOKUP(B1240,Tools!A:C,3,0)","v":{"$error":"#N/A"}}]
[{"$f":"Orders!A1241","v":0},{"$f":"VLOOKUP(A1241,'Product-tool'!A:B,2,0)","v":{"$error":"#N/A"}},{"$f":"Orders!B1241/VLOOKUP(B1241,Tools!A:C,3,0)","v":{"$error":"#N/A"}},{"$f":"Orders!C1241/VLOOKUP(B1241,Tools!A:C,3,0)","v":{"$error":"#N/A"}},{"$f":"Orders!D1241/VLOOKUP(B1241,Tools!A:C,3,0)","v":{"$error":"#N/A"}}]
[{"$f":"Orders!A1242","v":0},{"$f":"VLOOKUP(A1242,'Product-tool'!A:B,2,0)","v":{"$error":"#N/A"}},{"$f":"Orders!B1242/VLOOKUP(B1242,Tools!A:C,3,0)","v":{"$error":"#N/A"}},{"$f":"Orders!C1242/VLOOKUP(B1242,Tools!A:C,3,0)","v":{"$error":"#N/A"}},{"$f":"Orders!D1242/VLOOKUP(B1242,Tools!A:C,3,0)","v":{"$error":"#N/A"}}]
[{"$f":"Orders!A1243","v":0},{"$f":"VLOOKUP(A1243,'Product-tool'!A:B,2,0)","v":{"$error":"#N/A"}},{"$f":"Orders!B1243/VLOOKUP(B1243,Tools!A:C,3,0)","v":{"$error":"#N/A"}},{"$f":"Orders!C1243/VLOOKUP(B1243,Tools!A:C,3,0)","v":{"$error":"#N/A"}},{"$f":"Orders!D1243/VLOOKUP(B1243,Tools!A:C,3,0)","v":{"$error":"#N/A"}}]
[{"$f":"Orders!A1244","v":0},{"$f":"VLOOKUP(A1244,'Product-tool'!A:B,2,0)","v":{"$error":"#N/A"}},{"$f":"Orders!B1244/VLOOKUP(B1244,Tools!A:C,3,0)","v":{"$error":"#N/A"}},{"$f":"Orders!C1244/VLOOKUP(B1244,Tools!A:C,3,0)","v":{"$error":"#N/A"}},{"$f":"Orders!D1244/VLOOKUP(B1244,Tools!A:C,3,0)","v":{"$error":"#N/A"}}]
[{"$f":"Orders!A1245","v":0},{"$f":"VLOOKUP(A1245,'Product-tool'!A:B,2,0)","v":{"$error":"#N/A"}},{"$f":"Orders!B1245/VLOOKUP(B1245,Tools!A:C,3,0)","v":{"$error":"#N/A"}},{"$f":"Orders!C1245/VLOOKUP(B1245,Tools!A:C,3,0)","v":{"$error":"#N/A"}},{"$f":"Orders!D1245/VLOOKUP(B1245,Tools!A:C,3,0)","v":{"$error":"#N/A"}}]
[{"$f":"Orders!A1246","v":0},{"$f":"VLOOKUP(A1246,'Product-tool'!A:B,2,0)","v":{"$error":"#N/A"}},{"$f":"Orders!B1246/VLOOKUP(B1246,Tools!A:C,3,0)","v":{"$error":"#N/A"}},{"$f":"Orders!C1246/VLOOKUP(B1246,Tools!A:C,3,0)","v":{"$error":"#N/A"}},{"$f":"Orders!D1246/VLOOKUP(B1246,Tools!A:C,3,0)","v":{"$error":"#N/A"}}]
[{"$f":"Orders!A1247","v":0},{"$f":"VLOOKUP(A1247,'Product-tool'!A:B,2,0)","v":{"$error":"#N/A"}},{"$f":"Orders!B1247/VLOOKUP(B1247,Tools!A:C,3,0)","v":{"$error":"#N/A"}},{"$f":"Orders!C1247/VLOOKUP(B1247,Tools!A:C,3,0)","v":{"$error":"#N/A"}},{"$f":"Orders!D1247/VLOOKUP(B1247,Tools!A:C,3,0)","v":{"$error":"#N/A"}}]
[{"$f":"Orders!A1248","v":0},{"$f":"VLOOKUP(A1248,'Product-tool'!A:B,2,0)","v":{"$error":"#N/A"}},{"$f":"Orders!B1248/VLOOKUP(B1248,Tools!A:C,3,0)","v":{"$error":"#N/A"}},{"$f":"Orders!C1248/VLOOKUP(B1248,Tools!A:C,3,0)","v":{"$error":"#N/A"}},{"$f":"Orders!D1248/VLOOKUP(B1248,Tools!A:C,3,0)","v":{"$error":"#N/A"}}]
[{"$f":"Orders!A1249","v":0},{"$f":"VLOOKUP(A1249,'Product-tool'!A:B,2,0)","v":{"$error":"#N/A"}},{"$f":"Orders!B1249/VLOOKUP(B1249,Tools!A:C,3,0)","v":{"$error":"#N/A"}},{"$f":"Orders!C1249/VLOOKUP(B1249,Tools!A:C,3,0)","v":{"$error":"#N/A"}},{"$f":"Orders!D1249/VLOOKUP(B1249,Tools!A:C,3,0)","v":{"$error":"#N/A"}}]
[{"$f":"Orders!A1250","v":0},{"$f":"VLOOKUP(A1250,'Product-tool'!A:B,2,0)","v":{"$error":"#N/A"}},{"$f":"Orders!B1250/VLOOKUP(B1250,Tools!A:C,3,0)","v":{"$error":"#N/A"}},{"$f":"Orders!C1250/VLOOKUP(B1250,Tools!A:C,3,0)","v":{"$error":"#N/A"}},{"$f":"Orders!D1250/VLOOKUP(B1250,Tools!A:C,3,0)","v":{"$error":"#N/A"}}]
[{"$f":"Orders!A1251","v":0},{"$f":"VLOOKUP(A1251,'Product-tool'!A:B,2,0)","v":{"$error":"#N/A"}},{"$f":"Orders!B1251/VLOOKUP(B1251,Tools!A:C,3,0)","v":{"$error":"#N/A"}},{"$f":"Orders!C1251/VLOOKUP(B1251,Tools!A:C,3,0)","v":{"$error":"#N/A"}},{"$f":"Orders!D1251/VLOOKUP(B1251,Tools!A:C,3,0)","v":{"$error":"#N/A"}}]
[{"$f":"Orders!A1252","v":0},{"$f":"VLOOKUP(A1252,'Product-tool'!A:B,2,0)","v":{"$error":"#N/A"}},{"$f":"Orders!B1252/VLOOKUP(B1252,Tools!A:C,3,0)","v":{"$error":"#N/A"}},{"$f":"Orders!C1252/VLOOKUP(B1252,Tools!A:C,3,0)","v":{"$error":"#N/A"}},{"$f":"Orders!D1252/VLOOKUP(B1252,Tools!A:C,3,0)","v":{"$error":"#N/A"}}]
[{"$f":"Orders!A1253","v":0},{"$f":"VLOOKUP(A1253,'Product-tool'!A:B,2,0)","v":{"$error":"#N/A"}},{"$f":"Orders!B1253/VLOOKUP(B1253,Tools!A:C,3,0)","v":{"$error":"#N/A"}},{"$f":"Orders!C1253/VLOOKUP(B1253,Tools!A:C,3,0)","v":{"$error":"#N/A"}},{"$f":"Orders!D1253/VLOOKUP(B1253,Tools!A:C,3,0)","v":{"$error":"#N/A"}}]
[{"$f":"Orders!A1254","v":0},{"$f":"VLOOKUP(A1254,'Product-tool'!A:B,2,0)","v":{"$error":"#N/A"}},{"$f":"Orders!B1254/VLOOKUP(B1254,Tools!A:C,3,0)","v":{"$error":"#N/A"}},{"$f":"Orders!C1254/VLOOKUP(B1254,Tools!A:C,3,0)","v":{"$error":"#N/A"}},{"$f":"Orders!D1254/VLOOKUP(B1254,Tools!A:C,3,0)","v":{"$error":"#N/A"}}]
[{"$f":"Orders!A1255","v":0},{"$f":"VLOOKUP(A1255,'Product-tool'!A:B,2,0)","v":{"$error":"#N/A"}},{"$f":"Orders!B1255/VLOOKUP(B1255,Tools!A:C,3,0)","v":{"$error":"#N/A"}},{"$f":"Orders!C1255/VLOOKUP(B1255,Tools!A:C,3,0)","v":{"$error":"#N/A"}},{"$f":"Orders!D1255/VLOOKUP(B1255,Tools!A:C,3,0)","v":{"$error":"#N/A"}}]
[{"$f":"Orders!A1256","v":0},{"$f":"VLOOKUP(A1256,'Product-tool'!A:B,2,0)","v":{"$error":"#N/A"}},{"$f":"Orders!B1256/VLOOKUP(B1256,Tools!A:C,3,0)","v":{"$error":"#N/A"}},{"$f":"Orders!C1256/VLOOKUP(B1256,Tools!A:C,3,0)","v":{"$error":"#N/A"}},{"$f":"Orders!D1256/VLOOKUP(B1256,Tools!A:C,3,0)","v":{"$error":"#N/A"}}]
[{"$f":"Orders!A1257","v":0},{"$f":"VLOOKUP(A1257,'Product-tool'!A:B,2,0)","v":{"$error":"#N/A"}},{"$f":"Orders!B1257/VLOOKUP(B1257,Tools!A:C,3,0)","v":{"$error":"#N/A"}},{"$f":"Orders!C1257/VLOOKUP(B1257,Tools!A:C,3,0)","v":{"$error":"#N/A"}},{"$f":"Orders!D1257/VLOOKUP(B1257,Tools!A:C,3,0)","v":{"$error":"#N/A"}}]
[{"$f":"Orders!A1258","v":0},{"$f":"VLOOKUP(A1258,'Product-tool'!A:B,2,0)","v":{"$error":"#N/A"}},{"$f":"Orders!B1258/VLOOKUP(B1258,Tools!A:C,3,0)","v":{"$error":"#N/A"}},{"$f":"Orders!C1258/VLOOKUP(B1258,Tools!A:C,3,0)","v":{"$error":"#N/A"}},{"$f":"Orders!D1258/VLOOKUP(B1258,Tools!A:C,3,0)","v":{"$error":"#N/A"}}]
[{"$f":"Orders!A1259","v":0},{"$f":"VLOOKUP(A1259,'Product-tool'!A:B,2,0)","v":{"$error":"#N/A"}},{"$f":"Orders!B1259/VLOOKUP(B1259,Tools!A:C,3,0)","v":{"$error":"#N/A"}},{"$f":"Orders!C1259/VLOOKUP(B1259,Tools!A:C,3,0)","v":{"$error":"#N/A"}},{"$f":"Orders!D1259/VLOOKUP(B1259,Tools!A:C,3,0)","v":{"$error":"#N/A"}}]
[{"$f":"Orders!A1260","v":0},{"$f":"VLOOKUP(A1260,'Product-tool'!A:B,2,0)","v":{"$error":"#N/A"}},{"$f":"Orders!B1260/VLOOKUP(B1260,Tools!A:C,3,0)","v":{"$error":"#N/A"}},{"$f":"Orders!C1260/VLOOKUP(B1260,Tools!A:C,3,0)","v":{"$error":"#N/A"}},{"$f":"Orders!D1260/VLOOKUP(B1260,Tools!A:C,3,0)","v":{"$error":"#N/A"}}]
[{"$f":"Orders!A1261","v":0},{"$f":"VLOOKUP(A1261,'Product-tool'!A:B,2,0)","v":{"$error":"#N/A"}},{"$f":"Orders!B1261/VLOOKUP(B1261,Tools!A:C,3,0)","v":{"$error":"#N/A"}},{"$f":"Orders!C1261/VLOOKUP(B1261,Tools!A:C,3,0)","v":{"$error":"#N/A"}},{"$f":"Orders!D1261/VLOOKUP(B1261,Tools!A:C,3,0)","v":{"$error":"#N/A"}}]
[{"$f":"Orders!A1262","v":0},{"$f":"VLOOKUP(A1262,'Product-tool'!A:B,2,0)","v":{"$error":"#N/A"}},{"$f":"Orders!B1262/VLOOKUP(B1262,Tools!A:C,3,0)","v":{"$error":"#N/A"}},{"$f":"Orders!C1262/VLOOKUP(B1262,Tools!A:C,3,0)","v":{"$error":"#N/A"}},{"$f":"Orders!D1262/VLOOKUP(B1262,Tools!A:C,3,0)","v":{"$error":"#N/A"}}]
[{"$f":"Orders!A1263","v":0},{"$f":"VLOOKUP(A1263,'Product-tool'!A:B,2,0)","v":{"$error":"#N/A"}},{"$f":"Orders!B1263/VLOOKUP(B1263,Tools!A:C,3,0)","v":{"$error":"#N/A"}},{"$f":"Orders!C1263/VLOOKUP(B1263,Tools!A:C,3,0)","v":{"$error":"#N/A"}},{"$f":"Orders!D1263/VLOOKUP(B1263,Tools!A:C,3,0)","v":{"$error":"#N/A"}}]
[{"$f":"Orders!A1264","v":0},{"$f":"VLOOKUP(A1264,'Product-tool'!A:B,2,0)","v":{"$error":"#N/A"}},{"$f":"Orders!B1264/VLOOKUP(B1264,Tools!A:C,3,0)","v":{"$error":"#N/A"}},{"$f":"Orders!C1264/VLOOKUP(B1264,Tools!A:C,3,0)","v":{"$error":"#N/A"}},{"$f":"Orders!D1264/VLOOKUP(B1264,Tools!A:C,3,0)","v":{"$error":"#N/A"}}]
[{"$f":"Orders!A1265","v":0},{"$f":"VLOOKUP(A1265,'Product-tool'!A:B,2,0)","v":{"$error":"#N/A"}},{"$f":"Orders!B1265/VLOOKUP(B1265,Tools!A:C,3,0)","v":{"$error":"#N/A"}},{"$f":"Orders!C1265/VLOOKUP(B1265,Tools!A:C,3,0)","v":{"$error":"#N/A"}},{"$f":"Orders!D1265/VLOOKUP(B1265,Tools!A:C,3,0)","v":{"$error":"#N/A"}}]
[{"$f":"Orders!A1266","v":0},{"$f":"VLOOKUP(A1266,'Product-tool'!A:B,2,0)","v":{"$error":"#N/A"}},{"$f":"Orders!B1266/VLOOKUP(B1266,Tools!A:C,3,0)","v":{"$error":"#N/A"}},{"$f":"Orders!C1266/VLOOKUP(B1266,Tools!A:C,3,0)","v":{"$error":"#N/A"}},{"$f":"Orders!D1266/VLOOKUP(B1266,Tools!A:C,3,0)","v":{"$error":"#N/A"}}]
[{"$f":"Orders!A1267","v":0},{"$f":"VLOOKUP(A1267,'Product-tool'!A:B,2,0)","v":{"$error":"#N/A"}},{"$f":"Orders!B1267/VLOOKUP(B1267,Tools!A:C,3,0)","v":{"$error":"#N/A"}},{"$f":"Orders!C1267/VLOOKUP(B1267,Tools!A:C,3,0)","v":{"$error":"#N/A"}},{"$f":"Orders!D1267/VLOOKUP(B1267,Tools!A:C,3,0)","v":{"$error":"#N/A"}}]
[{"$f":"Orders!A1268","v":0},{"$f":"VLOOKUP(A1268,'Product-tool'!A:B,2,0)","v":{"$error":"#N/A"}},{"$f":"Orders!B1268/VLOOKUP(B1268,Tools!A:C,3,0)","v":{"$error":"#N/A"}},{"$f":"Orders!C1268/VLOOKUP(B1268,Tools!A:C,3,0)","v":{"$error":"#N/A"}},{"$f":"Orders!D1268/VLOOKUP(B1268,Tools!A:C,3,0)","v":{"$error":"#N/A"}}]
[{"$f":"Orders!A1269","v":0},{"$f":"VLOOKUP(A1269,'Product-tool'!A:B,2,0)","v":{"$error":"#N/A"}},{"$f":"Orders!B1269/VLOOKUP(B1269,Tools!A:C,3,0)","v":{"$error":"#N/A"}},{"$f":"Orders!C1269/VLOOKUP(B1269,Tools!A:C,3,0)","v":{"$error":"#N/A"}},{"$f":"Orders!D1269/VLOOKUP(B1269,Tools!A:C,3,0)","v":{"$error":"#N/A"}}]
[{"$f":"Orders!A1270","v":0},{"$f":"VLOOKUP(A1270,'Product-tool'!A:B,2,0)","v":{"$error":"#N/A"}},{"$f":"Orders!B1270/VLOOKUP(B1270,Tools!A:C,3,0)","v":{"$error":"#N/A"}},{"$f":"Orders!C1270/VLOOKUP(B1270,Tools!A:C,3,0)","v":{"$error":"#N/A"}},{"$f":"Orders!D1270/VLOOKUP(B1270,Tools!A:C,3,0)","v":{"$error":"#N/A"}}]
[{"$f":"Orders!A1271","v":0},{"$f":"VLOOKUP(A1271,'Product-tool'!A:B,2,0)","v":{"$error":"#N/A"}},{"$f":"Orders!B1271/VLOOKUP(B1271,Tools!A:C,3,0)","v":{"$error":"#N/A"}},{"$f":"Orders!C1271/VLOOKUP(B1271,Tools!A:C,3,0)","v":{"$error":"#N/A"}},{"$f":"Orders!D1271/VLOOKUP(B1271,Tools!A:C,3,0)","v":{"$error":"#N/A"}}]
[{"$f":"Orders!A1272","v":0},{"$f":"VLOOKUP(A1272,'Product-tool'!A:B,2,0)","v":{"$error":"#N/A"}},{"$f":"Orders!B1272/VLOOKUP(B1272,Tools!A:C,3,0)","v":{"$error":"#N/A"}},{"$f":"Orders!C1272/VLOOKUP(B1272,Tools!A:C,3,0)","v":{"$error":"#N/A"}},{"$f":"Orders!D1272/VLOOKUP(B1272,Tools!A:C,3,0)","v":{"$error":"#N/A"}}]
[{"$f":"Orders!A1273","v":0},{"$f":"VLOOKUP(A1273,'Product-tool'!A:B,2,0)","v":{"$error":"#N/A"}},{"$f":"Orders!B1273/VLOOKUP(B1273,Tools!A:C,3,0)","v":{"$error":"#N/A"}},{"$f":"Orders!C1273/VLOOKUP(B1273,Tools!A:C,3,0)","v":{"$error":"#N/A"}},{"$f":"Orders!D1273/VLOOKUP(B1273,Tools!A:C,3,0)","v":{"$error":"#N/A"}}]
[{"$f":"Orders!A1274","v":0},{"$f":"VLOOKUP(A1274,'Product-tool'!A:B,2,0)","v":{"$error":"#N/A"}},{"$f":"Orders!B1274/VLOOKUP(B1274,Tools!A:C,3,0)","v":{"$error":"#N/A"}},{"$f":"Orders!C1274/VLOOKUP(B1274,Tools!A:C,3,0)","v":{"$error":"#N/A"}},{"$f":"Orders!D1274/VLOOKUP(B1274,Tools!A:C,3,0)","v":{"$error":"#N/A"}}]
[{"$f":"Orders!A1275","v":0},{"$f":"VLOOKUP(A1275,'Product-tool'!A:B,2,0)","v":{"$error":"#N/A"}},{"$f":"Orders!B1275/VLOOKUP(B1275,Tools!A:C,3,0)","v":{"$error":"#N/A"}},{"$f":"Orders!C1275/VLOOKUP(B1275,Tools!A:C,3,0)","v":{"$error":"#N/A"}},{"$f":"Orders!D1275/VLOOKUP(B1275,Tools!A:C,3,0)","v":{"$error":"#N/A"}}]
[{"$f":"Orders!A1276","v":0},{"$f":"VLOOKUP(A1276,'Product-tool'!A:B,2,0)","v":{"$error":"#N/A"}},{"$f":"Orders!B1276/VLOOKUP(B1276,Tools!A:C,3,0)","v":{"$error":"#N/A"}},{"$f":"Orders!C1276/VLOOKUP(B1276,Tools!A:C,3,0)","v":{"$error":"#N/A"}},{"$f":"Orders!D1276/VLOOKUP(B1276,Tools!A:C,3,0)","v":{"$error":"#N/A"}}]
[{"$f":"Orders!A1277","v":0},{"$f":"VLOOKUP(A1277,'Product-tool'!A:B,2,0)","v":{"$error":"#N/A"}},{"$f":"Orders!B1277/VLOOKUP(B1277,Tools!A:C,3,0)","v":{"$error":"#N/A"}},{"$f":"Orders!C1277/VLOOKUP(B1277,Tools!A:C,3,0)","v":{"$error":"#N/A"}},{"$f":"Orders!D1277/VLOOKUP(B1277,Tools!A:C,3,0)","v":{"$error":"#N/A"}}]
[{"$f":"Orders!A1278","v":0},{"$f":"VLOOKUP(A1278,'Product-tool'!A:B,2,0)","v":{"$error":"#N/A"}},{"$f":"Orders!B1278/VLOOKUP(B1278,Tools!A:C,3,0)","v":{"$error":"#N/A"}},{"$f":"Orders!C1278/VLOOKUP(B1278,Tools!A:C,3,0)","v":{"$error":"#N/A"}},{"$f":"Orders!D1278/VLOOKUP(B1278,Tools!A:C,3,0)","v":{"$error":"#N/A"}}]
[{"$f":"Orders!A1279","v":0},{"$f":"VLOOKUP(A1279,'Product-tool'!A:B,2,0)","v":{"$error":"#N/A"}},{"$f":"Orders!B1279/VLOOKUP(B1279,Tools!A:C,3,0)","v":{"$error":"#N/A"}},{"$f":"Orders!C1279/VLOOKUP(B1279,Tools!A:C,3,0)","v":{"$error":"#N/A"}},{"$f":"Orders!D1279/VLOOKUP(B1279,Tools!A:C,3,0)","v":{"$error":"#N/A"}}]
[{"$f":"Orders!A1280","v":0},{"$f":"VLOOKUP(A1280,'Product-tool'!A:B,2,0)","v":{"$error":"#N/A"}},{"$f":"Orders!B1280/VLOOKUP(B1280,Tools!A:C,3,0)","v":{"$error":"#N/A"}},{"$f":"Orders!C1280/VLOOKUP(B1280,Tools!A:C,3,0)","v":{"$error":"#N/A"}},{"$f":"Orders!D1280/VLOOKUP(B1280,Tools!A:C,3,0)","v":{"$error":"#N/A"}}]
[{"$f":"Orders!A1281","v":0},{"$f":"VLOOKUP(A1281,'Product-tool'!A:B,2,0)","v":{"$error":"#N/A"}},{"$f":"Orders!B1281/VLOOKUP(B1281,Tools!A:C,3,0)","v":{"$error":"#N/A"}},{"$f":"Orders!C1281/VLOOKUP(B1281,Tools!A:C,3,0)","v":{"$error":"#N/A"}},{"$f":"Orders!D1281/VLOOKUP(B1281,Tools!A:C,3,0)","v":{"$error":"#N/A"}}]
[{"$f":"Orders!A1282","v":0},{"$f":"VLOOKUP(A1282,'Product-tool'!A:B,2,0)","v":{"$error":"#N/A"}},{"$f":"Orders!B1282/VLOOKUP(B1282,Tools!A:C,3,0)","v":{"$error":"#N/A"}},{"$f":"Orders!C1282/VLOOKUP(B1282,Tools!A:C,3,0)","v":{"$error":"#N/A"}},{"$f":"Orders!D1282/VLOOKUP(B1282,Tools!A:C,3,0)","v":{"$error":"#N/A"}}]
[{"$f":"Orders!A1283","v":0},{"$f":"VLOOKUP(A1283,'Product-tool'!A:B,2,0)","v":{"$error":"#N/A"}},{"$f":"Orders!B1283/VLOOKUP(B1283,Tools!A:C,3,0)","v":{"$error":"#N/A"}},{"$f":"Orders!C1283/VLOOKUP(B1283,Tools!A:C,3,0)","v":{"$error":"#N/A"}},{"$f":"Orders!D1283/VLOOKUP(B1283,Tools!A:C,3,0)","v":{"$error":"#N/A"}}]
[{"$f":"Orders!A1284","v":0},{"$f":"VLOOKUP(A1284,'Product-tool'!A:B,2,0)","v":{"$error":"#N/A"}},{"$f":"Orders!B1284/VLOOKUP(B1284,Tools!A:C,3,0)","v":{"$error":"#N/A"}},{"$f":"Orders!C1284/VLOOKUP(B1284,Tools!A:C,3,0)","v":{"$error":"#N/A"}},{"$f":"Orders!D1284/VLOOKUP(B1284,Tools!A:C,3,0)","v":{"$error":"#N/A"}}]
[{"$f":"Orders!A1285","v":0},{"$f":"VLOOKUP(A1285,'Product-tool'!A:B,2,0)","v":{"$error":"#N/A"}},{"$f":"Orders!B1285/VLOOKUP(B1285,Tools!A:C,3,0)","v":{"$error":"#N/A"}},{"$f":"Orders!C1285/VLOOKUP(B1285,Tools!A:C,3,0)","v":{"$error":"#N/A"}},{"$f":"Orders!D1285/VLOOKUP(B1285,Tools!A:C,3,0)","v":{"$error":"#N/A"}}]
[{"$f":"Orders!A1286","v":0},{"$f":"VLOOKUP(A1286,'Product-tool'!A:B,2,0)","v":{"$error":"#N/A"}},{"$f":"Orders!B1286/VLOOKUP(B1286,Tools!A:C,3,0)","v":{"$error":"#N/A"}},{"$f":"Orders!C1286/VLOOKUP(B1286,Tools!A:C,3,0)","v":{"$error":"#N/A"}},{"$f":"Orders!D1286/VLOOKUP(B1286,Tools!A:C,3,0)","v":{"$error":"#N/A"}}]
[{"$f":"Orders!A1287","v":0},{"$f":"VLOOKUP(A1287,'Product-tool'!A:B,2,0)","v":{"$error":"#N/A"}},{"$f":"Orders!B1287/VLOOKUP(B1287,Tools!A:C,3,0)","v":{"$error":"#N/A"}},{"$f":"Orders!C1287/VLOOKUP(B1287,Tools!A:C,3,0)","v":{"$error":"#N/A"}},{"$f":"Orders!D1287/VLOOKUP(B1287,Tools!A:C,3,0)","v":{"$error":"#N/A"}}]
[{"$f":"Orders!A1288","v":0},{"$f":"VLOOKUP(A1288,'Product-tool'!A:B,2,0)","v":{"$error":"#N/A"}},{"$f":"Orders!B1288/VLOOKUP(B1288,Tools!A:C,3,0)","v":{"$error":"#N/A"}},{"$f":"Orders!C1288/VLOOKUP(B1288,Tools!A:C,3,0)","v":{"$error":"#N/A"}},{"$f":"Orders!D1288/VLOOKUP(B1288,Tools!A:C,3,0)","v":{"$error":"#N/A"}}]
[{"$f":"Orders!A1289","v":0},{"$f":"VLOOKUP(A1289,'Product-tool'!A:B,2,0)","v":{"$error":"#N/A"}},{"$f":"Orders!B1289/VLOOKUP(B1289,Tools!A:C,3,0)","v":{"$error":"#N/A"}},{"$f":"Orders!C1289/VLOOKUP(B1289,Tools!A:C,3,0)","v":{"$error":"#N/A"}},{"$f":"Orders!D1289/VLOOKUP(B1289,Tools!A:C,3,0)","v":{"$error":"#N/A"}}]
[{"$f":"Orders!A1290","v":0},{"$f":"VLOOKUP(A1290,'Product-tool'!A:B,2,0)","v":{"$error":"#N/A"}},{"$f":"Orders!B1290/VLOOKUP(B1290,Tools!A:C,3,0)","v":{"$error":"#N/A"}},{"$f":"Orders!C1290/VLOOKUP(B1290,Tools!A:C,3,0)","v":{"$error":"#N/A"}},{"$f":"Orders!D1290/VLOOKUP(B1290,Tools!A:C,3,0)","v":{"$error":"#N/A"}}]
[{"$f":"Orders!A1291","v":0},{"$f":"VLOOKUP(A1291,'Product-tool'!A:B,2,0)","v":{"$error":"#N/A"}},{"$f":"Orders!B1291/VLOOKUP(B1291,Tools!A:C,3,0)","v":{"$error":"#N/A"}},{"$f":"Orders!C1291/VLOOKUP(B1291,Tools!A:C,3,0)","v":{"$error":"#N/A"}},{"$f":"Orders!D1291/VLOOKUP(B1291,Tools!A:C,3,0)","v":{"$error":"#N/A"}}]
[{"$f":"Orders!A1292","v":0},{"$f":"VLOOKUP(A1292,'Product-tool'!A:B,2,0)","v":{"$error":"#N/A"}},{"$f":"Orders!B1292/VLOOKUP(B1292,Tools!A:C,3,0)","v":{"$error":"#N/A"}},{"$f":"Orders!C1292/VLOOKUP(B1292,Tools!A:C,3,0)","v":{"$error":"#N/A"}},{"$f":"Orders!D1292/VLOOKUP(B1292,Tools!A:C,3,0)","v":{"$error":"#N/A"}}]
[{"$f":"Orders!A1293","v":0},{"$f":"VLOOKUP(A1293,'Product-tool'!A:B,2,0)","v":{"$error":"#N/A"}},{"$f":"Orders!B1293/VLOOKUP(B1293,Tools!A:C,3,0)","v":{"$error":"#N/A"}},{"$f":"Orders!C1293/VLOOKUP(B1293,Tools!A:C,3,0)","v":{"$error":"#N/A"}},{"$f":"Orders!D1293/VLOOKUP(B1293,Tools!A:C,3,0)","v":{"$error":"#N/A"}}]
[{"$f":"Orders!A1294","v":0},{"$f":"VLOOKUP(A1294,'Product-tool'!A:B,2,0)","v":{"$error":"#N/A"}},{"$f":"Orders!B1294/VLOOKUP(B1294,Tools!A:C,3,0)","v":{"$error":"#N/A"}},{"$f":"Orders!C1294/VLOOKUP(B1294,Tools!A:C,3,0)","v":{"$error":"#N/A"}},{"$f":"Orders!D1294/VLOOKUP(B1294,Tools!A:C,3,0)","v":{"$error":"#N/A"}}]
[{"$f":"Orders!A1295","v":0},{"$f":"VLOOKUP(A1295,'Product-tool'!A:B,2,0)","v":{"$error":"#N/A"}},{"$f":"Orders!B1295/VLOOKUP(B1295,Tools!A:C,3,0)","v":{"$error":"#N/A"}},{"$f":"Orders!C1295/VLOOKUP(B1295,Tools!A:C,3,0)","v":{"$error":"#N/A"}},{"$f":"Orders!D1295/VLOOKUP(B1295,Tools!A:C,3,0)","v":{"$error":"#N/A"}}]
[{"$f":"Orders!A1296","v":0},{"$f":"VLOOKUP(A1296,'Product-tool'!A:B,2,0)","v":{"$error":"#N/A"}},{"$f":"Orders!B1296/VLOOKUP(B1296,Tools!A:C,3,0)","v":{"$error":"#N/A"}},{"$f":"Orders!C1296/VLOOKUP(B1296,Tools!A:C,3,0)","v":{"$error":"#N/A"}},{"$f":"Orders!D1296/VLOOKUP(B1296,Tools!A:C,3,0)","v":{"$error":"#N/A"}}]
[{"$f":"Orders!A1297","v":0},{"$f":"VLOOKUP(A1297,'Product-tool'!A:B,2,0)","v":{"$error":"#N/A"}},{"$f":"Orders!B1297/VLOOKUP(B1297,Tools!A:C,3,0)","v":{"$error":"#N/A"}},{"$f":"Orders!C1297/VLOOKUP(B1297,Tools!A:C,3,0)","v":{"$error":"#N/A"}},{"$f":"Orders!D1297/VLOOKUP(B1297,Tools!A:C,3,0)","v":{"$error":"#N/A"}}]
[{"$f":"Orders!A1298","v":0},{"$f":"VLOOKUP(A1298,'Product-tool'!A:B,2,0)","v":{"$error":"#N/A"}},{"$f":"Orders!B1298/VLOOKUP(B1298,Tools!A:C,3,0)","v":{"$error":"#N/A"}},{"$f":"Orders!C1298/VLOOKUP(B1298,Tools!A:C,3,0)","v":{"$error":"#N/A"}},{"$f":"Orders!D1298/VLOOKUP(B1298,Tools!A:C,3,0)","v":{"$error":"#N/A"}}]
[{"$f":"Orders!A1299","v":0},{"$f":"VLOOKUP(A1299,'Product-tool'!A:B,2,0)","v":{"$error":"#N/A"}},{"$f":"Orders!B1299/VLOOKUP(B1299,Tools!A:C,3,0)","v":{"$error":"#N/A"}},{"$f":"Orders!C1299/VLOOKUP(B1299,Tools!A:C,3,0)","v":{"$error":"#N/A"}},{"$f":"Orders!D1299/VLOOKUP(B1299,Tools!A:C,3,0)","v":{"$error":"#N/A"}}]
[{"$f":"Orders!A1300","v":0},{"$f":"VLOOKUP(A1300,'Product-tool'!A:B,2,0)","v":{"$error":"#N/A"}},{"$f":"Orders!B1300/VLOOKUP(B1300,Tools!A:C,3,0)","v":{"$error":"#N/A"}},{"$f":"Orders!C1300/VLOOKUP(B1300,Tools!A:C,3,0)","v":{"$error":"#N/A"}},{"$f":"Orders!D1300/VLOOKUP(B1300,Tools!A:C,3,0)","v":{"$error":"#N/A"}}]
[{"$f":"Orders!A1301","v":0},{"$f":"VLOOKUP(A1301,'Product-tool'!A:B,2,0)","v":{"$error":"#N/A"}},{"$f":"Orders!B1301/VLOOKUP(B1301,Tools!A:C,3,0)","v":{"$error":"#N/A"}},{"$f":"Orders!C1301/VLOOKUP(B1301,Tools!A:C,3,0)","v":{"$error":"#N/A"}},{"$f":"Orders!D1301/VLOOKUP(B1301,Tools!A:C,3,0)","v":{"$error":"#N/A"}}]
[{"$f":"Orders!A1302","v":0},{"$f":"VLOOKUP(A1302,'Product-tool'!A:B,2,0)","v":{"$error":"#N/A"}},{"$f":"Orders!B1302/VLOOKUP(B1302,Tools!A:C,3,0)","v":{"$error":"#N/A"}},{"$f":"Orders!C1302/VLOOKUP(B1302,Tools!A:C,3,0)","v":{"$error":"#N/A"}},{"$f":"Orders!D1302/VLOOKUP(B1302,Tools!A:C,3,0)","v":{"$error":"#N/A"}}]
[{"$f":"Orders!A1303","v":0},{"$f":"VLOOKUP(A1303,'Product-tool'!A:B,2,0)","v":{"$error":"#N/A"}},{"$f":"Orders!B1303/VLOOKUP(B1303,Tools!A:C,3,0)","v":{"$error":"#N/A"}},{"$f":"Orders!C1303/VLOOKUP(B1303,Tools!A:C,3,0)","v":{"$error":"#N/A"}},{"$f":"Orders!D1303/VLOOKUP(B1303,Tools!A:C,3,0)","v":{"$error":"#N/A"}}]
[{"$f":"Orders!A1304","v":0},{"$f":"VLOOKUP(A1304,'Product-tool'!A:B,2,0)","v":{"$error":"#N/A"}},{"$f":"Orders!B1304/VLOOKUP(B1304,Tools!A:C,3,0)","v":{"$error":"#N/A"}},{"$f":"Orders!C1304/VLOOKUP(B1304,Tools!A:C,3,0)","v":{"$error":"#N/A"}},{"$f":"Orders!D1304/VLOOKUP(B1304,Tools!A:C,3,0)","v":{"$error":"#N/A"}}]
[{"$f":"Orders!A1305","v":0},{"$f":"VLOOKUP(A1305,'Product-tool'!A:B,2,0)","v":{"$error":"#N/A"}},{"$f":"Orders!B1305/VLOOKUP(B1305,Tools!A:C,3,0)","v":{"$error":"#N/A"}},{"$f":"Orders!C1305/VLOOKUP(B1305,Tools!A:C,3,0)","v":{"$error":"#N/A"}},{"$f":"Orders!D1305/VLOOKUP(B1305,Tools!A:C,3,0)","v":{"$error":"#N/A"}}]
[{"$f":"Orders!A1306","v":0},{"$f":"VLOOKUP(A1306,'Product-tool'!A:B,2,0)","v":{"$error":"#N/A"}},{"$f":"Orders!B1306/VLOOKUP(B1306,Tools!A:C,3,0)","v":{"$error":"#N/A"}},{"$f":"Orders!C1306/VLOOKUP(B1306,Tools!A:C,3,0)","v":{"$error":"#N/A"}},{"$f":"Orders!D1306/VLOOKUP(B1306,Tools!A:C,3,0)","v":{"$error":"#N/A"}}]
[{"$f":"Orders!A1307","v":0},{"$f":"VLOOKUP(A1307,'Product-tool'!A:B,2,0)","v":{"$error":"#N/A"}},{"$f":"Orders!B1307/VLOOKUP(B1307,Tools!A:C,3,0)","v":{"$error":"#N/A"}},{"$f":"Orders!C1307/VLOOKUP(B1307,Tools!A:C,3,0)","v":{"$error":"#N/A"}},{"$f":"Orders!D1307/VLOOKUP(B1307,Tools!A:C,3,0)","v":{"$error":"#N/A"}}]
[{"$f":"Orders!A1308","v":0},{"$f":"VLOOKUP(A1308,'Product-tool'!A:B,2,0)","v":{"$error":"#N/A"}},{"$f":"Orders!B1308/VLOOKUP(B1308,Tools!A:C,3,0)","v":{"$error":"#N/A"}},{"$f":"Orders!C1308/VLOOKUP(B1308,Tools!A:C,3,0)","v":{"$error":"#N/A"}},{"$f":"Orders!D1308/VLOOKUP(B1308,Tools!A:C,3,0)","v":{"$error":"#N/A"}}]
[{"$f":"Orders!A1309","v":0},{"$f":"VLOOKUP(A1309,'Product-tool'!A:B,2,0)","v":{"$error":"#N/A"}},{"$f":"Orders!B1309/VLOOKUP(B1309,Tools!A:C,3,0)","v":{"$error":"#N/A"}},{"$f":"Orders!C1309/VLOOKUP(B1309,Tools!A:C,3,0)","v":{"$error":"#N/A"}},{"$f":"Orders!D1309/VLOOKUP(B1309,Tools!A:C,3,0)","v":{"$error":"#N/A"}}]
[{"$f":"Orders!A1310","v":0},{"$f":"VLOOKUP(A1310,'Product-tool'!A:B,2,0)","v":{"$error":"#N/A"}},{"$f":"Orders!B1310/VLOOKUP(B1310,Tools!A:C,3,0)","v":{"$error":"#N/A"}},{"$f":"Orders!C1310/VLOOKUP(B1310,Tools!A:C,3,0)","v":{"$error":"#N/A"}},{"$f":"Orders!D1310/VLOOKUP(B1310,Tools!A:C,3,0)","v":{"$error":"#N/A"}}]
[{"$f":"Orders!A1311","v":0},{"$f":"VLOOKUP(A1311,'Product-tool'!A:B,2,0)","v":{"$error":"#N/A"}},{"$f":"Orders!B1311/VLOOKUP(B1311,Tools!A:C,3,0)","v":{"$error":"#N/A"}},{"$f":"Orders!C1311/VLOOKUP(B1311,Tools!A:C,3,0)","v":{"$error":"#N/A"}},{"$f":"Orders!D1311/VLOOKUP(B1311,Tools!A:C,3,0)","v":{"$error":"#N/A"}}]
[{"$f":"Orders!A1312","v":0},{"$f":"VLOOKUP(A1312,'Product-tool'!A:B,2,0)","v":{"$error":"#N/A"}},{"$f":"Orders!B1312/VLOOKUP(B1312,Tools!A:C,3,0)","v":{"$error":"#N/A"}},{"$f":"Orders!C1312/VLOOKUP(B1312,Tools!A:C,3,0)","v":{"$error":"#N/A"}},{"$f":"Orders!D1312/VLOOKUP(B1312,Tools!A:C,3,0)","v":{"$error":"#N/A"}}]
[{"$f":"Orders!A1313","v":0},{"$f":"VLOOKUP(A1313,'Product-tool'!A:B,2,0)","v":{"$error":"#N/A"}},{"$f":"Orders!B1313/VLOOKUP(B1313,Tools!A:C,3,0)","v":{"$error":"#N/A"}},{"$f":"Orders!C1313/VLOOKUP(B1313,Tools!A:C,3,0)","v":{"$error":"#N/A"}},{"$f":"Orders!D1313/VLOOKUP(B1313,Tools!A:C,3,0)","v":{"$error":"#N/A"}}]
[{"$f":"Orders!A1314","v":0},{"$f":"VLOOKUP(A1314,'Product-tool'!A:B,2,0)","v":{"$error":"#N/A"}},{"$f":"Orders!B1314/VLOOKUP(B1314,Tools!A:C,3,0)","v":{"$error":"#N/A"}},{"$f":"Orders!C1314/VLOOKUP(B1314,Tools!A:C,3,0)","v":{"$error":"#N/A"}},{"$f":"Orders!D1314/VLOOKUP(B1314,Tools!A:C,3,0)","v":{"$error":"#N/A"}}]
[{"$f":"Orders!A1315","v":0},{"$f":"VLOOKUP(A1315,'Product-tool'!A:B,2,0)","v":{"$error":"#N/A"}},{"$f":"Orders!B1315/VLOOKUP(B1315,Tools!A:C,3,0)","v":{"$error":"#N/A"}},{"$f":"Orders!C1315/VLOOKUP(B1315,Tools!A:C,3,0)","v":{"$error":"#N/A"}},{"$f":"Orders!D1315/VLOOKUP(B1315,Tools!A:C,3,0)","v":{"$error":"#N/A"}}]
[{"$f":"Orders!A1316","v":0},{"$f":"VLOOKUP(A1316,'Product-tool'!A:B,2,0)","v":{"$error":"#N/A"}},{"$f":"Orders!B1316/VLOOKUP(B1316,Tools!A:C,3,0)","v":{"$error":"#N/A"}},{"$f":"Orders!C1316/VLOOKUP(B1316,Tools!A:C,3,0)","v":{"$error":"#N/A"}},{"$f":"Orders!D1316/VLOOKUP(B1316,Tools!A:C,3,0)","v":{"$error":"#N/A"}}]
[{"$f":"Orders!A1317","v":0},{"$f":"VLOOKUP(A1317,'Product-tool'!A:B,2,0)","v":{"$error":"#N/A"}},{"$f":"Orders!B1317/VLOOKUP(B1317,Tools!A:C,3,0)","v":{"$error":"#N/A"}},{"$f":"Orders!C1317/VLOOKUP(B1317,Tools!A:C,3,0)","v":{"$error":"#N/A"}},{"$f":"Orders!D1317/VLOOKUP(B1317,Tools!A:C,3,0)","v":{"$error":"#N/A"}}]
[{"$f":"Orders!A1318","v":0},{"$f":"VLOOKUP(A1318,'Product-tool'!A:B,2,0)","v":{"$error":"#N/A"}},{"$f":"Orders!B1318/VLOOKUP(B1318,Tools!A:C,3,0)","v":{"$error":"#N/A"}},{"$f":"Orders!C1318/VLOOKUP(B1318,Tools!A:C,3,0)","v":{"$error":"#N/A"}},{"$f":"Orders!D1318/VLOOKUP(B1318,Tools!A:C,3,0)","v":{"$error":"#N/A"}}]
[{"$f":"Orders!A1319","v":0},{"$f":"VLOOKUP(A1319,'Product-tool'!A:B,2,0)","v":{"$error":"#N/A"}},{"$f":"Orders!B1319/VLOOKUP(B1319,Tools!A:C,3,0)","v":{"$error":"#N/A"}},{"$f":"Orders!C1319/VLOOKUP(B1319,Tools!A:C,3,0)","v":{"$error":"#N/A"}},{"$f":"Orders!D1319/VLOOKUP(B1319,Tools!A:C,3,0)","v":{"$error":"#N/A"}}]
[{"$f":"Orders!A1320","v":0},{"$f":"VLOOKUP(A1320,'Product-tool'!A:B,2,0)","v":{"$error":"#N/A"}},{"$f":"Orders!B1320/VLOOKUP(B1320,Tools!A:C,3,0)","v":{"$error":"#N/A"}},{"$f":"Orders!C1320/VLOOKUP(B1320,Tools!A:C,3,0)","v":{"$error":"#N/A"}},{"$f":"Orders!D1320/VLOOKUP(B1320,Tools!A:C,3,0)","v":{"$error":"#N/A"}}]
[{"$f":"Orders!A1321","v":0},{"$f":"VLOOKUP(A1321,'Product-tool'!A:B,2,0)","v":{"$error":"#N/A"}},{"$f":"Orders!B1321/VLOOKUP(B1321,Tools!A:C,3,0)","v":{"$error":"#N/A"}},{"$f":"Orders!C1321/VLOOKUP(B1321,Tools!A:C,3,0)","v":{"$error":"#N/A"}},{"$f":"Orders!D1321/VLOOKUP(B1321,Tools!A:C,3,0)","v":{"$error":"#N/A"}}]
[{"$f":"Orders!A1322","v":0},{"$f":"VLOOKUP(A1322,'Product-tool'!A:B,2,0)","v":{"$error":"#N/A"}},{"$f":"Orders!B1322/VLOOKUP(B1322,Tools!A:C,3,0)","v":{"$error":"#N/A"}},{"$f":"Orders!C1322/VLOOKUP(B1322,Tools!A:C,3,0)","v":{"$error":"#N/A"}},{"$f":"Orders!D1322/VLOOKUP(B1322,Tools!A:C,3,0)","v":{"$error":"#N/A"}}]
[{"$f":"Orders!A1323","v":0},{"$f":"VLOOKUP(A1323,'Product-tool'!A:B,2,0)","v":{"$error":"#N/A"}},{"$f":"Orders!B1323/VLOOKUP(B1323,Tools!A:C,3,0)","v":{"$error":"#N/A"}},{"$f":"Orders!C1323/VLOOKUP(B1323,Tools!A:C,3,0)","v":{"$error":"#N/A"}},{"$f":"Orders!D1323/VLOOKUP(B1323,Tools!A:C,3,0)","v":{"$error":"#N/A"}}]
[{"$f":"Orders!A1324","v":0},{"$f":"VLOOKUP(A1324,'Product-tool'!A:B,2,0)","v":{"$error":"#N/A"}},{"$f":"Orders!B1324/VLOOKUP(B1324,Tools!A:C,3,0)","v":{"$error":"#N/A"}},{"$f":"Orders!C1324/VLOOKUP(B1324,Tools!A:C,3,0)","v":{"$error":"#N/A"}},{"$f":"Orders!D1324/VLOOKUP(B1324,Tools!A:C,3,0)","v":{"$error":"#N/A"}}]
[{"$f":"Orders!A1325","v":0},{"$f":"VLOOKUP(A1325,'Product-tool'!A:B,2,0)","v":{"$error":"#N/A"}},{"$f":"Orders!B1325/VLOOKUP(B1325,Tools!A:C,3,0)","v":{"$error":"#N/A"}},{"$f":"Orders!C1325/VLOOKUP(B1325,Tools!A:C,3,0)","v":{"$error":"#N/A"}},{"$f":"Orders!D1325/VLOOKUP(B1325,Tools!A:C,3,0)","v":{"$error":"#N/A"}}]
[{"$f":"Orders!A1326","v":0},{"$f":"VLOOKUP(A1326,'Product-tool'!A:B,2,0)","v":{"$error":"#N/A"}},{"$f":"Orders!B1326/VLOOKUP(B1326,Tools!A:C,3,0)","v":{"$error":"#N/A"}},{"$f":"Orders!C1326/VLOOKUP(B1326,Tools!A:C,3,0)","v":{"$error":"#N/A"}},{"$f":"Orders!D1326/VLOOKUP(B1326,Tools!A:C,3,0)","v":{"$error":"#N/A"}}]
[{"$f":"Orders!A1327","v":0},{"$f":"VLOOKUP(A1327,'Product-tool'!A:B,2,0)","v":{"$error":"#N/A"}},{"$f":"Orders!B1327/VLOOKUP(B1327,Tools!A:C,3,0)","v":{"$error":"#N/A"}},{"$f":"Orders!C1327/VLOOKUP(B1327,Tools!A:C,3,0)","v":{"$error":"#N/A"}},{"$f":"Orders!D1327/VLOOKUP(B1327,Tools!A:C,3,0)","v":{"$error":"#N/A"}}]
[{"$f":"Orders!A1328","v":0},{"$f":"VLOOKUP(A1328,'Product-tool'!A:B,2,0)","v":{"$error":"#N/A"}},{"$f":"Orders!B1328/VLOOKUP(B1328,Tools!A:C,3,0)","v":{"$error":"#N/A"}},{"$f":"Orders!C1328/VLOOKUP(B1328,Tools!A:C,3,0)","v":{"$error":"#N/A"}},{"$f":"Orders!D1328/VLOOKUP(B1328,Tools!A:C,3,0)","v":{"$error":"#N/A"}}]
[{"$f":"Orders!A1329","v":0},{"$f":"VLOOKUP(A1329,'Product-tool'!A:B,2,0)","v":{"$error":"#N/A"}},{"$f":"Orders!B1329/VLOOKUP(B1329,Tools!A:C,3,0)","v":{"$error":"#N/A"}},{"$f":"Orders!C1329/VLOOKUP(B1329,Tools!A:C,3,0)","v":{"$error":"#N/A"}},{"$f":"Orders!D1329/VLOOKUP(B1329,Tools!A:C,3,0)","v":{"$error":"#N/A"}}]
[{"$f":"Orders!A1330","v":0},{"$f":"VLOOKUP(A1330,'Product-tool'!A:B,2,0)","v":{"$error":"#N/A"}},{"$f":"Orders!B1330/VLOOKUP(B1330,Tools!A:C,3,0)","v":{"$error":"#N/A"}},{"$f":"Orders!C1330/VLOOKUP(B1330,Tools!A:C,3,0)","v":{"$error":"#N/A"}},{"$f":"Orders!D1330/VLOOKUP(B1330,Tools!A:C,3,0)","v":{"$error":"#N/A"}}]
[{"$f":"Orders!A1331","v":0},{"$f":"VLOOKUP(A1331,'Product-tool'!A:B,2,0)","v":{"$error":"#N/A"}},{"$f":"Orders!B1331/VLOOKUP(B1331,Tools!A:C,3,0)","v":{"$error":"#N/A"}},{"$f":"Orders!C1331/VLOOKUP(B1331,Tools!A:C,3,0)","v":{"$error":"#N/A"}},{"$f":"Orders!D1331/VLOOKUP(B1331,Tools!A:C,3,0)","v":{"$error":"#N/A"}}]
[{"$f":"Orders!A1332","v":0},{"$f":"VLOOKUP(A1332,'Product-tool'!A:B,2,0)","v":{"$error":"#N/A"}},{"$f":"Orders!B1332/VLOOKUP(B1332,Tools!A:C,3,0)","v":{"$error":"#N/A"}},{"$f":"Orders!C1332/VLOOKUP(B1332,Tools!A:C,3,0)","v":{"$error":"#N/A"}},{"$f":"Orders!D1332/VLOOKUP(B1332,Tools!A:C,3,0)","v":{"$error":"#N/A"}}]
[{"$f":"Orders!A1333","v":0},{"$f":"VLOOKUP(A1333,'Product-tool'!A:B,2,0)","v":{"$error":"#N/A"}},{"$f":"Orders!B1333/VLOOKUP(B1333,Tools!A:C,3,0)","v":{"$error":"#N/A"}},{"$f":"Orders!C1333/VLOOKUP(B1333,Tools!A:C,3,0)","v":{"$error":"#N/A"}},{"$f":"Orders!D1333/VLOOKUP(B1333,Tools!A:C,3,0)","v":{"$error":"#N/A"}}]
[{"$f":"Orders!A1334","v":0},{"$f":"VLOOKUP(A1334,'Product-tool'!A:B,2,0)","v":{"$error":"#N/A"}},{"$f":"Orders!B1334/VLOOKUP(B1334,Tools!A:C,3,0)","v":{"$error":"#N/A"}},{"$f":"Orders!C1334/VLOOKUP(B1334,Tools!A:C,3,0)","v":{"$error":"#N/A"}},{"$f":"Orders!D1334/VLOOKUP(B1334,Tools!A:C,3,0)","v":{"$error":"#N/A"}}]
[{"$f":"Orders!A1335","v":0},{"$f":"VLOOKUP(A1335,'Product-tool'!A:B,2,0)","v":{"$error":"#N/A"}},{"$f":"Orders!B1335/VLOOKUP(B1335,Tools!A:C,3,0)","v":{"$error":"#N/A"}},{"$f":"Orders!C1335/VLOOKUP(B1335,Tools!A:C,3,0)","v":{"$error":"#N/A"}},{"$f":"Orders!D1335/VLOOKUP(B1335,Tools!A:C,3,0)","v":{"$error":"#N/A"}}]
[{"$f":"Orders!A1336","v":0},{"$f":"VLOOKUP(A1336,'Product-tool'!A:B,2,0)","v":{"$error":"#N/A"}},{"$f":"Orders!B1336/VLOOKUP(B1336,Tools!A:C,3,0)","v":{"$error":"#N/A"}},{"$f":"Orders!C1336/VLOOKUP(B1336,Tools!A:C,3,0)","v":{"$error":"#N/A"}},{"$f":"Orders!D1336/VLOOKUP(B1336,Tools!A:C,3,0)","v":{"$error":"#N/A"}}]
[{"$f":"Orders!A1337","v":0},{"$f":"VLOOKUP(A1337,'Product-tool'!A:B,2,0)","v":{"$error":"#N/A"}},{"$f":"Orders!B1337/VLOOKUP(B1337,Tools!A:C,3,0)","v":{"$error":"#N/A"}},{"$f":"Orders!C1337/VLOOKUP(B1337,Tools!A:C,3,0)","v":{"$error":"#N/A"}},{"$f":"Orders!D1337/VLOOKUP(B1337,Tools!A:C,3,0)","v":{"$error":"#N/A"}}]
[{"$f":"Orders!A1338","v":0},{"$f":"VLOOKUP(A1338,'Product-tool'!A:B,2,0)","v":{"$error":"#N/A"}},{"$f":"Orders!B1338/VLOOKUP(B1338,Tools!A:C,3,0)","v":{"$error":"#N/A"}},{"$f":"Orders!C1338/VLOOKUP(B1338,Tools!A:C,3,0)","v":{"$error":"#N/A"}},{"$f":"Orders!D1338/VLOOKUP(B1338,Tools!A:C,3,0)","v":{"$error":"#N/A"}}]
[{"$f":"Orders!A1339","v":0},{"$f":"VLOOKUP(A1339,'Product-tool'!A:B,2,0)","v":{"$error":"#N/A"}},{"$f":"Orders!B1339/VLOOKUP(B1339,Tools!A:C,3,0)","v":{"$error":"#N/A"}},{"$f":"Orders!C1339/VLOOKUP(B1339,Tools!A:C,3,0)","v":{"$error":"#N/A"}},{"$f":"Orders!D1339/VLOOKUP(B1339,Tools!A:C,3,0)","v":{"$error":"#N/A"}}]
[{"$f":"Orders!A1340","v":0},{"$f":"VLOOKUP(A1340,'Product-tool'!A:B,2,0)","v":{"$error":"#N/A"}},{"$f":"Orders!B1340/VLOOKUP(B1340,Tools!A:C,3,0)","v":{"$error":"#N/A"}},{"$f":"Orders!C1340/VLOOKUP(B1340,Tools!A:C,3,0)","v":{"$error":"#N/A"}},{"$f":"Orders!D1340/VLOOKUP(B1340,Tools!A:C,3,0)","v":{"$error":"#N/A"}}]
[{"$f":"Orders!A1341","v":0},{"$f":"VLOOKUP(A1341,'Product-tool'!A:B,2,0)","v":{"$error":"#N/A"}},{"$f":"Orders!B1341/VLOOKUP(B1341,Tools!A:C,3,0)","v":{"$error":"#N/A"}},{"$f":"Orders!C1341/VLOOKUP(B1341,Tools!A:C,3,0)","v":{"$error":"#N/A"}},{"$f":"Orders!D1341/VLOOKUP(B1341,Tools!A:C,3,0)","v":{"$error":"#N/A"}}]
[{"$f":"Orders!A1342","v":0},{"$f":"VLOOKUP(A1342,'Product-tool'!A:B,2,0)","v":{"$error":"#N/A"}},{"$f":"Orders!B1342/VLOOKUP(B1342,Tools!A:C,3,0)","v":{"$error":"#N/A"}},{"$f":"Orders!C1342/VLOOKUP(B1342,Tools!A:C,3,0)","v":{"$error":"#N/A"}},{"$f":"Orders!D1342/VLOOKUP(B1342,Tools!A:C,3,0)","v":{"$error":"#N/A"}}]
[{"$f":"Orders!A1343","v":0},{"$f":"VLOOKUP(A1343,'Product-tool'!A:B,2,0)","v":{"$error":"#N/A"}},{"$f":"Orders!B1343/VLOOKUP(B1343,Tools!A:C,3,0)","v":{"$error":"#N/A"}},{"$f":"Orders!C1343/VLOOKUP(B1343,Tools!A:C,3,0)","v":{"$error":"#N/A"}},{"$f":"Orders!D1343/VLOOKUP(B1343,Tools!A:C,3,0)","v":{"$error":"#N/A"}}]
[{"$f":"Orders!A1344","v":0},{"$f":"VLOOKUP(A1344,'Product-tool'!A:B,2,0)","v":{"$error":"#N/A"}},{"$f":"Orders!B1344/VLOOKUP(B1344,Tools!A:C,3,0)","v":{"$error":"#N/A"}},{"$f":"Orders!C1344/VLOOKUP(B1344,Tools!A:C,3,0)","v":{"$error":"#N/A"}},{"$f":"Orders!D1344/VLOOKUP(B1344,Tools!A:C,3,0)","v":{"$error":"#N/A"}}]
[{"$f":"Orders!A1345","v":0},{"$f":"VLOOKUP(A1345,'Product-tool'!A:B,2,0)","v":{"$error":"#N/A"}},{"$f":"Orders!B1345/VLOOKUP(B1345,Tools!A:C,3,0)","v":{"$error":"#N/A"}},{"$f":"Orders!C1345/VLOOKUP(B1345,Tools!A:C,3,0)","v":{"$error":"#N/A"}},{"$f":"Orders!D1345/VLOOKUP(B1345,Tools!A:C,3,0)","v":{"$error":"#N/A"}}]
[{"$f":"Orders!A1346","v":0},{"$f":"VLOOKUP(A1346,'Product-tool'!A:B,2,0)","v":{"$error":"#N/A"}},{"$f":"Orders!B1346/VLOOKUP(B1346,Tools!A:C,3,0)","v":{"$error":"#N/A"}},{"$f":"Orders!C1346/VLOOKUP(B1346,Tools!A:C,3,0)","v":{"$error":"#N/A"}},{"$f":"Orders!D1346/VLOOKUP(B1346,Tools!A:C,3,0)","v":{"$error":"#N/A"}}]
[{"$f":"Orders!A1347","v":0},{"$f":"VLOOKUP(A1347,'Product-tool'!A:B,2,0)","v":{"$error":"#N/A"}},{"$f":"Orders!B1347/VLOOKUP(B1347,Tools!A:C,3,0)","v":{"$error":"#N/A"}},{"$f":"Orders!C1347/VLOOKUP(B1347,Tools!A:C,3,0)","v":{"$error":"#N/A"}},{"$f":"Orders!D1347/VLOOKUP(B1347,Tools!A:C,3,0)","v":{"$error":"#N/A"}}]
[{"$f":"Orders!A1348","v":0},{"$f":"VLOOKUP(A1348,'Product-tool'!A:B,2,0)","v":{"$error":"#N/A"}},{"$f":"Orders!B1348/VLOOKUP(B1348,Tools!A:C,3,0)","v":{"$error":"#N/A"}},{"$f":"Orders!C1348/VLOOKUP(B1348,Tools!A:C,3,0)","v":{"$error":"#N/A"}},{"$f":"Orders!D1348/VLOOKUP(B1348,Tools!A:C,3,0)","v":{"$error":"#N/A"}}]
[{"$f":"Orders!A1349","v":0},{"$f":"VLOOKUP(A1349,'Product-tool'!A:B,2,0)","v":{"$error":"#N/A"}},{"$f":"Orders!B1349/VLOOKUP(B1349,Tools!A:C,3,0)","v":{"$error":"#N/A"}},{"$f":"Orders!C1349/VLOOKUP(B1349,Tools!A:C,3,0)","v":{"$error":"#N/A"}},{"$f":"Orders!D1349/VLOOKUP(B1349,Tools!A:C,3,0)","v":{"$error":"#N/A"}}]
[{"$f":"Orders!A1350","v":0},{"$f":"VLOOKUP(A1350,'Product-tool'!A:B,2,0)","v":{"$error":"#N/A"}},{"$f":"Orders!B1350/VLOOKUP(B1350,Tools!A:C,3,0)","v":{"$error":"#N/A"}},{"$f":"Orders!C1350/VLOOKUP(B1350,Tools!A:C,3,0)","v":{"$error":"#N/A"}},{"$f":"Orders!D1350/VLOOKUP(B1350,Tools!A:C,3,0)","v":{"$error":"#N/A"}}]
[{"$f":"Orders!A1351","v":0},{"$f":"VLOOKUP(A1351,'Product-tool'!A:B,2,0)","v":{"$error":"#N/A"}},{"$f":"Orders!B1351/VLOOKUP(B1351,Tools!A:C,3,0)","v":{"$error":"#N/A"}},{"$f":"Orders!C1351/VLOOKUP(B1351,Tools!A:C,3,0)","v":{"$error":"#N/A"}},{"$f":"Orders!D1351/VLOOKUP(B1351,Tools!A:C,3,0)","v":{"$error":"#N/A"}}]
[{"$f":"Orders!A1352","v":0},{"$f":"VLOOKUP(A1352,'Product-tool'!A:B,2,0)","v":{"$error":"#N/A"}},{"$f":"Orders!B1352/VLOOKUP(B1352,Tools!A:C,3,0)","v":{"$error":"#N/A"}},{"$f":"Orders!C1352/VLOOKUP(B1352,Tools!A:C,3,0)","v":{"$error":"#N/A"}},{"$f":"Orders!D1352/VLOOKUP(B1352,Tools!A:C,3,0)","v":{"$error":"#N/A"}}]
[{"$f":"Orders!A1353","v":0},{"$f":"VLOOKUP(A1353,'Product-tool'!A:B,2,0)","v":{"$error":"#N/A"}},{"$f":"Orders!B1353/VLOOKUP(B1353,Tools!A:C,3,0)","v":{"$error":"#N/A"}},{"$f":"Orders!C1353/VLOOKUP(B1353,Tools!A:C,3,0)","v":{"$error":"#N/A"}},{"$f":"Orders!D1353/VLOOKUP(B1353,Tools!A:C,3,0)","v":{"$error":"#N/A"}}]
[{"$f":"Orders!A1354","v":0},{"$f":"VLOOKUP(A1354,'Product-tool'!A:B,2,0)","v":{"$error":"#N/A"}},{"$f":"Orders!B1354/VLOOKUP(B1354,Tools!A:C,3,0)","v":{"$error":"#N/A"}},{"$f":"Orders!C1354/VLOOKUP(B1354,Tools!A:C,3,0)","v":{"$error":"#N/A"}},{"$f":"Orders!D1354/VLOOKUP(B1354,Tools!A:C,3,0)","v":{"$error":"#N/A"}}]
[{"$f":"Orders!A1355","v":0},{"$f":"VLOOKUP(A1355,'Product-tool'!A:B,2,0)","v":{"$error":"#N/A"}},{"$f":"Orders!B1355/VLOOKUP(B1355,Tools!A:C,3,0)","v":{"$error":"#N/A"}},{"$f":"Orders!C1355/VLOOKUP(B1355,Tools!A:C,3,0)","v":{"$error":"#N/A"}},{"$f":"Orders!D1355/VLOOKUP(B1355,Tools!A:C,3,0)","v":{"$error":"#N/A"}}]
[{"$f":"Orders!A1356","v":0},{"$f":"VLOOKUP(A1356,'Product-tool'!A:B,2,0)","v":{"$error":"#N/A"}},{"$f":"Orders!B1356/VLOOKUP(B1356,Tools!A:C,3,0)","v":{"$error":"#N/A"}},{"$f":"Orders!C1356/VLOOKUP(B1356,Tools!A:C,3,0)","v":{"$error":"#N/A"}},{"$f":"Orders!D1356/VLOOKUP(B1356,Tools!A:C,3,0)","v":{"$error":"#N/A"}}]
[{"$f":"Orders!A1357","v":0},{"$f":"VLOOKUP(A1357,'Product-tool'!A:B,2,0)","v":{"$error":"#N/A"}},{"$f":"Orders!B1357/VLOOKUP(B1357,Tools!A:C,3,0)","v":{"$error":"#N/A"}},{"$f":"Orders!C1357/VLOOKUP(B1357,Tools!A:C,3,0)","v":{"$error":"#N/A"}},{"$f":"Orders!D1357/VLOOKUP(B1357,Tools!A:C,3,0)","v":{"$error":"#N/A"}}]
[{"$f":"Orders!A1358","v":0},{"$f":"VLOOKUP(A1358,'Product-tool'!A:B,2,0)","v":{"$error":"#N/A"}},{"$f":"Orders!B1358/VLOOKUP(B1358,Tools!A:C,3,0)","v":{"$error":"#N/A"}},{"$f":"Orders!C1358/VLOOKUP(B1358,Tools!A:C,3,0)","v":{"$error":"#N/A"}},{"$f":"Orders!D1358/VLOOKUP(B1358,Tools!A:C,3,0)","v":{"$error":"#N/A"}}]
[{"$f":"Orders!A1359","v":0},{"$f":"VLOOKUP(A1359,'Product-tool'!A:B,2,0)","v":{"$error":"#N/A"}},{"$f":"Orders!B1359/VLOOKUP(B1359,Tools!A:C,3,0)","v":{"$error":"#N/A"}},{"$f":"Orders!C1359/VLOOKUP(B1359,Tools!A:C,3,0)","v":{"$error":"#N/A"}},{"$f":"Orders!D1359/VLOOKUP(B1359,Tools!A:C,3,0)","v":{"$error":"#N/A"}}]
[{"$f":"Orders!A1360","v":0},{"$f":"VLOOKUP(A1360,'Product-tool'!A:B,2,0)","v":{"$error":"#N/A"}},{"$f":"Orders!B1360/VLOOKUP(B1360,Tools!A:C,3,0)","v":{"$error":"#N/A"}},{"$f":"Orders!C1360/VLOOKUP(B1360,Tools!A:C,3,0)","v":{"$error":"#N/A"}},{"$f":"Orders!D1360/VLOOKUP(B1360,Tools!A:C,3,0)","v":{"$error":"#N/A"}}]
[{"$f":"Orders!A1361","v":0},{"$f":"VLOOKUP(A1361,'Product-tool'!A:B,2,0)","v":{"$error":"#N/A"}},{"$f":"Orders!B1361/VLOOKUP(B1361,Tools!A:C,3,0)","v":{"$error":"#N/A"}},{"$f":"Orders!C1361/VLOOKUP(B1361,Tools!A:C,3,0)","v":{"$error":"#N/A"}},{"$f":"Orders!D1361/VLOOKUP(B1361,Tools!A:C,3,0)","v":{"$error":"#N/A"}}]
[{"$f":"Orders!A1362","v":0},{"$f":"VLOOKUP(A1362,'Product-tool'!A:B,2,0)","v":{"$error":"#N/A"}},{"$f":"Orders!B1362/VLOOKUP(B1362,Tools!A:C,3,0)","v":{"$error":"#N/A"}},{"$f":"Orders!C1362/VLOOKUP(B1362,Tools!A:C,3,0)","v":{"$error":"#N/A"}},{"$f":"Orders!D1362/VLOOKUP(B1362,Tools!A:C,3,0)","v":{"$error":"#N/A"}}]
[{"$f":"Orders!A1363","v":0},{"$f":"VLOOKUP(A1363,'Product-tool'!A:B,2,0)","v":{"$error":"#N/A"}},{"$f":"Orders!B1363/VLOOKUP(B1363,Tools!A:C,3,0)","v":{"$error":"#N/A"}},{"$f":"Orders!C1363/VLOOKUP(B1363,Tools!A:C,3,0)","v":{"$error":"#N/A"}},{"$f":"Orders!D1363/VLOOKUP(B1363,Tools!A:C,3,0)","v":{"$error":"#N/A"}}]
[{"$f":"Orders!A1364","v":0},{"$f":"VLOOKUP(A1364,'Product-tool'!A:B,2,0)","v":{"$error":"#N/A"}},{"$f":"Orders!B1364/VLOOKUP(B1364,Tools!A:C,3,0)","v":{"$error":"#N/A"}},{"$f":"Orders!C1364/VLOOKUP(B1364,Tools!A:C,3,0)","v":{"$error":"#N/A"}},{"$f":"Orders!D1364/VLOOKUP(B1364,Tools!A:C,3,0)","v":{"$error":"#N/A"}}]
[{"$f":"Orders!A1365","v":0},{"$f":"VLOOKUP(A1365,'Product-tool'!A:B,2,0)","v":{"$error":"#N/A"}},{"$f":"Orders!B1365/VLOOKUP(B1365,Tools!A:C,3,0)","v":{"$error":"#N/A"}},{"$f":"Orders!C1365/VLOOKUP(B1365,Tools!A:C,3,0)","v":{"$error":"#N/A"}},{"$f":"Orders!D1365/VLOOKUP(B1365,Tools!A:C,3,0)","v":{"$error":"#N/A"}}]
[{"$f":"Orders!A1366","v":0},{"$f":"VLOOKUP(A1366,'Product-tool'!A:B,2,0)","v":{"$error":"#N/A"}},{"$f":"Orders!B1366/VLOOKUP(B1366,Tools!A:C,3,0)","v":{"$error":"#N/A"}},{"$f":"Orders!C1366/VLOOKUP(B1366,Tools!A:C,3,0)","v":{"$error":"#N/A"}},{"$f":"Orders!D1366/VLOOKUP(B1366,Tools!A:C,3,0)","v":{"$error":"#N/A"}}]
[{"$f":"Orders!A1367","v":0},{"$f":"VLOOKUP(A1367,'Product-tool'!A:B,2,0)","v":{"$error":"#N/A"}},{"$f":"Orders!B1367/VLOOKUP(B1367,Tools!A:C,3,0)","v":{"$error":"#N/A"}},{"$f":"Orders!C1367/VLOOKUP(B1367,Tools!A:C,3,0)","v":{"$error":"#N/A"}},{"$f":"Orders!D1367/VLOOKUP(B1367,Tools!A:C,3,0)","v":{"$error":"#N/A"}}]
[{"$f":"Orders!A1368","v":0},{"$f":"VLOOKUP(A1368,'Product-tool'!A:B,2,0)","v":{"$error":"#N/A"}},{"$f":"Orders!B1368/VLOOKUP(B1368,Tools!A:C,3,0)","v":{"$error":"#N/A"}},{"$f":"Orders!C1368/VLOOKUP(B1368,Tools!A:C,3,0)","v":{"$error":"#N/A"}},{"$f":"Orders!D1368/VLOOKUP(B1368,Tools!A:C,3,0)","v":{"$error":"#N/A"}}]
[{"$f":"Orders!A1369","v":0},{"$f":"VLOOKUP(A1369,'Product-tool'!A:B,2,0)","v":{"$error":"#N/A"}},{"$f":"Orders!B1369/VLOOKUP(B1369,Tools!A:C,3,0)","v":{"$error":"#N/A"}},{"$f":"Orders!C1369/VLOOKUP(B1369,Tools!A:C,3,0)","v":{"$error":"#N/A"}},{"$f":"Orders!D1369/VLOOKUP(B1369,Tools!A:C,3,0)","v":{"$error":"#N/A"}}]
[{"$f":"Orders!A1370","v":0},{"$f":"VLOOKUP(A1370,'Product-tool'!A:B,2,0)","v":{"$error":"#N/A"}},{"$f":"Orders!B1370/VLOOKUP(B1370,Tools!A:C,3,0)","v":{"$error":"#N/A"}},{"$f":"Orders!C1370/VLOOKUP(B1370,Tools!A:C,3,0)","v":{"$error":"#N/A"}},{"$f":"Orders!D1370/VLOOKUP(B1370,Tools!A:C,3,0)","v":{"$error":"#N/A"}}]
[{"$f":"Orders!A1371","v":0},{"$f":"VLOOKUP(A1371,'Product-tool'!A:B,2,0)","v":{"$error":"#N/A"}},{"$f":"Orders!B1371/VLOOKUP(B1371,Tools!A:C,3,0)","v":{"$error":"#N/A"}},{"$f":"Orders!C1371/VLOOKUP(B1371,Tools!A:C,3,0)","v":{"$error":"#N/A"}},{"$f":"Orders!D1371/VLOOKUP(B1371,Tools!A:C,3,0)","v":{"$error":"#N/A"}}]
[{"$f":"Orders!A1372","v":0},{"$f":"VLOOKUP(A1372,'Product-tool'!A:B,2,0)","v":{"$error":"#N/A"}},{"$f":"Orders!B1372/VLOOKUP(B1372,Tools!A:C,3,0)","v":{"$error":"#N/A"}},{"$f":"Orders!C1372/VLOOKUP(B1372,Tools!A:C,3,0)","v":{"$error":"#N/A"}},{"$f":"Orders!D1372/VLOOKUP(B1372,Tools!A:C,3,0)","v":{"$error":"#N/A"}}]
[{"$f":"Orders!A1373","v":0},{"$f":"VLOOKUP(A1373,'Product-tool'!A:B,2,0)","v":{"$error":"#N/A"}},{"$f":"Orders!B1373/VLOOKUP(B1373,Tools!A:C,3,0)","v":{"$error":"#N/A"}},{"$f":"Orders!C1373/VLOOKUP(B1373,Tools!A:C,3,0)","v":{"$error":"#N/A"}},{"$f":"Orders!D1373/VLOOKUP(B1373,Tools!A:C,3,0)","v":{"$error":"#N/A"}}]
[{"$f":"Orders!A1374","v":0},{"$f":"VLOOKUP(A1374,'Product-tool'!A:B,2,0)","v":{"$error":"#N/A"}},{"$f":"Orders!B1374/VLOOKUP(B1374,Tools!A:C,3,0)","v":{"$error":"#N/A"}},{"$f":"Orders!C1374/VLOOKUP(B1374,Tools!A:C,3,0)","v":{"$error":"#N/A"}},{"$f":"Orders!D1374/VLOOKUP(B1374,Tools!A:C,3,0)","v":{"$error":"#N/A"}}]
[{"$f":"Orders!A1375","v":0},{"$f":"VLOOKUP(A1375,'Product-tool'!A:B,2,0)","v":{"$error":"#N/A"}},{"$f":"Orders!B1375/VLOOKUP(B1375,Tools!A:C,3,0)","v":{"$error":"#N/A"}},{"$f":"Orders!C1375/VLOOKUP(B1375,Tools!A:C,3,0)","v":{"$error":"#N/A"}},{"$f":"Orders!D1375/VLOOKUP(B1375,Tools!A:C,3,0)","v":{"$error":"#N/A"}}]
[{"$f":"Orders!A1376","v":0},{"$f":"VLOOKUP(A1376,'Product-tool'!A:B,2,0)","v":{"$error":"#N/A"}},{"$f":"Orders!B1376/VLOOKUP(B1376,Tools!A:C,3,0)","v":{"$error":"#N/A"}},{"$f":"Orders!C1376/VLOOKUP(B1376,Tools!A:C,3,0)","v":{"$error":"#N/A"}},{"$f":"Orders!D1376/VLOOKUP(B1376,Tools!A:C,3,0)","v":{"$error":"#N/A"}}]
[{"$f":"Orders!A1377","v":0},{"$f":"VLOOKUP(A1377,'Product-tool'!A:B,2,0)","v":{"$error":"#N/A"}},{"$f":"Orders!B1377/VLOOKUP(B1377,Tools!A:C,3,0)","v":{"$error":"#N/A"}},{"$f":"Orders!C1377/VLOOKUP(B1377,Tools!A:C,3,0)","v":{"$error":"#N/A"}},{"$f":"Orders!D1377/VLOOKUP(B1377,Tools!A:C,3,0)","v":{"$error":"#N/A"}}]
[{"$f":"Orders!A1378","v":0},{"$f":"VLOOKUP(A1378,'Product-tool'!A:B,2,0)","v":{"$error":"#N/A"}},{"$f":"Orders!B1378/VLOOKUP(B1378,Tools!A:C,3,0)","v":{"$error":"#N/A"}},{"$f":"Orders!C1378/VLOOKUP(B1378,Tools!A:C,3,0)","v":{"$error":"#N/A"}},{"$f":"Orders!D1378/VLOOKUP(B1378,Tools!A:C,3,0)","v":{"$error":"#N/A"}}]
[{"$f":"Orders!A1379","v":0},{"$f":"VLOOKUP(A1379,'Product-tool'!A:B,2,0)","v":{"$error":"#N/A"}},{"$f":"Orders!B1379/VLOOKUP(B1379,Tools!A:C,3,0)","v":{"$error":"#N/A"}},{"$f":"Orders!C1379/VLOOKUP(B1379,Tools!A:C,3,0)","v":{"$error":"#N/A"}},{"$f":"Orders!D1379/VLOOKUP(B1379,Tools!A:C,3,0)","v":{"$error":"#N/A"}}]
[{"$f":"Orders!A1380","v":0},{"$f":"VLOOKUP(A1380,'Product-tool'!A:B,2,0)","v":{"$error":"#N/A"}},{"$f":"Orders!B1380/VLOOKUP(B1380,Tools!A:C,3,0)","v":{"$error":"#N/A"}},{"$f":"Orders!C1380/VLOOKUP(B1380,Tools!A:C,3,0)","v":{"$error":"#N/A"}},{"$f":"Orders!D1380/VLOOKUP(B1380,Tools!A:C,3,0)","v":{"$error":"#N/A"}}]
[{"$f":"Orders!A1381","v":0},{"$f":"VLOOKUP(A1381,'Product-tool'!A:B,2,0)","v":{"$error":"#N/A"}},{"$f":"Orders!B1381/VLOOKUP(B1381,Tools!A:C,3,0)","v":{"$error":"#N/A"}},{"$f":"Orders!C1381/VLOOKUP(B1381,Tools!A:C,3,0)","v":{"$error":"#N/A"}},{"$f":"Orders!D1381/VLOOKUP(B1381,Tools!A:C,3,0)","v":{"$error":"#N/A"}}]
[{"$f":"Orders!A1382","v":0},{"$f":"VLOOKUP(A1382,'Product-tool'!A:B,2,0)","v":{"$error":"#N/A"}},{"$f":"Orders!B1382/VLOOKUP(B1382,Tools!A:C,3,0)","v":{"$error":"#N/A"}},{"$f":"Orders!C1382/VLOOKUP(B1382,Tools!A:C,3,0)","v":{"$error":"#N/A"}},{"$f":"Orders!D1382/VLOOKUP(B1382,Tools!A:C,3,0)","v":{"$error":"#N/A"}}]
[{"$f":"Orders!A1383","v":0},{"$f":"VLOOKUP(A1383,'Product-tool'!A:B,2,0)","v":{"$error":"#N/A"}},{"$f":"Orders!B1383/VLOOKUP(B1383,Tools!A:C,3,0)","v":{"$error":"#N/A"}},{"$f":"Orders!C1383/VLOOKUP(B1383,Tools!A:C,3,0)","v":{"$error":"#N/A"}},{"$f":"Orders!D1383/VLOOKUP(B1383,Tools!A:C,3,0)","v":{"$error":"#N/A"}}]
[{"$f":"Orders!A1384","v":0},{"$f":"VLOOKUP(A1384,'Product-tool'!A:B,2,0)","v":{"$error":"#N/A"}},{"$f":"Orders!B1384/VLOOKUP(B1384,Tools!A:C,3,0)","v":{"$error":"#N/A"}},{"$f":"Orders!C1384/VLOOKUP(B1384,Tools!A:C,3,0)","v":{"$error":"#N/A"}},{"$f":"Orders!D1384/VLOOKUP(B1384,Tools!A:C,3,0)","v":{"$error":"#N/A"}}]
[{"$f":"Orders!A1385","v":0},{"$f":"VLOOKUP(A1385,'Product-tool'!A:B,2,0)","v":{"$error":"#N/A"}},{"$f":"Orders!B1385/VLOOKUP(B1385,Tools!A:C,3,0)","v":{"$error":"#N/A"}},{"$f":"Orders!C1385/VLOOKUP(B1385,Tools!A:C,3,0)","v":{"$error":"#N/A"}},{"$f":"Orders!D1385/VLOOKUP(B1385,Tools!A:C,3,0)","v":{"$error":"#N/A"}}]
[{"$f":"Orders!A1386","v":0},{"$f":"VLOOKUP(A1386,'Product-tool'!A:B,2,0)","v":{"$error":"#N/A"}},{"$f":"Orders!B1386/VLOOKUP(B1386,Tools!A:C,3,0)","v":{"$error":"#N/A"}},{"$f":"Orders!C1386/VLOOKUP(B1386,Tools!A:C,3,0)","v":{"$error":"#N/A"}},{"$f":"Orders!D1386/VLOOKUP(B1386,Tools!A:C,3,0)","v":{"$error":"#N/A"}}]
[{"$f":"Orders!A1387","v":0},{"$f":"VLOOKUP(A1387,'Product-tool'!A:B,2,0)","v":{"$error":"#N/A"}},{"$f":"Orders!B1387/VLOOKUP(B1387,Tools!A:C,3,0)","v":{"$error":"#N/A"}},{"$f":"Orders!C1387/VLOOKUP(B1387,Tools!A:C,3,0)","v":{"$error":"#N/A"}},{"$f":"Orders!D1387/VLOOKUP(B1387,Tools!A:C,3,0)","v":{"$error":"#N/A"}}]
[{"$f":"Orders!A1388","v":0},{"$f":"VLOOKUP(A1388,'Product-tool'!A:B,2,0)","v":{"$error":"#N/A"}},{"$f":"Orders!B1388/VLOOKUP(B1388,Tools!A:C,3,0)","v":{"$error":"#N/A"}},{"$f":"Orders!C1388/VLOOKUP(B1388,Tools!A:C,3,0)","v":{"$error":"#N/A"}},{"$f":"Orders!D1388/VLOOKUP(B1388,Tools!A:C,3,0)","v":{"$error":"#N/A"}}]
[{"$f":"Orders!A1389","v":0},{"$f":"VLOOKUP(A1389,'Product-tool'!A:B,2,0)","v":{"$error":"#N/A"}},{"$f":"Orders!B1389/VLOOKUP(B1389,Tools!A:C,3,0)","v":{"$error":"#N/A"}},{"$f":"Orders!C1389/VLOOKUP(B1389,Tools!A:C,3,0)","v":{"$error":"#N/A"}},{"$f":"Orders!D1389/VLOOKUP(B1389,Tools!A:C,3,0)","v":{"$error":"#N/A"}}]
[{"$f":"Orders!A1390","v":0},{"$f":"VLOOKUP(A1390,'Product-tool'!A:B,2,0)","v":{"$error":"#N/A"}},{"$f":"Orders!B1390/VLOOKUP(B1390,Tools!A:C,3,0)","v":{"$error":"#N/A"}},{"$f":"Orders!C1390/VLOOKUP(B1390,Tools!A:C,3,0)","v":{"$error":"#N/A"}},{"$f":"Orders!D1390/VLOOKUP(B1390,Tools!A:C,3,0)","v":{"$error":"#N/A"}}]
[{"$f":"Orders!A1391","v":0},{"$f":"VLOOKUP(A1391,'Product-tool'!A:B,2,0)","v":{"$error":"#N/A"}},{"$f":"Orders!B1391/VLOOKUP(B1391,Tools!A:C,3,0)","v":{"$error":"#N/A"}},{"$f":"Orders!C1391/VLOOKUP(B1391,Tools!A:C,3,0)","v":{"$error":"#N/A"}},{"$f":"Orders!D1391/VLOOKUP(B1391,Tools!A:C,3,0)","v":{"$error":"#N/A"}}]
[{"$f":"Orders!A1392","v":0},{"$f":"VLOOKUP(A1392,'Product-tool'!A:B,2,0)","v":{"$error":"#N/A"}},{"$f":"Orders!B1392/VLOOKUP(B1392,Tools!A:C,3,0)","v":{"$error":"#N/A"}},{"$f":"Orders!C1392/VLOOKUP(B1392,Tools!A:C,3,0)","v":{"$error":"#N/A"}},{"$f":"Orders!D1392/VLOOKUP(B1392,Tools!A:C,3,0)","v":{"$error":"#N/A"}}]
[{"$f":"Orders!A1393","v":0},{"$f":"VLOOKUP(A1393,'Product-tool'!A:B,2,0)","v":{"$error":"#N/A"}},{"$f":"Orders!B1393/VLOOKUP(B1393,Tools!A:C,3,0)","v":{"$error":"#N/A"}},{"$f":"Orders!C1393/VLOOKUP(B1393,Tools!A:C,3,0)","v":{"$error":"#N/A"}},{"$f":"Orders!D1393/VLOOKUP(B1393,Tools!A:C,3,0)","v":{"$error":"#N/A"}}]
[{"$f":"Orders!A1394","v":0},{"$f":"VLOOKUP(A1394,'Product-tool'!A:B,2,0)","v":{"$error":"#N/A"}},{"$f":"Orders!B1394/VLOOKUP(B1394,Tools!A:C,3,0)","v":{"$error":"#N/A"}},{"$f":"Orders!C1394/VLOOKUP(B1394,Tools!A:C,3,0)","v":{"$error":"#N/A"}},{"$f":"Orders!D1394/VLOOKUP(B1394,Tools!A:C,3,0)","v":{"$error":"#N/A"}}]
[{"$f":"Orders!A1395","v":0},{"$f":"VLOOKUP(A1395,'Product-tool'!A:B,2,0)","v":{"$error":"#N/A"}},{"$f":"Orders!B1395/VLOOKUP(B1395,Tools!A:C,3,0)","v":{"$error":"#N/A"}},{"$f":"Orders!C1395/VLOOKUP(B1395,Tools!A:C,3,0)","v":{"$error":"#N/A"}},{"$f":"Orders!D1395/VLOOKUP(B1395,Tools!A:C,3,0)","v":{"$error":"#N/A"}}]
[{"$f":"Orders!A1396","v":0},{"$f":"VLOOKUP(A1396,'Product-tool'!A:B,2,0)","v":{"$error":"#N/A"}},{"$f":"Orders!B1396/VLOOKUP(B1396,Tools!A:C,3,0)","v":{"$error":"#N/A"}},{"$f":"Orders!C1396/VLOOKUP(B1396,Tools!A:C,3,0)","v":{"$error":"#N/A"}},{"$f":"Orders!D1396/VLOOKUP(B1396,Tools!A:C,3,0)","v":{"$error":"#N/A"}}]
[{"$f":"Orders!A1397","v":0},{"$f":"VLOOKUP(A1397,'Product-tool'!A:B,2,0)","v":{"$error":"#N/A"}},{"$f":"Orders!B1397/VLOOKUP(B1397,Tools!A:C,3,0)","v":{"$error":"#N/A"}},{"$f":"Orders!C1397/VLOOKUP(B1397,Tools!A:C,3,0)","v":{"$error":"#N/A"}},{"$f":"Orders!D1397/VLOOKUP(B1397,Tools!A:C,3,0)","v":{"$error":"#N/A"}}]
[{"$f":"Orders!A1398","v":0},{"$f":"VLOOKUP(A1398,'Product-tool'!A:B,2,0)","v":{"$error":"#N/A"}},{"$f":"Orders!B1398/VLOOKUP(B1398,Tools!A:C,3,0)","v":{"$error":"#N/A"}},{"$f":"Orders!C1398/VLOOKUP(B1398,Tools!A:C,3,0)","v":{"$error":"#N/A"}},{"$f":"Orders!D1398/VLOOKUP(B1398,Tools!A:C,3,0)","v":{"$error":"#N/A"}}]
[{"$f":"Orders!A1399","v":0},{"$f":"VLOOKUP(A1399,'Product-tool'!A:B,2,0)","v":{"$error":"#N/A"}},{"$f":"Orders!B1399/VLOOKUP(B1399,Tools!A:C,3,0)","v":{"$error":"#N/A"}},{"$f":"Orders!C1399/VLOOKUP(B1399,Tools!A:C,3,0)","v":{"$error":"#N/A"}},{"$f":"Orders!D1399/VLOOKUP(B1399,Tools!A:C,3,0)","v":{"$error":"#N/A"}}]
[{"$f":"Orders!A1400","v":0},{"$f":"VLOOKUP(A1400,'Product-tool'!A:B,2,0)","v":{"$error":"#N/A"}},{"$f":"Orders!B1400/VLOOKUP(B1400,Tools!A:C,3,0)","v":{"$error":"#N/A"}},{"$f":"Orders!C1400/VLOOKUP(B1400,Tools!A:C,3,0)","v":{"$error":"#N/A"}},{"$f":"Orders!D1400/VLOOKUP(B1400,Tools!A:C,3,0)","v":{"$error":"#N/A"}}]
[{"$f":"Orders!A1401","v":0},{"$f":"VLOOKUP(A1401,'Product-tool'!A:B,2,0)","v":{"$error":"#N/A"}},{"$f":"Orders!B1401/VLOOKUP(B1401,Tools!A:C,3,0)","v":{"$error":"#N/A"}},{"$f":"Orders!C1401/VLOOKUP(B1401,Tools!A:C,3,0)","v":{"$error":"#N/A"}},{"$f":"Orders!D1401/VLOOKUP(B1401,Tools!A:C,3,0)","v":{"$error":"#N/A"}}]
[{"$f":"Orders!A1402","v":0},{"$f":"VLOOKUP(A1402,'Product-tool'!A:B,2,0)","v":{"$error":"#N/A"}},{"$f":"Orders!B1402/VLOOKUP(B1402,Tools!A:C,3,0)","v":{"$error":"#N/A"}},{"$f":"Orders!C1402/VLOOKUP(B1402,Tools!A:C,3,0)","v":{"$error":"#N/A"}},{"$f":"Orders!D1402/VLOOKUP(B1402,Tools!A:C,3,0)","v":{"$error":"#N/A"}}]
[{"$f":"Orders!A1403","v":0},{"$f":"VLOOKUP(A1403,'Product-tool'!A:B,2,0)","v":{"$error":"#N/A"}},{"$f":"Orders!B1403/VLOOKUP(B1403,Tools!A:C,3,0)","v":{"$error":"#N/A"}},{"$f":"Orders!C1403/VLOOKUP(B1403,Tools!A:C,3,0)","v":{"$error":"#N/A"}},{"$f":"Orders!D1403/VLOOKUP(B1403,Tools!A:C,3,0)","v":{"$error":"#N/A"}}]
[{"$f":"Orders!A1404","v":0},{"$f":"VLOOKUP(A1404,'Product-tool'!A:B,2,0)","v":{"$error":"#N/A"}},{"$f":"Orders!B1404/VLOOKUP(B1404,Tools!A:C,3,0)","v":{"$error":"#N/A"}},{"$f":"Orders!C1404/VLOOKUP(B1404,Tools!A:C,3,0)","v":{"$error":"#N/A"}},{"$f":"Orders!D1404/VLOOKUP(B1404,Tools!A:C,3,0)","v":{"$error":"#N/A"}}]
[{"$f":"Orders!A1405","v":0},{"$f":"VLOOKUP(A1405,'Product-tool'!A:B,2,0)","v":{"$error":"#N/A"}},{"$f":"Orders!B1405/VLOOKUP(B1405,Tools!A:C,3,0)","v":{"$error":"#N/A"}},{"$f":"Orders!C1405/VLOOKUP(B1405,Tools!A:C,3,0)","v":{"$error":"#N/A"}},{"$f":"Orders!D1405/VLOOKUP(B1405,Tools!A:C,3,0)","v":{"$error":"#N/A"}}]
[{"$f":"Orders!A1406","v":0},{"$f":"VLOOKUP(A1406,'Product-tool'!A:B,2,0)","v":{"$error":"#N/A"}},{"$f":"Orders!B1406/VLOOKUP(B1406,Tools!A:C,3,0)","v":{"$error":"#N/A"}},{"$f":"Orders!C1406/VLOOKUP(B1406,Tools!A:C,3,0)","v":{"$error":"#N/A"}},{"$f":"Orders!D1406/VLOOKUP(B1406,Tools!A:C,3,0)","v":{"$error":"#N/A"}}]
[{"$f":"Orders!A1407","v":0},{"$f":"VLOOKUP(A1407,'Product-tool'!A:B,2,0)","v":{"$error":"#N/A"}},{"$f":"Orders!B1407/VLOOKUP(B1407,Tools!A:C,3,0)","v":{"$error":"#N/A"}},{"$f":"Orders!C1407/VLOOKUP(B1407,Tools!A:C,3,0)","v":{"$error":"#N/A"}},{"$f":"Orders!D1407/VLOOKUP(B1407,Tools!A:C,3,0)","v":{"$error":"#N/A"}}]
[{"$f":"Orders!A1408","v":0},{"$f":"VLOOKUP(A1408,'Product-tool'!A:B,2,0)","v":{"$error":"#N/A"}},{"$f":"Orders!B1408/VLOOKUP(B1408,Tools!A:C,3,0)","v":{"$error":"#N/A"}},{"$f":"Orders!C1408/VLOOKUP(B1408,Tools!A:C,3,0)","v":{"$error":"#N/A"}},{"$f":"Orders!D1408/VLOOKUP(B1408,Tools!A:C,3,0)","v":{"$error":"#N/A"}}]
[{"$f":"Orders!A1409","v":0},{"$f":"VLOOKUP(A1409,'Product-tool'!A:B,2,0)","v":{"$error":"#N/A"}},{"$f":"Orders!B1409/VLOOKUP(B1409,Tools!A:C,3,0)","v":{"$error":"#N/A"}},{"$f":"Orders!C1409/VLOOKUP(B1409,Tools!A:C,3,0)","v":{"$error":"#N/A"}},{"$f":"Orders!D1409/VLOOKUP(B1409,Tools!A:C,3,0)","v":{"$error":"#N/A"}}]
[{"$f":"Orders!A1410","v":0},{"$f":"VLOOKUP(A1410,'Product-tool'!A:B,2,0)","v":{"$error":"#N/A"}},{"$f":"Orders!B1410/VLOOKUP(B1410,Tools!A:C,3,0)","v":{"$error":"#N/A"}},{"$f":"Orders!C1410/VLOOKUP(B1410,Tools!A:C,3,0)","v":{"$error":"#N/A"}},{"$f":"Orders!D1410/VLOOKUP(B1410,Tools!A:C,3,0)","v":{"$error":"#N/A"}}]
[{"$f":"Orders!A1411","v":0},{"$f":"VLOOKUP(A1411,'Product-tool'!A:B,2,0)","v":{"$error":"#N/A"}},{"$f":"Orders!B1411/VLOOKUP(B1411,Tools!A:C,3,0)","v":{"$error":"#N/A"}},{"$f":"Orders!C1411/VLOOKUP(B1411,Tools!A:C,3,0)","v":{"$error":"#N/A"}},{"$f":"Orders!D1411/VLOOKUP(B1411,Tools!A:C,3,0)","v":{"$error":"#N/A"}}]
[{"$f":"Orders!A1412","v":0},{"$f":"VLOOKUP(A1412,'Product-tool'!A:B,2,0)","v":{"$error":"#N/A"}},{"$f":"Orders!B1412/VLOOKUP(B1412,Tools!A:C,3,0)","v":{"$error":"#N/A"}},{"$f":"Orders!C1412/VLOOKUP(B1412,Tools!A:C,3,0)","v":{"$error":"#N/A"}},{"$f":"Orders!D1412/VLOOKUP(B1412,Tools!A:C,3,0)","v":{"$error":"#N/A"}}]
[{"$f":"Orders!A1413","v":0},{"$f":"VLOOKUP(A1413,'Product-tool'!A:B,2,0)","v":{"$error":"#N/A"}},{"$f":"Orders!B1413/VLOOKUP(B1413,Tools!A:C,3,0)","v":{"$error":"#N/A"}},{"$f":"Orders!C1413/VLOOKUP(B1413,Tools!A:C,3,0)","v":{"$error":"#N/A"}},{"$f":"Orders!D1413/VLOOKUP(B1413,Tools!A:C,3,0)","v":{"$error":"#N/A"}}]
[{"$f":"Orders!A1414","v":0},{"$f":"VLOOKUP(A1414,'Product-tool'!A:B,2,0)","v":{"$error":"#N/A"}},{"$f":"Orders!B1414/VLOOKUP(B1414,Tools!A:C,3,0)","v":{"$error":"#N/A"}},{"$f":"Orders!C1414/VLOOKUP(B1414,Tools!A:C,3,0)","v":{"$error":"#N/A"}},{"$f":"Orders!D1414/VLOOKUP(B1414,Tools!A:C,3,0)","v":{"$error":"#N/A"}}]
[{"$f":"Orders!A1415","v":0},{"$f":"VLOOKUP(A1415,'Product-tool'!A:B,2,0)","v":{"$error":"#N/A"}},{"$f":"Orders!B1415/VLOOKUP(B1415,Tools!A:C,3,0)","v":{"$error":"#N/A"}},{"$f":"Orders!C1415/VLOOKUP(B1415,Tools!A:C,3,0)","v":{"$error":"#N/A"}},{"$f":"Orders!D1415/VLOOKUP(B1415,Tools!A:C,3,0)","v":{"$error":"#N/A"}}]
[{"$f":"Orders!A1416","v":0},{"$f":"VLOOKUP(A1416,'Product-tool'!A:B,2,0)","v":{"$error":"#N/A"}},{"$f":"Orders!B1416/VLOOKUP(B1416,Tools!A:C,3,0)","v":{"$error":"#N/A"}},{"$f":"Orders!C1416/VLOOKUP(B1416,Tools!A:C,3,0)","v":{"$error":"#N/A"}},{"$f":"Orders!D1416/VLOOKUP(B1416,Tools!A:C,3,0)","v":{"$error":"#N/A"}}]
[{"$f":"Orders!A1417","v":0},{"$f":"VLOOKUP(A1417,'Product-tool'!A:B,2,0)","v":{"$error":"#N/A"}},{"$f":"Orders!B1417/VLOOKUP(B1417,Tools!A:C,3,0)","v":{"$error":"#N/A"}},{"$f":"Orders!C1417/VLOOKUP(B1417,Tools!A:C,3,0)","v":{"$error":"#N/A"}},{"$f":"Orders!D1417/VLOOKUP(B1417,Tools!A:C,3,0)","v":{"$error":"#N/A"}}]
[{"$f":"Orders!A1418","v":0},{"$f":"VLOOKUP(A1418,'Product-tool'!A:B,2,0)","v":{"$error":"#N/A"}},{"$f":"Orders!B1418/VLOOKUP(B1418,Tools!A:C,3,0)","v":{"$error":"#N/A"}},{"$f":"Orders!C1418/VLOOKUP(B1418,Tools!A:C,3,0)","v":{"$error":"#N/A"}},{"$f":"Orders!D1418/VLOOKUP(B1418,Tools!A:C,3,0)","v":{"$error":"#N/A"}}]
[{"$f":"Orders!A1419","v":0},{"$f":"VLOOKUP(A1419,'Product-tool'!A:B,2,0)","v":{"$error":"#N/A"}},{"$f":"Orders!B1419/VLOOKUP(B1419,Tools!A:C,3,0)","v":{"$error":"#N/A"}},{"$f":"Orders!C1419/VLOOKUP(B1419,Tools!A:C,3,0)","v":{"$error":"#N/A"}},{"$f":"Orders!D1419/VLOOKUP(B1419,Tools!A:C,3,0)","v":{"$error":"#N/A"}}]
[{"$f":"Orders!A1420","v":0},{"$f":"VLOOKUP(A1420,'Product-tool'!A:B,2,0)","v":{"$error":"#N/A"}},{"$f":"Orders!B1420/VLOOKUP(B1420,Tools!A:C,3,0)","v":{"$error":"#N/A"}},{"$f":"Orders!C1420/VLOOKUP(B1420,Tools!A:C,3,0)","v":{"$error":"#N/A"}},{"$f":"Orders!D1420/VLOOKUP(B1420,Tools!A:C,3,0)","v":{"$error":"#N/A"}}]
[{"$f":"Orders!A1421","v":0},{"$f":"VLOOKUP(A1421,'Product-tool'!A:B,2,0)","v":{"$error":"#N/A"}},{"$f":"Orders!B1421/VLOOKUP(B1421,Tools!A:C,3,0)","v":{"$error":"#N/A"}},{"$f":"Orders!C1421/VLOOKUP(B1421,Tools!A:C,3,0)","v":{"$error":"#N/A"}},{"$f":"Orders!D1421/VLOOKUP(B1421,Tools!A:C,3,0)","v":{"$error":"#N/A"}}]
[{"$f":"Orders!A1422","v":0},{"$f":"VLOOKUP(A1422,'Product-tool'!A:B,2,0)","v":{"$error":"#N/A"}},{"$f":"Orders!B1422/VLOOKUP(B1422,Tools!A:C,3,0)","v":{"$error":"#N/A"}},{"$f":"Orders!C1422/VLOOKUP(B1422,Tools!A:C,3,0)","v":{"$error":"#N/A"}},{"$f":"Orders!D1422/VLOOKUP(B1422,Tools!A:C,3,0)","v":{"$error":"#N/A"}}]
[{"$f":"Orders!A1423","v":0},{"$f":"VLOOKUP(A1423,'Product-tool'!A:B,2,0)","v":{"$error":"#N/A"}},{"$f":"Orders!B1423/VLOOKUP(B1423,Tools!A:C,3,0)","v":{"$error":"#N/A"}},{"$f":"Orders!C1423/VLOOKUP(B1423,Tools!A:C,3,0)","v":{"$error":"#N/A"}},{"$f":"Orders!D1423/VLOOKUP(B1423,Tools!A:C,3,0)","v":{"$error":"#N/A"}}]
[{"$f":"Orders!A1424","v":0},{"$f":"VLOOKUP(A1424,'Product-tool'!A:B,2,0)","v":{"$error":"#N/A"}},{"$f":"Orders!B1424/VLOOKUP(B1424,Tools!A:C,3,0)","v":{"$error":"#N/A"}},{"$f":"Orders!C1424/VLOOKUP(B1424,Tools!A:C,3,0)","v":{"$error":"#N/A"}},{"$f":"Orders!D1424/VLOOKUP(B1424,Tools!A:C,3,0)","v":{"$error":"#N/A"}}]
[{"$f":"Orders!A1425","v":0},{"$f":"VLOOKUP(A1425,'Product-tool'!A:B,2,0)","v":{"$error":"#N/A"}},{"$f":"Orders!B1425/VLOOKUP(B1425,Tools!A:C,3,0)","v":{"$error":"#N/A"}},{"$f":"Orders!C1425/VLOOKUP(B1425,Tools!A:C,3,0)","v":{"$error":"#N/A"}},{"$f":"Orders!D1425/VLOOKUP(B1425,Tools!A:C,3,0)","v":{"$error":"#N/A"}}]
[{"$f":"Orders!A1426","v":0},{"$f":"VLOOKUP(A1426,'Product-tool'!A:B,2,0)","v":{"$error":"#N/A"}},{"$f":"Orders!B1426/VLOOKUP(B1426,Tools!A:C,3,0)","v":{"$error":"#N/A"}},{"$f":"Orders!C1426/VLOOKUP(B1426,Tools!A:C,3,0)","v":{"$error":"#N/A"}},{"$f":"Orders!D1426/VLOOKUP(B1426,Tools!A:C,3,0)","v":{"$error":"#N/A"}}]
[{"$f":"Orders!A1427","v":0},{"$f":"VLOOKUP(A1427,'Product-tool'!A:B,2,0)","v":{"$error":"#N/A"}},{"$f":"Orders!B1427/VLOOKUP(B1427,Tools!A:C,3,0)","v":{"$error":"#N/A"}},{"$f":"Orders!C1427/VLOOKUP(B1427,Tools!A:C,3,0)","v":{"$error":"#N/A"}},{"$f":"Orders!D1427/VLOOKUP(B1427,Tools!A:C,3,0)","v":{"$error":"#N/A"}}]
[{"$f":"Orders!A1428","v":0},{"$f":"VLOOKUP(A1428,'Product-tool'!A:B,2,0)","v":{"$error":"#N/A"}},{"$f":"Orders!B1428/VLOOKUP(B1428,Tools!A:C,3,0)","v":{"$error":"#N/A"}},{"$f":"Orders!C1428/VLOOKUP(B1428,Tools!A:C,3,0)","v":{"$error":"#N/A"}},{"$f":"Orders!D1428/VLOOKUP(B1428,Tools!A:C,3,0)","v":{"$error":"#N/A"}}]
[{"$f":"Orders!A1429","v":0},{"$f":"VLOOKUP(A1429,'Product-tool'!A:B,2,0)","v":{"$error":"#N/A"}},{"$f":"Orders!B1429/VLOOKUP(B1429,Tools!A:C,3,0)","v":{"$error":"#N/A"}},{"$f":"Orders!C1429/VLOOKUP(B1429,Tools!A:C,3,0)","v":{"$error":"#N/A"}},{"$f":"Orders!D1429/VLOOKUP(B1429,Tools!A:C,3,0)","v":{"$error":"#N/A"}}]
[{"$f":"Orders!A1430","v":0},{"$f":"VLOOKUP(A1430,'Product-tool'!A:B,2,0)","v":{"$error":"#N/A"}},{"$f":"Orders!B1430/VLOOKUP(B1430,Tools!A:C,3,0)","v":{"$error":"#N/A"}},{"$f":"Orders!C1430/VLOOKUP(B1430,Tools!A:C,3,0)","v":{"$error":"#N/A"}},{"$f":"Orders!D1430/VLOOKUP(B1430,Tools!A:C,3,0)","v":{"$error":"#N/A"}}]
[{"$f":"Orders!A1431","v":0},{"$f":"VLOOKUP(A1431,'Product-tool'!A:B,2,0)","v":{"$error":"#N/A"}},{"$f":"Orders!B1431/VLOOKUP(B1431,Tools!A:C,3,0)","v":{"$error":"#N/A"}},{"$f":"Orders!C1431/VLOOKUP(B1431,Tools!A:C,3,0)","v":{"$error":"#N/A"}},{"$f":"Orders!D1431/VLOOKUP(B1431,Tools!A:C,3,0)","v":{"$error":"#N/A"}}]
[{"$f":"Orders!A1432","v":0},{"$f":"VLOOKUP(A1432,'Product-tool'!A:B,2,0)","v":{"$error":"#N/A"}},{"$f":"Orders!B1432/VLOOKUP(B1432,Tools!A:C,3,0)","v":{"$error":"#N/A"}},{"$f":"Orders!C1432/VLOOKUP(B1432,Tools!A:C,3,0)","v":{"$error":"#N/A"}},{"$f":"Orders!D1432/VLOOKUP(B1432,Tools!A:C,3,0)","v":{"$error":"#N/A"}}]
[{"$f":"Orders!A1433","v":0},{"$f":"VLOOKUP(A1433,'Product-tool'!A:B,2,0)","v":{"$error":"#N/A"}},{"$f":"Orders!B1433/VLOOKUP(B1433,Tools!A:C,3,0)","v":{"$error":"#N/A"}},{"$f":"Orders!C1433/VLOOKUP(B1433,Tools!A:C,3,0)","v":{"$error":"#N/A"}},{"$f":"Orders!D1433/VLOOKUP(B1433,Tools!A:C,3,0)","v":{"$error":"#N/A"}}]
[{"$f":"Orders!A1434","v":0},{"$f":"VLOOKUP(A1434,'Product-tool'!A:B,2,0)","v":{"$error":"#N/A"}},{"$f":"Orders!B1434/VLOOKUP(B1434,Tools!A:C,3,0)","v":{"$error":"#N/A"}},{"$f":"Orders!C1434/VLOOKUP(B1434,Tools!A:C,3,0)","v":{"$error":"#N/A"}},{"$f":"Orders!D1434/VLOOKUP(B1434,Tools!A:C,3,0)","v":{"$error":"#N/A"}}]
[{"$f":"Orders!A1435","v":0},{"$f":"VLOOKUP(A1435,'Product-tool'!A:B,2,0)","v":{"$error":"#N/A"}},{"$f":"Orders!B1435/VLOOKUP(B1435,Tools!A:C,3,0)","v":{"$error":"#N/A"}},{"$f":"Orders!C1435/VLOOKUP(B1435,Tools!A:C,3,0)","v":{"$error":"#N/A"}},{"$f":"Orders!D1435/VLOOKUP(B1435,Tools!A:C,3,0)","v":{"$error":"#N/A"}}]
[{"$f":"Orders!A1436","v":0},{"$f":"VLOOKUP(A1436,'Product-tool'!A:B,2,0)","v":{"$error":"#N/A"}},{"$f":"Orders!B1436/VLOOKUP(B1436,Tools!A:C,3,0)","v":{"$error":"#N/A"}},{"$f":"Orders!C1436/VLOOKUP(B1436,Tools!A:C,3,0)","v":{"$error":"#N/A"}},{"$f":"Orders!D1436/VLOOKUP(B1436,Tools!A:C,3,0)","v":{"$error":"#N/A"}}]
[{"$f":"Orders!A1437","v":0},{"$f":"VLOOKUP(A1437,'Product-tool'!A:B,2,0)","v":{"$error":"#N/A"}},{"$f":"Orders!B1437/VLOOKUP(B1437,Tools!A:C,3,0)","v":{"$error":"#N/A"}},{"$f":"Orders!C1437/VLOOKUP(B1437,Tools!A:C,3,0)","v":{"$error":"#N/A"}},{"$f":"Orders!D1437/VLOOKUP(B1437,Tools!A:C,3,0)","v":{"$error":"#N/A"}}]
[{"$f":"Orders!A1438","v":0},{"$f":"VLOOKUP(A1438,'Product-tool'!A:B,2,0)","v":{"$error":"#N/A"}},{"$f":"Orders!B1438/VLOOKUP(B1438,Tools!A:C,3,0)","v":{"$error":"#N/A"}},{"$f":"Orders!C1438/VLOOKUP(B1438,Tools!A:C,3,0)","v":{"$error":"#N/A"}},{"$f":"Orders!D1438/VLOOKUP(B1438,Tools!A:C,3,0)","v":{"$error":"#N/A"}}]
[{"$f":"Orders!A1439","v":0},{"$f":"VLOOKUP(A1439,'Product-tool'!A:B,2,0)","v":{"$error":"#N/A"}},{"$f":"Orders!B1439/VLOOKUP(B1439,Tools!A:C,3,0)","v":{"$error":"#N/A"}},{"$f":"Orders!C1439/VLOOKUP(B1439,Tools!A:C,3,0)","v":{"$error":"#N/A"}},{"$f":"Orders!D1439/VLOOKUP(B1439,Tools!A:C,3,0)","v":{"$error":"#N/A"}}]
[{"$f":"Orders!A1440","v":0},{"$f":"VLOOKUP(A1440,'Product-tool'!A:B,2,0)","v":{"$error":"#N/A"}},{"$f":"Orders!B1440/VLOOKUP(B1440,Tools!A:C,3,0)","v":{"$error":"#N/A"}},{"$f":"Orders!C1440/VLOOKUP(B1440,Tools!A:C,3,0)","v":{"$error":"#N/A"}},{"$f":"Orders!D1440/VLOOKUP(B1440,Tools!A:C,3,0)","v":{"$error":"#N/A"}}]
[{"$f":"Orders!A1441","v":0},{"$f":"VLOOKUP(A1441,'Product-tool'!A:B,2,0)","v":{"$error":"#N/A"}},{"$f":"Orders!B1441/VLOOKUP(B1441,Tools!A:C,3,0)","v":{"$error":"#N/A"}},{"$f":"Orders!C1441/VLOOKUP(B1441,Tools!A:C,3,0)","v":{"$error":"#N/A"}},{"$f":"Orders!D1441/VLOOKUP(B1441,Tools!A:C,3,0)","v":{"$error":"#N/A"}}]
[{"$f":"Orders!A1442","v":0},{"$f":"VLOOKUP(A1442,'Product-tool'!A:B,2,0)","v":{"$error":"#N/A"}},{"$f":"Orders!B1442/VLOOKUP(B1442,Tools!A:C,3,0)","v":{"$error":"#N/A"}},{"$f":"Orders!C1442/VLOOKUP(B1442,Tools!A:C,3,0)","v":{"$error":"#N/A"}},{"$f":"Orders!D1442/VLOOKUP(B1442,Tools!A:C,3,0)","v":{"$error":"#N/A"}}]
[{"$f":"Orders!A1443","v":0},{"$f":"VLOOKUP(A1443,'Product-tool'!A:B,2,0)","v":{"$error":"#N/A"}},{"$f":"Orders!B1443/VLOOKUP(B1443,Tools!A:C,3,0)","v":{"$error":"#N/A"}},{"$f":"Orders!C1443/VLOOKUP(B1443,Tools!A:C,3,0)","v":{"$error":"#N/A"}},{"$f":"Orders!D1443/VLOOKUP(B1443,Tools!A:C,3,0)","v":{"$error":"#N/A"}}]
[{"$f":"Orders!A1444","v":0},{"$f":"VLOOKUP(A1444,'Product-tool'!A:B,2,0)","v":{"$error":"#N/A"}},{"$f":"Orders!B1444/VLOOKUP(B1444,Tools!A:C,3,0)","v":{"$error":"#N/A"}},{"$f":"Orders!C1444/VLOOKUP(B1444,Tools!A:C,3,0)","v":{"$error":"#N/A"}},{"$f":"Orders!D1444/VLOOKUP(B1444,Tools!A:C,3,0)","v":{"$error":"#N/A"}}]
[{"$f":"Orders!A1445","v":0},{"$f":"VLOOKUP(A1445,'Product-tool'!A:B,2,0)","v":{"$error":"#N/A"}},{"$f":"Orders!B1445/VLOOKUP(B1445,Tools!A:C,3,0)","v":{"$error":"#N/A"}},{"$f":"Orders!C1445/VLOOKUP(B1445,Tools!A:C,3,0)","v":{"$error":"#N/A"}},{"$f":"Orders!D1445/VLOOKUP(B1445,Tools!A:C,3,0)","v":{"$error":"#N/A"}}]
[{"$f":"Orders!A1446","v":0},{"$f":"VLOOKUP(A1446,'Product-tool'!A:B,2,0)","v":{"$error":"#N/A"}},{"$f":"Orders!B1446/VLOOKUP(B1446,Tools!A:C,3,0)","v":{"$error":"#N/A"}},{"$f":"Orders!C1446/VLOOKUP(B1446,Tools!A:C,3,0)","v":{"$error":"#N/A"}},{"$f":"Orders!D1446/VLOOKUP(B1446,Tools!A:C,3,0)","v":{"$error":"#N/A"}}]
[{"$f":"Orders!A1447","v":0},{"$f":"VLOOKUP(A1447,'Product-tool'!A:B,2,0)","v":{"$error":"#N/A"}},{"$f":"Orders!B1447/VLOOKUP(B1447,Tools!A:C,3,0)","v":{"$error":"#N/A"}},{"$f":"Orders!C1447/VLOOKUP(B1447,Tools!A:C,3,0)","v":{"$error":"#N/A"}},{"$f":"Orders!D1447/VLOOKUP(B1447,Tools!A:C,3,0)","v":{"$error":"#N/A"}}]
[{"$f":"Orders!A1448","v":0},{"$f":"VLOOKUP(A1448,'Product-tool'!A:B,2,0)","v":{"$error":"#N/A"}},{"$f":"Orders!B1448/VLOOKUP(B1448,Tools!A:C,3,0)","v":{"$error":"#N/A"}},{"$f":"Orders!C1448/VLOOKUP(B1448,Tools!A:C,3,0)","v":{"$error":"#N/A"}},{"$f":"Orders!D1448/VLOOKUP(B1448,Tools!A:C,3,0)","v":{"$error":"#N/A"}}]
[{"$f":"Orders!A1449","v":0},{"$f":"VLOOKUP(A1449,'Product-tool'!A:B,2,0)","v":{"$error":"#N/A"}},{"$f":"Orders!B1449/VLOOKUP(B1449,Tools!A:C,3,0)","v":{"$error":"#N/A"}},{"$f":"Orders!C1449/VLOOKUP(B1449,Tools!A:C,3,0)","v":{"$error":"#N/A"}},{"$f":"Orders!D1449/VLOOKUP(B1449,Tools!A:C,3,0)","v":{"$error":"#N/A"}}]
[{"$f":"Orders!A1450","v":0},{"$f":"VLOOKUP(A1450,'Product-tool'!A:B,2,0)","v":{"$error":"#N/A"}},{"$f":"Orders!B1450/VLOOKUP(B1450,Tools!A:C,3,0)","v":{"$error":"#N/A"}},{"$f":"Orders!C1450/VLOOKUP(B1450,Tools!A:C,3,0)","v":{"$error":"#N/A"}},{"$f":"Orders!D1450/VLOOKUP(B1450,Tools!A:C,3,0)","v":{"$error":"#N/A"}}]
[{"$f":"Orders!A1451","v":0},{"$f":"VLOOKUP(A1451,'Product-tool'!A:B,2,0)","v":{"$error":"#N/A"}},{"$f":"Orders!B1451/VLOOKUP(B1451,Tools!A:C,3,0)","v":{"$error":"#N/A"}},{"$f":"Orders!C1451/VLOOKUP(B1451,Tools!A:C,3,0)","v":{"$error":"#N/A"}},{"$f":"Orders!D1451/VLOOKUP(B1451,Tools!A:C,3,0)","v":{"$error":"#N/A"}}]
[{"$f":"Orders!A1452","v":0},{"$f":"VLOOKUP(A1452,'Product-tool'!A:B,2,0)","v":{"$error":"#N/A"}},{"$f":"Orders!B1452/VLOOKUP(B1452,Tools!A:C,3,0)","v":{"$error":"#N/A"}},{"$f":"Orders!C1452/VLOOKUP(B1452,Tools!A:C,3,0)","v":{"$error":"#N/A"}},{"$f":"Orders!D1452/VLOOKUP(B1452,Tools!A:C,3,0)","v":{"$error":"#N/A"}}]
[{"$f":"Orders!A1453","v":0},{"$f":"VLOOKUP(A1453,'Product-tool'!A:B,2,0)","v":{"$error":"#N/A"}},{"$f":"Orders!B1453/VLOOKUP(B1453,Tools!A:C,3,0)","v":{"$error":"#N/A"}},{"$f":"Orders!C1453/VLOOKUP(B1453,Tools!A:C,3,0)","v":{"$error":"#N/A"}},{"$f":"Orders!D1453/VLOOKUP(B1453,Tools!A:C,3,0)","v":{"$error":"#N/A"}}]
[{"$f":"Orders!A1454","v":0},{"$f":"VLOOKUP(A1454,'Product-tool'!A:B,2,0)","v":{"$error":"#N/A"}},{"$f":"Orders!B1454/VLOOKUP(B1454,Tools!A:C,3,0)","v":{"$error":"#N/A"}},{"$f":"Orders!C1454/VLOOKUP(B1454,Tools!A:C,3,0)","v":{"$error":"#N/A"}},{"$f":"Orders!D1454/VLOOKUP(B1454,Tools!A:C,3,0)","v":{"$error":"#N/A"}}]
[{"$f":"Orders!A1455","v":0},{"$f":"VLOOKUP(A1455,'Product-tool'!A:B,2,0)","v":{"$error":"#N/A"}},{"$f":"Orders!B1455/VLOOKUP(B1455,Tools!A:C,3,0)","v":{"$error":"#N/A"}},{"$f":"Orders!C1455/VLOOKUP(B1455,Tools!A:C,3,0)","v":{"$error":"#N/A"}},{"$f":"Orders!D1455/VLOOKUP(B1455,Tools!A:C,3,0)","v":{"$error":"#N/A"}}]
[{"$f":"Orders!A1456","v":0},{"$f":"VLOOKUP(A1456,'Product-tool'!A:B,2,0)","v":{"$error":"#N/A"}},{"$f":"Orders!B1456/VLOOKUP(B1456,Tools!A:C,3,0)","v":{"$error":"#N/A"}},{"$f":"Orders!C1456/VLOOKUP(B1456,Tools!A:C,3,0)","v":{"$error":"#N/A"}},{"$f":"Orders!D1456/VLOOKUP(B1456,Tools!A:C,3,0)","v":{"$error":"#N/A"}}]
[{"$f":"Orders!A1457","v":0},{"$f":"VLOOKUP(A1457,'Product-tool'!A:B,2,0)","v":{"$error":"#N/A"}},{"$f":"Orders!B1457/VLOOKUP(B1457,Tools!A:C,3,0)","v":{"$error":"#N/A"}},{"$f":"Orders!C1457/VLOOKUP(B1457,Tools!A:C,3,0)","v":{"$error":"#N/A"}},{"$f":"Orders!D1457/VLOOKUP(B1457,Tools!A:C,3,0)","v":{"$error":"#N/A"}}]
[{"$f":"Orders!A1458","v":0},{"$f":"VLOOKUP(A1458,'Product-tool'!A:B,2,0)","v":{"$error":"#N/A"}},{"$f":"Orders!B1458/VLOOKUP(B1458,Tools!A:C,3,0)","v":{"$error":"#N/A"}},{"$f":"Orders!C1458/VLOOKUP(B1458,Tools!A:C,3,0)","v":{"$error":"#N/A"}},{"$f":"Orders!D1458/VLOOKUP(B1458,Tools!A:C,3,0)","v":{"$error":"#N/A"}}]
[{"$f":"Orders!A1459","v":0},{"$f":"VLOOKUP(A1459,'Product-tool'!A:B,2,0)","v":{"$error":"#N/A"}},{"$f":"Orders!B1459/VLOOKUP(B1459,Tools!A:C,3,0)","v":{"$error":"#N/A"}},{"$f":"Orders!C1459/VLOOKUP(B1459,Tools!A:C,3,0)","v":{"$error":"#N/A"}},{"$f":"Orders!D1459/VLOOKUP(B1459,Tools!A:C,3,0)","v":{"$error":"#N/A"}}]
[{"$f":"Orders!A1460","v":0},{"$f":"VLOOKUP(A1460,'Product-tool'!A:B,2,0)","v":{"$error":"#N/A"}},{"$f":"Orders!B1460/VLOOKUP(B1460,Tools!A:C,3,0)","v":{"$error":"#N/A"}},{"$f":"Orders!C1460/VLOOKUP(B1460,Tools!A:C,3,0)","v":{"$error":"#N/A"}},{"$f":"Orders!D1460/VLOOKUP(B1460,Tools!A:C,3,0)","v":{"$error":"#N/A"}}]
[{"$f":"Orders!A1461","v":0},{"$f":"VLOOKUP(A1461,'Product-tool'!A:B,2,0)","v":{"$error":"#N/A"}},{"$f":"Orders!B1461/VLOOKUP(B1461,Tools!A:C,3,0)","v":{"$error":"#N/A"}},{"$f":"Orders!C1461/VLOOKUP(B1461,Tools!A:C,3,0)","v":{"$error":"#N/A"}},{"$f":"Orders!D1461/VLOOKUP(B1461,Tools!A:C,3,0)","v":{"$error":"#N/A"}}]
[{"$f":"Orders!A1462","v":0},{"$f":"VLOOKUP(A1462,'Product-tool'!A:B,2,0)","v":{"$error":"#N/A"}},{"$f":"Orders!B1462/VLOOKUP(B1462,Tools!A:C,3,0)","v":{"$error":"#N/A"}},{"$f":"Orders!C1462/VLOOKUP(B1462,Tools!A:C,3,0)","v":{"$error":"#N/A"}},{"$f":"Orders!D1462/VLOOKUP(B1462,Tools!A:C,3,0)","v":{"$error":"#N/A"}}]
[{"$f":"Orders!A1463","v":0},{"$f":"VLOOKUP(A1463,'Product-tool'!A:B,2,0)","v":{"$error":"#N/A"}},{"$f":"Orders!B1463/VLOOKUP(B1463,Tools!A:C,3,0)","v":{"$error":"#N/A"}},{"$f":"Orders!C1463/VLOOKUP(B1463,Tools!A:C,3,0)","v":{"$error":"#N/A"}},{"$f":"Orders!D1463/VLOOKUP(B1463,Tools!A:C,3,0)","v":{"$error":"#N/A"}}]
[{"$f":"Orders!A1464","v":0},{"$f":"VLOOKUP(A1464,'Product-tool'!A:B,2,0)","v":{"$error":"#N/A"}},{"$f":"Orders!B1464/VLOOKUP(B1464,Tools!A:C,3,0)","v":{"$error":"#N/A"}},{"$f":"Orders!C1464/VLOOKUP(B1464,Tools!A:C,3,0)","v":{"$error":"#N/A"}},{"$f":"Orders!D1464/VLOOKUP(B1464,Tools!A:C,3,0)","v":{"$error":"#N/A"}}]
[{"$f":"Orders!A1465","v":0},{"$f":"VLOOKUP(A1465,'Product-tool'!A:B,2,0)","v":{"$error":"#N/A"}},{"$f":"Orders!B1465/VLOOKUP(B1465,Tools!A:C,3,0)","v":{"$error":"#N/A"}},{"$f":"Orders!C1465/VLOOKUP(B1465,Tools!A:C,3,0)","v":{"$error":"#N/A"}},{"$f":"Orders!D1465/VLOOKUP(B1465,Tools!A:C,3,0)","v":{"$error":"#N/A"}}]
[{"$f":"Orders!A1466","v":0},{"$f":"VLOOKUP(A1466,'Product-tool'!A:B,2,0)","v":{"$error":"#N/A"}},{"$f":"Orders!B1466/VLOOKUP(B1466,Tools!A:C,3,0)","v":{"$error":"#N/A"}},{"$f":"Orders!C1466/VLOOKUP(B1466,Tools!A:C,3,0)","v":{"$error":"#N/A"}},{"$f":"Orders!D1466/VLOOKUP(B1466,Tools!A:C,3,0)","v":{"$error":"#N/A"}}]
[{"$f":"Orders!A1467","v":0},{"$f":"VLOOKUP(A1467,'Product-tool'!A:B,2,0)","v":{"$error":"#N/A"}},{"$f":"Orders!B1467/VLOOKUP(B1467,Tools!A:C,3,0)","v":{"$error":"#N/A"}},{"$f":"Orders!C1467/VLOOKUP(B1467,Tools!A:C,3,0)","v":{"$error":"#N/A"}},{"$f":"Orders!D1467/VLOOKUP(B1467,Tools!A:C,3,0)","v":{"$error":"#N/A"}}]
[{"$f":"Orders!A1468","v":0},{"$f":"VLOOKUP(A1468,'Product-tool'!A:B,2,0)","v":{"$error":"#N/A"}},{"$f":"Orders!B1468/VLOOKUP(B1468,Tools!A:C,3,0)","v":{"$error":"#N/A"}},{"$f":"Orders!C1468/VLOOKUP(B1468,Tools!A:C,3,0)","v":{"$error":"#N/A"}},{"$f":"Orders!D1468/VLOOKUP(B1468,Tools!A:C,3,0)","v":{"$error":"#N/A"}}]
[{"$f":"Orders!A1469","v":0},{"$f":"VLOOKUP(A1469,'Product-tool'!A:B,2,0)","v":{"$error":"#N/A"}},{"$f":"Orders!B1469/VLOOKUP(B1469,Tools!A:C,3,0)","v":{"$error":"#N/A"}},{"$f":"Orders!C1469/VLOOKUP(B1469,Tools!A:C,3,0)","v":{"$error":"#N/A"}},{"$f":"Orders!D1469/VLOOKUP(B1469,Tools!A:C,3,0)","v":{"$error":"#N/A"}}]
[{"$f":"Orders!A1470","v":0},{"$f":"VLOOKUP(A1470,'Product-tool'!A:B,2,0)","v":{"$error":"#N/A"}},{"$f":"Orders!B1470/VLOOKUP(B1470,Tools!A:C,3,0)","v":{"$error":"#N/A"}},{"$f":"Orders!C1470/VLOOKUP(B1470,Tools!A:C,3,0)","v":{"$error":"#N/A"}},{"$f":"Orders!D1470/VLOOKUP(B1470,Tools!A:C,3,0)","v":{"$error":"#N/A"}}]
[{"$f":"Orders!A1471","v":0},{"$f":"VLOOKUP(A1471,'Product-tool'!A:B,2,0)","v":{"$error":"#N/A"}},{"$f":"Orders!B1471/VLOOKUP(B1471,Tools!A:C,3,0)","v":{"$error":"#N/A"}},{"$f":"Orders!C1471/VLOOKUP(B1471,Tools!A:C,3,0)","v":{"$error":"#N/A"}},{"$f":"Orders!D1471/VLOOKUP(B1471,Tools!A:C,3,0)","v":{"$error":"#N/A"}}]
[{"$f":"Orders!A1472","v":0},{"$f":"VLOOKUP(A1472,'Product-tool'!A:B,2,0)","v":{"$error":"#N/A"}},{"$f":"Orders!B1472/VLOOKUP(B1472,Tools!A:C,3,0)","v":{"$error":"#N/A"}},{"$f":"Orders!C1472/VLOOKUP(B1472,Tools!A:C,3,0)","v":{"$error":"#N/A"}},{"$f":"Orders!D1472/VLOOKUP(B1472,Tools!A:C,3,0)","v":{"$error":"#N/A"}}]
[{"$f":"Orders!A1473","v":0},{"$f":"VLOOKUP(A1473,'Product-tool'!A:B,2,0)","v":{"$error":"#N/A"}},{"$f":"Orders!B1473/VLOOKUP(B1473,Tools!A:C,3,0)","v":{"$error":"#N/A"}},{"$f":"Orders!C1473/VLOOKUP(B1473,Tools!A:C,3,0)","v":{"$error":"#N/A"}},{"$f":"Orders!D1473/VLOOKUP(B1473,Tools!A:C,3,0)","v":{"$error":"#N/A"}}]
[{"$f":"Orders!A1474","v":0},{"$f":"VLOOKUP(A1474,'Product-tool'!A:B,2,0)","v":{"$error":"#N/A"}},{"$f":"Orders!B1474/VLOOKUP(B1474,Tools!A:C,3,0)","v":{"$error":"#N/A"}},{"$f":"Orders!C1474/VLOOKUP(B1474,Tools!A:C,3,0)","v":{"$error":"#N/A"}},{"$f":"Orders!D1474/VLOOKUP(B1474,Tools!A:C,3,0)","v":{"$error":"#N/A"}}]
[{"$f":"Orders!A1475","v":0},{"$f":"VLOOKUP(A1475,'Product-tool'!A:B,2,0)","v":{"$error":"#N/A"}},{"$f":"Orders!B1475/VLOOKUP(B1475,Tools!A:C,3,0)","v":{"$error":"#N/A"}},{"$f":"Orders!C1475/VLOOKUP(B1475,Tools!A:C,3,0)","v":{"$error":"#N/A"}},{"$f":"Orders!D1475/VLOOKUP(B1475,Tools!A:C,3,0)","v":{"$error":"#N/A"}}]
[{"$f":"Orders!A1476","v":0},{"$f":"VLOOKUP(A1476,'Product-tool'!A:B,2,0)","v":{"$error":"#N/A"}},{"$f":"Orders!B1476/VLOOKUP(B1476,Tools!A:C,3,0)","v":{"$error":"#N/A"}},{"$f":"Orders!C1476/VLOOKUP(B1476,Tools!A:C,3,0)","v":{"$error":"#N/A"}},{"$f":"Orders!D1476/VLOOKUP(B1476,Tools!A:C,3,0)","v":{"$error":"#N/A"}}]
[{"$f":"Orders!A1477","v":0},{"$f":"VLOOKUP(A1477,'Product-tool'!A:B,2,0)","v":{"$error":"#N/A"}},{"$f":"Orders!B1477/VLOOKUP(B1477,Tools!A:C,3,0)","v":{"$error":"#N/A"}},{"$f":"Orders!C1477/VLOOKUP(B1477,Tools!A:C,3,0)","v":{"$error":"#N/A"}},{"$f":"Orders!D1477/VLOOKUP(B1477,Tools!A:C,3,0)","v":{"$error":"#N/A"}}]
[{"$f":"Orders!A1478","v":0},{"$f":"VLOOKUP(A1478,'Product-tool'!A:B,2,0)","v":{"$error":"#N/A"}},{"$f":"Orders!B1478/VLOOKUP(B1478,Tools!A:C,3,0)","v":{"$error":"#N/A"}},{"$f":"Orders!C1478/VLOOKUP(B1478,Tools!A:C,3,0)","v":{"$error":"#N/A"}},{"$f":"Orders!D1478/VLOOKUP(B1478,Tools!A:C,3,0)","v":{"$error":"#N/A"}}]
[{"$f":"Orders!A1479","v":0},{"$f":"VLOOKUP(A1479,'Product-tool'!A:B,2,0)","v":{"$error":"#N/A"}},{"$f":"Orders!B1479/VLOOKUP(B1479,Tools!A:C,3,0)","v":{"$error":"#N/A"}},{"$f":"Orders!C1479/VLOOKUP(B1479,Tools!A:C,3,0)","v":{"$error":"#N/A"}},{"$f":"Orders!D1479/VLOOKUP(B1479,Tools!A:C,3,0)","v":{"$error":"#N/A"}}]
[{"$f":"Orders!A1480","v":0},{"$f":"VLOOKUP(A1480,'Product-tool'!A:B,2,0)","v":{"$error":"#N/A"}},{"$f":"Orders!B1480/VLOOKUP(B1480,Tools!A:C,3,0)","v":{"$error":"#N/A"}},{"$f":"Orders!C1480/VLOOKUP(B1480,Tools!A:C,3,0)","v":{"$error":"#N/A"}},{"$f":"Orders!D1480/VLOOKUP(B1480,Tools!A:C,3,0)","v":{"$error":"#N/A"}}]
[{"$f":"Orders!A1481","v":0},{"$f":"VLOOKUP(A1481,'Product-tool'!A:B,2,0)","v":{"$error":"#N/A"}},{"$f":"Orders!B1481/VLOOKUP(B1481,Tools!A:C,3,0)","v":{"$error":"#N/A"}},{"$f":"Orders!C1481/VLOOKUP(B1481,Tools!A:C,3,0)","v":{"$error":"#N/A"}},{"$f":"Orders!D1481/VLOOKUP(B1481,Tools!A:C,3,0)","v":{"$error":"#N/A"}}]
[{"$f":"Orders!A1482","v":0},{"$f":"VLOOKUP(A1482,'Product-tool'!A:B,2,0)","v":{"$error":"#N/A"}},{"$f":"Orders!B1482/VLOOKUP(B1482,Tools!A:C,3,0)","v":{"$error":"#N/A"}},{"$f":"Orders!C1482/VLOOKUP(B1482,Tools!A:C,3,0)","v":{"$error":"#N/A"}},{"$f":"Orders!D1482/VLOOKUP(B1482,Tools!A:C,3,0)","v":{"$error":"#N/A"}}]
[{"$f":"Orders!A1483","v":0},{"$f":"VLOOKUP(A1483,'Product-tool'!A:B,2,0)","v":{"$error":"#N/A"}},{"$f":"Orders!B1483/VLOOKUP(B1483,Tools!A:C,3,0)","v":{"$error":"#N/A"}},{"$f":"Orders!C1483/VLOOKUP(B1483,Tools!A:C,3,0)","v":{"$error":"#N/A"}},{"$f":"Orders!D1483/VLOOKUP(B1483,Tools!A:C,3,0)","v":{"$error":"#N/A"}}]
[{"$f":"Orders!A1484","v":0},{"$f":"VLOOKUP(A1484,'Product-tool'!A:B,2,0)","v":{"$error":"#N/A"}},{"$f":"Orders!B1484/VLOOKUP(B1484,Tools!A:C,3,0)","v":{"$error":"#N/A"}},{"$f":"Orders!C1484/VLOOKUP(B1484,Tools!A:C,3,0)","v":{"$error":"#N/A"}},{"$f":"Orders!D1484/VLOOKUP(B1484,Tools!A:C,3,0)","v":{"$error":"#N/A"}}]
[{"$f":"Orders!A1485","v":0},{"$f":"VLOOKUP(A1485,'Product-tool'!A:B,2,0)","v":{"$error":"#N/A"}},{"$f":"Orders!B1485/VLOOKUP(B1485,Tools!A:C,3,0)","v":{"$error":"#N/A"}},{"$f":"Orders!C1485/VLOOKUP(B1485,Tools!A:C,3,0)","v":{"$error":"#N/A"}},{"$f":"Orders!D1485/VLOOKUP(B1485,Tools!A:C,3,0)","v":{"$error":"#N/A"}}]
[{"$f":"Orders!A1486","v":0},{"$f":"VLOOKUP(A1486,'Product-tool'!A:B,2,0)","v":{"$error":"#N/A"}},{"$f":"Orders!B1486/VLOOKUP(B1486,Tools!A:C,3,0)","v":{"$error":"#N/A"}},{"$f":"Orders!C1486/VLOOKUP(B1486,Tools!A:C,3,0)","v":{"$error":"#N/A"}},{"$f":"Orders!D1486/VLOOKUP(B1486,Tools!A:C,3,0)","v":{"$error":"#N/A"}}]
[{"$f":"Orders!A1487","v":0},{"$f":"VLOOKUP(A1487,'Product-tool'!A:B,2,0)","v":{"$error":"#N/A"}},{"$f":"Orders!B1487/VLOOKUP(B1487,Tools!A:C,3,0)","v":{"$error":"#N/A"}},{"$f":"Orders!C1487/VLOOKUP(B1487,Tools!A:C,3,0)","v":{"$error":"#N/A"}},{"$f":"Orders!D1487/VLOOKUP(B1487,Tools!A:C,3,0)","v":{"$error":"#N/A"}}]
[{"$f":"Orders!A1488","v":0},{"$f":"VLOOKUP(A1488,'Product-tool'!A:B,2,0)","v":{"$error":"#N/A"}},{"$f":"Orders!B1488/VLOOKUP(B1488,Tools!A:C,3,0)","v":{"$error":"#N/A"}},{"$f":"Orders!C1488/VLOOKUP(B1488,Tools!A:C,3,0)","v":{"$error":"#N/A"}},{"$f":"Orders!D1488/VLOOKUP(B1488,Tools!A:C,3,0)","v":{"$error":"#N/A"}}]
[{"$f":"Orders!A1489","v":0},{"$f":"VLOOKUP(A1489,'Product-tool'!A:B,2,0)","v":{"$error":"#N/A"}},{"$f":"Orders!B1489/VLOOKUP(B1489,Tools!A:C,3,0)","v":{"$error":"#N/A"}},{"$f":"Orders!C1489/VLOOKUP(B1489,Tools!A:C,3,0)","v":{"$error":"#N/A"}},{"$f":"Orders!D1489/VLOOKUP(B1489,Tools!A:C,3,0)","v":{"$error":"#N/A"}}]
[{"$f":"Orders!A1490","v":0},{"$f":"VLOOKUP(A1490,'Product-tool'!A:B,2,0)","v":{"$error":"#N/A"}},{"$f":"Orders!B1490/VLOOKUP(B1490,Tools!A:C,3,0)","v":{"$error":"#N/A"}},{"$f":"Orders!C1490/VLOOKUP(B1490,Tools!A:C,3,0)","v":{"$error":"#N/A"}},{"$f":"Orders!D1490/VLOOKUP(B1490,Tools!A:C,3,0)","v":{"$error":"#N/A"}}]
[{"$f":"Orders!A1491","v":0},{"$f":"VLOOKUP(A1491,'Product-tool'!A:B,2,0)","v":{"$error":"#N/A"}},{"$f":"Orders!B1491/VLOOKUP(B1491,Tools!A:C,3,0)","v":{"$error":"#N/A"}},{"$f":"Orders!C1491/VLOOKUP(B1491,Tools!A:C,3,0)","v":{"$error":"#N/A"}},{"$f":"Orders!D1491/VLOOKUP(B1491,Tools!A:C,3,0)","v":{"$error":"#N/A"}}]
[{"$f":"Orders!A1492","v":0},{"$f":"VLOOKUP(A1492,'Product-tool'!A:B,2,0)","v":{"$error":"#N/A"}},{"$f":"Orders!B1492/VLOOKUP(B1492,Tools!A:C,3,0)","v":{"$error":"#N/A"}},{"$f":"Orders!C1492/VLOOKUP(B1492,Tools!A:C,3,0)","v":{"$error":"#N/A"}},{"$f":"Orders!D1492/VLOOKUP(B1492,Tools!A:C,3,0)","v":{"$error":"#N/A"}}]
[{"$f":"Orders!A1493","v":0},{"$f":"VLOOKUP(A1493,'Product-tool'!A:B,2,0)","v":{"$error":"#N/A"}},{"$f":"Orders!B1493/VLOOKUP(B1493,Tools!A:C,3,0)","v":{"$error":"#N/A"}},{"$f":"Orders!C1493/VLOOKUP(B1493,Tools!A:C,3,0)","v":{"$error":"#N/A"}},{"$f":"Orders!D1493/VLOOKUP(B1493,Tools!A:C,3,0)","v":{"$error":"#N/A"}}]
[{"$f":"Orders!A1494","v":0},{"$f":"VLOOKUP(A1494,'Product-tool'!A:B,2,0)","v":{"$error":"#N/A"}},{"$f":"Orders!B1494/VLOOKUP(B1494,Tools!A:C,3,0)","v":{"$error":"#N/A"}},{"$f":"Orders!C1494/VLOOKUP(B1494,Tools!A:C,3,0)","v":{"$error":"#N/A"}},{"$f":"Orders!D1494/VLOOKUP(B1494,Tools!A:C,3,0)","v":{"$error":"#N/A"}}]
[{"$f":"Orders!A1495","v":0},{"$f":"VLOOKUP(A1495,'Product-tool'!A:B,2,0)","v":{"$error":"#N/A"}},{"$f":"Orders!B1495/VLOOKUP(B1495,Tools!A:C,3,0)","v":{"$error":"#N/A"}},{"$f":"Orders!C1495/VLOOKUP(B1495,Tools!A:C,3,0)","v":{"$error":"#N/A"}},{"$f":"Orders!D1495/VLOOKUP(B1495,Tools!A:C,3,0)","v":{"$error":"#N/A"}}]
[{"$f":"Orders!A1496","v":0},{"$f":"VLOOKUP(A1496,'Product-tool'!A:B,2,0)","v":{"$error":"#N/A"}},{"$f":"Orders!B1496/VLOOKUP(B1496,Tools!A:C,3,0)","v":{"$error":"#N/A"}},{"$f":"Orders!C1496/VLOOKUP(B1496,Tools!A:C,3,0)","v":{"$error":"#N/A"}},{"$f":"Orders!D1496/VLOOKUP(B1496,Tools!A:C,3,0)","v":{"$error":"#N/A"}}]
[{"$f":"Orders!A1497","v":0},{"$f":"VLOOKUP(A1497,'Product-tool'!A:B,2,0)","v":{"$error":"#N/A"}},{"$f":"Orders!B1497/VLOOKUP(B1497,Tools!A:C,3,0)","v":{"$error":"#N/A"}},{"$f":"Orders!C1497/VLOOKUP(B1497,Tools!A:C,3,0)","v":{"$error":"#N/A"}},{"$f":"Orders!D1497/VLOOKUP(B1497,Tools!A:C,3,0)","v":{"$error":"#N/A"}}]
[{"$f":"Orders!A1498","v":0},{"$f":"VLOOKUP(A1498,'Product-tool'!A:B,2,0)","v":{"$error":"#N/A"}},{"$f":"Orders!B1498/VLOOKUP(B1498,Tools!A:C,3,0)","v":{"$error":"#N/A"}},{"$f":"Orders!C1498/VLOOKUP(B1498,Tools!A:C,3,0)","v":{"$error":"#N/A"}},{"$f":"Orders!D1498/VLOOKUP(B1498,Tools!A:C,3,0)","v":{"$error":"#N/A"}}]
[{"$f":"Orders!A1499","v":0},{"$f":"VLOOKUP(A1499,'Product-tool'!A:B,2,0)","v":{"$error":"#N/A"}},{"$f":"Orders!B1499/VLOOKUP(B1499,Tools!A:C,3,0)","v":{"$error":"#N/A"}},{"$f":"Orders!C1499/VLOOKUP(B1499,Tools!A:C,3,0)","v":{"$error":"#N/A"}},{"$f":"Orders!D1499/VLOOKUP(B1499,Tools!A:C,3,0)","v":{"$error":"#N/A"}}]
[{"$f":"Orders!A1500","v":0},{"$f":"VLOOKUP(A1500,'Product-tool'!A:B,2,0)","v":{"$error":"#N/A"}},{"$f":"Orders!B1500/VLOOKUP(B1500,Tools!A:C,3,0)","v":{"$error":"#N/A"}},{"$f":"Orders!C1500/VLOOKUP(B1500,Tools!A:C,3,0)","v":{"$error":"#N/A"}},{"$f":"Orders!D1500/VLOOKUP(B1500,Tools!A:C,3,0)","v":{"$error":"#N/A"}}]

{"sheet":"Sum of needed tool time","index":5,"n_rows":21,"n_cols":4,"rows_kept":21,"cut":false,"hidden":false,"merged":[]}
[{"$f":"'Tool time needed per product'!B1","v":"Tool"},{"$f":"'Tool time needed per product'!C1","v":"Week1"},{"$f":"'Tool time needed per product'!D1","v":"Week2"},{"$f":"'Tool time needed per product'!E1","v":"Week3"}]
["Tool 1",{"$f":"SUMIF('Tool time needed per product'!B:B,A2,'Tool time needed per product'!C:C)","v":68.244166666666658},{"$f":"SUMIF('Tool time needed per product'!B:B,A2,'Tool time needed per product'!D:D)","v":69.318333333333328},{"$f":"SUMIF('Tool time needed per product'!B:B,A2,'Tool time needed per product'!E:E)","v":64.260833333333338}]
["Tool 2",{"$f":"SUMIF('Tool time needed per product'!B:B,A3,'Tool time needed per product'!C:C)","v":75.066153846153824},{"$f":"SUMIF('Tool time needed per product'!B:B,A3,'Tool time needed per product'!D:D)","v":88.54038461538461},{"$f":"SUMIF('Tool time needed per product'!B:B,A3,'Tool time needed per product'!E:E)","v":76.031923076923078}]
["Tool 3",{"$f":"SUMIF('Tool time needed per product'!B:B,A4,'Tool time needed per product'!C:C)","v":3.7175000000000007},{"$f":"SUMIF('Tool time needed per product'!B:B,A4,'Tool time needed per product'!D:D)","v":4.9474999999999998},{"$f":"SUMIF('Tool time needed per product'!B:B,A4,'Tool time needed per product'!E:E)","v":4.0108333333333333}]
["Tool 4",{"$f":"SUMIF('Tool time needed per product'!B:B,A5,'Tool time needed per product'!C:C)","v":96.226270805218164},{"$f":"SUMIF('Tool time needed per product'!B:B,A5,'Tool time needed per product'!D:D)","v":134.10166441745389},{"$f":"SUMIF('Tool time needed per product'!B:B,A5,'Tool time needed per product'!E:E)","v":89.91947818263607}]
["Tool 5",{"$f":"SUMIF('Tool time needed per product'!B:B,A6,'Tool time needed per product'!C:C)","v":89.605000000000004},{"$f":"SUMIF('Tool time needed per product'!B:B,A6,'Tool time needed per product'!D:D)","v":92.70750000000001},{"$f":"SUMIF('Tool time needed per product'!B:B,A6,'Tool time needed per product'!E:E)","v":85.110833333333318}]
["Tool 6",{"$f":"SUMIF('Tool time needed per product'!B:B,A7,'Tool time needed per product'!C:C)","v":7.8370689655172416},{"$f":"SUMIF('Tool time needed per product'!B:B,A7,'Tool time needed per product'!D:D)","v":11.674655172413793},{"$f":"SUMIF('Tool time needed per product'!B:B,A7,'Tool time needed per product'!E:E)","v":8.9948275862068972}]
["Tool 7",{"$f":"SUMIF('Tool time needed per product'!B:B,A8,'Tool time needed per product'!C:C)","v":9.3139062500000005},{"$f":"SUMIF('Tool time needed per product'!B:B,A8,'Tool time needed per product'!D:D)","v":8.6803124999999994},{"$f":"SUMIF('Tool time needed per product'!B:B,A8,'Tool time needed per product'!E:E)","v":8.4314062499999984}]
["Tool 8",{"$f":"SUMIF('Tool time needed per product'!B:B,A9,'Tool time needed per product'!C:C)","v":157.14285714285714},{"$f":"SUMIF('Tool time needed per product'!B:B,A9,'Tool time needed per product'!D:D)","v":205.55255102040823},{"$f":"SUMIF('Tool time needed per product'!B:B,A9,'Tool time needed per product'!E:E)","v":167.9433673469388}]
["Tool 9",{"$f":"SUMIF('Tool time needed per product'!B:B,A10,'Tool time needed per product'!C:C)","v":88.845833333333331},{"$f":"SUMIF('Tool time needed per product'!B:B,A10,'Tool time needed per product'!D:D)","v":115.00416666666666},{"$f":"SUMIF('Tool time needed per product'!B:B,A10,'Tool time needed per product'!E:E)","v":94.43125000000002}]
["Tool 10",{"$f":"SUMIF('Tool time needed per product'!B:B,A11,'Tool time needed per product'!C:C)","v":80.355483870967745},{"$f":"SUMIF('Tool time needed per product'!B:B,A11,'Tool time needed per product'!D:D)","v":104.60580645161291},{"$f":"SUMIF('Tool time needed per product'!B:B,A11,'Tool time needed per product'!E:E)","v":85.660645161290319}]
["Tool 11",{"$f":"SUMIF('Tool time needed per product'!B:B,A12,'Tool time needed per product'!C:C)","v":89.596948818897616},{"$f":"SUMIF('Tool time needed per product'!B:B,A12,'Tool time needed per product'!D:D)","v":116.04183070866138},{"$f":"SUMIF('Tool time needed per product'!B:B,A12,'Tool time needed per product'!E:E)","v":101.42125984251967}]
["Tool 12",{"$f":"SUMIF('Tool time needed per product'!B:B,A13,'Tool time needed per product'!C:C)","v":11.903749999999999},{"$f":"SUMIF('Tool time needed per product'!B:B,A13,'Tool time needed per product'!D:D)","v":15.058500000000002},{"$f":"SUMIF('Tool time needed per product'!B:B,A13,'Tool time needed per product'!E:E)","v":12.499749999999999}]
["Tool 13",{"$f":"SUMIF('Tool time needed per product'!B:B,A14,'Tool time needed per product'!C:C)","v":10.047083333333333},{"$f":"SUMIF('Tool time needed per product'!B:B,A14,'Tool time needed per product'!D:D)","v":9.0999999999999979},{"$f":"SUMIF('Tool time needed per product'!B:B,A14,'Tool time needed per product'!E:E)","v":8.9812500000000011}]
["Tool 14",{"$f":"SUMIF('Tool time needed per product'!B:B,A15,'Tool time needed per product'!C:C)","v":36.166956521739131},{"$f":"SUMIF('Tool time needed per product'!B:B,A15,'Tool time needed per product'!D:D)","v":47.391304347826079},{"$f":"SUMIF('Tool time needed per product'!B:B,A15,'Tool time needed per product'!E:E)","v":38.69130434782609}]
["Tool 15",{"$f":"SUMIF('Tool time needed per product'!B:B,A16,'Tool time needed per product'!C:C)","v":43.055227272727258},{"$f":"SUMIF('Tool time needed per product'!B:B,A16,'Tool time needed per product'!D:D)","v":51.584545454545456},{"$f":"SUMIF('Tool time needed per product'!B:B,A16,'Tool time needed per product'!E:E)","v":43.957727272727276}]
["Tool 16",{"$f":"SUMIF('Tool time needed per product'!B:B,A17,'Tool time needed per product'!C:C)","v":12.013088235294116},{"$f":"SUMIF('Tool time needed per product'!B:B,A17,'Tool time needed per product'!D:D)","v":14.047941176470589},{"$f":"SUMIF('Tool time needed per product'!B:B,A17,'Tool time needed per product'!E:E)","v":12.115}]
["Tool 17",{"$f":"SUMIF('Tool time needed per product'!B:B,A18,'Tool time needed per product'!C:C)","v":6.1295588235294138},{"$f":"SUMIF('Tool time needed per product'!B:B,A18,'Tool time needed per product'!D:D)","v":7.6916176470588242},{"$f":"SUMIF('Tool time needed per product'!B:B,A18,'Tool time needed per product'!E:E)","v":6.4091176470588236}]
["Tool 18",{"$f":"SUMIF('Tool time needed per product'!B:B,A19,'Tool time needed per product'!C:C)","v":150.13178571428571},{"$f":"SUMIF('Tool time needed per product'!B:B,A19,'Tool time needed per product'!D:D)","v":165.2178571428571},{"$f":"SUMIF('Tool time needed per product'!B:B,A19,'Tool time needed per product'!E:E)","v":146.90142857142851}]
["Tool 19",{"$f":"SUMIF('Tool time needed per product'!B:B,A20,'Tool time needed per product'!C:C)","v":49.354838709677423},{"$f":"SUMIF('Tool time needed per product'!B:B,A20,'Tool time needed per product'!D:D)","v":55.120869394177802},{"$f":"SUMIF('Tool time needed per product'!B:B,A20,'Tool time needed per product'!E:E)","v":48.643292682926827}]
["Tool 20",{"$f":"SUMIF('Tool time needed per product'!B:B,A21,'Tool time needed per product'!C:C)","v":33.610222294154184},{"$f":"SUMIF('Tool time needed per product'!B:B,A21,'Tool time needed per product'!D:D)","v":39.468414936467298},{"$f":"SUMIF('Tool time needed per product'!B:B,A21,'Tool time needed per product'!E:E)","v":33.965615661552675}]

{"sheet":"Tools loading","index":6,"n_rows":21,"n_cols":4,"rows_kept":21,"cut":false,"hidden":false,"merged":[]}
[{"$f":"'Tool time needed per product'!B1","v":"Tool"},{"$f":"'Tool time needed per product'!C1","v":"Week1"},{"$f":"'Tool time needed per product'!D1","v":"Week2"},{"$f":"'Tool time needed per product'!E1","v":"Week3"}]
["Tool 1",{"$f":"'Sum of needed tool time'!B2/'Tools avail'!B3","v":0.60372587330756722},{"$f":"'Sum of needed tool time'!C2/'Tools avail'!C3","v":0.61322854936893334},{"$f":"'Sum of needed tool time'!D2/'Tools avail'!D3","v":0.56848709008543385}]
["Tool2",{"$f":"'Sum of needed tool time'!B3/'Tools avail'!B4","v":1.0337554762839842},{"$f":"'Sum of needed tool time'!C3/'Tools avail'!C4","v":1.2193126033342623},{"$f":"'Sum of needed tool time'!D3/'Tools avail'!D4","v":1.0470553348751199}]
["Tool 3",{"$f":"'Sum of needed tool time'!B4/'Tools avail'!B5","v":3.9957841426754355E-2},{"$f":"'Sum of needed tool time'!C4/'Tools avail'!C5","v":5.3178593263985774E-2},{"$f":"'Sum of needed tool time'!D4/'Tools avail'!D5","v":4.3110757854061571E-2}]
["Tool 4",{"$f":"'Sum of needed tool time'!B5/'Tools avail'!B6","v":0.97289427098037029},{"$f":"'Sum of needed tool time'!C5/'Tools avail'!C6","v":1.3558328713035619},{"$f":"'Sum of needed tool time'!D5/'Tools avail'!D6","v":0.90912953854891609}]
["Tool 5",{"$f":"'Sum of needed tool time'!B6/'Tools avail'!B7","v":0.79269569136885298},{"$f":"'Sum of needed tool time'!C6/'Tools avail'!C7","v":0.8201421327780587},{"$f":"'Sum of needed tool time'!D6/'Tools avail'!D7","v":0.75293779222304413}]
["Tool 6",{"$f":"'Sum of needed tool time'!B7/'Tools avail'!B8","v":8.1487119241571357E-2},{"$f":"'Sum of needed tool time'!C7/'Tools avail'!C8","v":0.12138900682443121},{"$f":"'Sum of needed tool time'!D7/'Tools avail'!D8","v":9.3525090987411227E-2}]
["Tool 7",{"$f":"'Sum of needed tool time'!B8/'Tools avail'!B9","v":0.10421801611553329},{"$f":"'Sum of needed tool time'!C8/'Tools avail'!C9","v":9.7128414623334325E-2},{"$f":"'Sum of needed tool time'!D8/'Tools avail'!D9","v":9.4343276478556767E-2}]
["Tool 8",{"$f":"'Sum of needed tool time'!B9/'Tools avail'!B10","v":1.8148387758625739},{"$f":"'Sum of needed tool time'!C9/'Tools avail'!C10","v":2.3739210731683169},{"$f":"'Sum of needed tool time'!D9/'Tools avail'!D10","v":1.939573587700999}]
["Tool 9",{"$f":"'Sum of needed tool time'!B10/'Tools avail'!B11","v":0.77853369827545049},{"$f":"'Sum of needed tool time'!C10/'Tools avail'!C11","v":1.0077525960746945},{"$f":"'Sum of needed tool time'!D10/'Tools avail'!D11","v":0.82747730013908349}]
["Tool 10",{"$f":"'Sum of needed tool time'!B11/'Tools avail'!B12","v":0.68717424332248445},{"$f":"'Sum of needed tool time'!C11/'Tools avail'!C12","v":0.89455519938068995},{"$f":"'Sum of needed tool time'!D11/'Tools avail'!D12","v":0.73254227571757391}]
["Tool 11",{"$f":"'Sum of needed tool time'!B12/'Tools avail'!B13","v":0.99859757612538547},{"$f":"'Sum of needed tool time'!C12/'Tools avail'!C13","v":1.2933374674292546},{"$f":"'Sum of needed tool time'!D12/'Tools avail'!D13","v":1.1303847461484253}]
["Tool 12",{"$f":"'Sum of needed tool time'!B13/'Tools avail'!B14","v":0.12811976776528236},{"$f":"'Sum of needed tool time'!C13/'Tools avail'!C14","v":0.16207426423551444},{"$f":"'Sum of needed tool time'!D13/'Tools avail'!D14","v":0.13453450107101445}]
["Tool 13",{"$f":"'Sum of needed tool time'!B14/'Tools avail'!B15","v":0.13582136056684263},{"$f":"'Sum of needed tool time'!C14/'Tools avail'!C15","v":0.12301822729564311},{"$f":"'Sum of needed tool time'!D14/'Tools avail'!D15","v":0.12141290702186759}]
["Tool 14",{"$f":"'Sum of needed tool time'!B15/'Tools avail'!B16","v":0.37547652493551914},{"$f":"'Sum of needed tool time'!C15/'Tools avail'!C16","v":0.49200496751745021},{"$f":"'Sum of needed tool time'!D15/'Tools avail'!D16","v":0.40168368861814591}]
["Tool 15",{"$f":"'Sum of needed tool time'!B16/'Tools avail'!B17","v":0.49529883724229484},{"$f":"'Sum of needed tool time'!C16/'Tools avail'!C17","v":0.59341843027484886},{"$f":"'Sum of needed tool time'!D16/'Tools avail'!D17","v":0.50568101912649854}]
["Tool 16",{"$f":"'Sum of needed tool time'!B17/'Tools avail'!B18","v":0.12305550143926024},{"$f":"'Sum of needed tool time'!C17/'Tools avail'!C18","v":0.14389942134787762},{"$f":"'Sum of needed tool time'!D17/'Tools avail'!D18","v":0.12409942978331401}]
["Tool 17",{"$f":"'Sum of needed tool time'!B18/'Tools avail'!B19","v":6.0138859861691728E-2},{"$f":"'Sum of needed tool time'!C18/'Tools avail'!C19","v":7.5464667050839984E-2},{"$f":"'Sum of needed tool time'!D18/'Tools avail'!D19","v":6.2881691669879516E-2}]
["Tool 18",{"$f":"'Sum of needed tool time'!B19/'Tools avail'!B20","v":1.265038371067343},{"$f":"'Sum of needed tool time'!C19/'Tools avail'!C20","v":1.392156416956206},{"$f":"'Sum of needed tool time'!D19/'Tools avail'!D20","v":1.2378187805021386}]
["Tool 19",{"$f":"'Sum of needed tool time'!B20/'Tools avail'!B21","v":0.42331158694399179},{"$f":"'Sum of needed tool time'!C20/'Tools avail'!C21","v":0.47276626379505832},{"$f":"'Sum of needed tool time'!D20/'Tools avail'!D21","v":0.41720872680621918}]
["Tool 20",{"$f":"'Sum of needed tool time'!B21/'Tools avail'!B22","v":0.28827156381911168},{"$f":"'Sum of needed tool time'!C21/'Tools avail'!C22","v":0.33851670469837747},{"$f":"'Sum of needed tool time'!D21/'Tools avail'!D22","v":0.2913197377018748}]